1. 0.00 s $ /nix/store/9ypz3flqsrl5xl495mm8h645gadjsxi1-coreutils-9.11/bin/timeout --kill-after=15s 7200s /nix/store/23zk8sgzamrbmj1fday15szf7f2279s8-nix-2.34.7/bin/nix --extra-experimental-features nix-command --extra-experimental-features flakes flake clone git+https://github.com/alphal00p/gammaloop --dest /tmp/nix-ci-worker/stable-pwd/repo/
  2. 0.12 s Cloning into '/tmp/nix-ci-worker/stable-pwd/repo'...
  3. 0.87 s remote: Enumerating objects: 77128, done.
  4. 1.10 s remote: Counting objects: 0% (1/12971) remote: Counting objects: 1% (130/12971) remote: Counting objects: 2% (260/12971) remote: Counting objects: 3% (390/12971) remote: Counting objects: 4% (519/12971) remote: Counting objects: 5% (649/12971) remote: Counting objects: 6% (779/12971) remote: Counting objects: 7% (908/12971) remote: Counting objects: 8% (1038/12971) remote: Counting objects: 9% (1168/12971) remote: Counting objects: 10% (1298/12971) remote: Counting objects: 11% (1427/12971) remote: Counting objects: 12% (1557/12971) remote: Counting objects: 13% (1687/12971) remote: Counting objects: 14% (1816/12971) remote: Counting objects: 15% (1946/12971) remote: Counting objects: 16% (2076/12971) remote: Counting objects: 17% (2206/12971) remote: Counting objects: 18% (2335/12971) remote: Counting objects: 19% (2465/12971) remote: Counting objects: 20% (2595/12971) remote: Counting objects: 21% (2724/12971) remote: Counting objects: 22% (2854/12971) remote: Counting objects: 23% (2984/12971) remote: Counting objects: 24% (3114/12971) remote: Counting objects: 25% (3243/12971) remote: Counting objects: 26% (3373/12971) remote: Counting objects: 27% (3503/12971) remote: Counting objects: 28% (3632/12971) remote: Counting objects: 29% (3762/12971) remote: Counting objects: 30% (3892/12971) remote: Counting objects: 31% (4022/12971) remote: Counting objects: 32% (4151/12971) remote: Counting objects: 33% (4281/12971) remote: Counting objects: 34% (4411/12971) remote: Counting objects: 35% (4540/12971) remote: Counting objects: 36% (4670/12971) remote: Counting objects: 37% (4800/12971) remote: Counting objects: 38% (4929/12971) remote: Counting objects: 39% (5059/12971) remote: Counting objects: 40% (5189/12971) remote: Counting objects: 41% (5319/12971) remote: Counting objects: 42% (5448/12971) remote: Counting objects: 43% (5578/12971) remote: Counting objects: 44% (5708/12971) remote: Counting objects: 45% (5837/12971) remote: Counting objects: 46% (5967/12971) remote: Counting objects: 47% (6097/12971) remote: Counting objects: 48% (6227/12971) remote: Counting objects: 49% (6356/12971) remote: Counting objects: 50% (6486/12971) remote: Counting objects: 51% (6616/12971) remote: Counting objects: 52% (6745/12971) remote: Counting objects: 53% (6875/12971) remote: Counting objects: 54% (7005/12971) remote: Counting objects: 55% (7135/12971) remote: Counting objects: 56% (7264/12971) remote: Counting objects: 57% (7394/12971) remote: Counting objects: 58% (7524/12971) remote: Counting objects: 59% (7653/12971) remote: Counting objects: 60% (7783/12971) remote: Counting objects: 61% (7913/12971) remote: Counting objects: 62% (8043/12971) remote: Counting objects: 63% (8172/12971) remote: Counting objects: 64% (8302/12971) remote: Counting objects: 65% (8432/12971) remote: Counting objects: 66% (8561/12971) remote: Counting objects: 67% (8691/12971) remote: Counting objects: 68% (8821/12971) remote: Counting objects: 69% (8950/12971) remote: Counting objects: 70% (9080/12971) remote: Counting objects: 71% (9210/12971) remote: Counting objects: 72% (9340/12971) remote: Counting objects: 73% (9469/12971) remote: Counting objects: 74% (9599/12971) remote: Counting objects: 75% (9729/12971) remote: Counting objects: 76% (9858/12971) remote: Counting objects: 77% (9988/12971) remote: Counting objects: 78% (10118/12971) remote: Counting objects: 79% (10248/12971) remote: Counting objects: 80% (10377/12971) remote: Counting objects: 81% (10507/12971) remote: Counting objects: 82% (10637/12971) remote: Counting objects: 83% (10766/12971) remote: Counting objects: 84% (10896/12971) remote: Counting objects: 85% (11026/12971) remote: Counting objects: 86% (11156/12971) remote: Counting objects: 87% (11285/12971) remote: Counting objects: 88% (11415/12971) remote: Counting objects: 89% (11545/12971) remote: Counting objects: 90% (11674/12971) remote: Counting objects: 91% (11804/12971) remote: Counting objects: 92% (11934/12971) remote: Counting objects: 93% (12064/12971) remote: Counting objects: 94% (12193/12971) remote: Counting objects: 95% (12323/12971) remote: Counting objects: 96% (12453/12971) remote: Counting objects: 97% (12582/12971) remote: Counting objects: 98% (12712/12971) remote: Counting objects: 99% (12842/12971) remote: Counting objects: 100% (12971/12971) remote: Counting objects: 100% (12971/12971), done.
  5. 3.56 s remote: Compressing objects: 0% (1/2775) remote: Compressing objects: 1% (28/2775) remote: Compressing objects: 2% (56/2775) remote: Compressing objects: 3% (84/2775) remote: Compressing objects: 4% (111/2775) remote: Compressing objects: 5% (139/2775) remote: Compressing objects: 6% (167/2775) remote: Compressing objects: 7% (195/2775) remote: Compressing objects: 8% (222/2775) remote: Compressing objects: 9% (250/2775) remote: Compressing objects: 10% (278/2775) remote: Compressing objects: 11% (306/2775) remote: Compressing objects: 12% (333/2775) remote: Compressing objects: 13% (361/2775) remote: Compressing objects: 14% (389/2775) remote: Compressing objects: 15% (417/2775) remote: Compressing objects: 16% (444/2775) remote: Compressing objects: 17% (472/2775) remote: Compressing objects: 18% (500/2775) remote: Compressing objects: 19% (528/2775) remote: Compressing objects: 20% (555/2775) remote: Compressing objects: 21% (583/2775) remote: Compressing objects: 22% (611/2775) remote: Compressing objects: 23% (639/2775) remote: Compressing objects: 23% (650/2775) remote: Compressing objects: 24% (666/2775) remote: Compressing objects: 25% (694/2775) remote: Compressing objects: 26% (722/2775) remote: Compressing objects: 27% (750/2775) remote: Compressing objects: 28% (777/2775) remote: Compressing objects: 28% (784/2775) remote: Compressing objects: 29% (805/2775) remote: Compressing objects: 30% (833/2775) remote: Compressing objects: 31% (861/2775) remote: Compressing objects: 32% (888/2775) remote: Compressing objects: 33% (916/2775) remote: Compressing objects: 34% (944/2775) remote: Compressing objects: 35% (972/2775) remote: Compressing objects: 36% (999/2775) remote: Compressing objects: 37% (1027/2775) remote: Compressing objects: 38% (1055/2775) remote: Compressing objects: 39% (1083/2775) remote: Compressing objects: 40% (1110/2775) remote: Compressing objects: 41% (1138/2775) remote: Compressing objects: 42% (1166/2775) remote: Compressing objects: 43% (1194/2775) remote: Compressing objects: 44% (1221/2775) remote: Compressing objects: 45% (1249/2775) remote: Compressing objects: 46% (1277/2775) remote: Compressing objects: 47% (1305/2775) remote: Compressing objects: 48% (1332/2775) remote: Compressing objects: 49% (1360/2775) remote: Compressing objects: 50% (1388/2775) remote: Compressing objects: 51% (1416/2775) remote: Compressing objects: 52% (1443/2775) remote: Compressing objects: 53% (1471/2775) remote: Compressing objects: 54% (1499/2775) remote: Compressing objects: 55% (1527/2775) remote: Compressing objects: 56% (1554/2775) remote: Compressing objects: 57% (1582/2775) remote: Compressing objects: 58% (1610/2775) remote: Compressing objects: 59% (1638/2775) remote: Compressing objects: 60% (1665/2775) remote: Compressing objects: 61% (1693/2775) remote: Compressing objects: 62% (1721/2775) remote: Compressing objects: 63% (1749/2775) remote: Compressing objects: 64% (1776/2775) remote: Compressing objects: 65% (1804/2775) remote: Compressing objects: 66% (1832/2775) remote: Compressing objects: 67% (1860/2775) remote: Compressing objects: 68% (1887/2775) remote: Compressing objects: 69% (1915/2775) remote: Compressing objects: 70% (1943/2775) remote: Compressing objects: 71% (1971/2775) remote: Compressing objects: 72% (1998/2775) remote: Compressing objects: 73% (2026/2775) remote: Compressing objects: 74% (2054/2775) remote: Compressing objects: 75% (2082/2775) remote: Compressing objects: 76% (2109/2775) remote: Compressing objects: 77% (2137/2775) remote: Compressing objects: 78% (2165/2775) remote: Compressing objects: 79% (2193/2775) remote: Compressing objects: 80% (2220/2775) remote: Compressing objects: 81% (2248/2775) remote: Compressing objects: 82% (2276/2775) remote: Compressing objects: 83% (2304/2775) remote: Compressing objects: 84% (2331/2775) remote: Compressing objects: 85% (2359/2775) remote: Compressing objects: 86% (2387/2775) remote: Compressing objects: 87% (2415/2775) remote: Compressing objects: 88% (2442/2775) remote: Compressing objects: 89% (2470/2775) remote: Compressing objects: 90% (2498/2775) remote: Compressing objects: 91% (2526/2775) remote: Compressing objects: 92% (2553/2775) remote: Compressing objects: 93% (2581/2775) remote: Compressing objects: 94% (2609/2775) remote: Compressing objects: 95% (2637/2775) remote: Compressing objects: 96% (2664/2775) remote: Compressing objects: 97% (2692/2775) remote: Compressing objects: 98% (2720/2775) remote: Compressing objects: 99% (2748/2775) remote: Compressing objects: 100% (2775/2775) remote: Compressing objects: 100% (2775/2775), done.
  6. 7.15 s Receiving objects: 0% (1/77128) Receiving objects: 1% (772/77128) Receiving objects: 2% (1543/77128) Receiving objects: 3% (2314/77128) Receiving objects: 4% (3086/77128) Receiving objects: 5% (3857/77128) Receiving objects: 6% (4628/77128) Receiving objects: 7% (5399/77128) Receiving objects: 8% (6171/77128) Receiving objects: 9% (6942/77128) Receiving objects: 10% (7713/77128), 14.34 MiB | 28.67 MiB/s Receiving objects: 11% (8485/77128), 14.34 MiB | 28.67 MiB/s Receiving objects: 12% (9256/77128), 14.34 MiB | 28.67 MiB/s Receiving objects: 13% (10027/77128), 14.34 MiB | 28.67 MiB/s Receiving objects: 14% (10798/77128), 14.34 MiB | 28.67 MiB/s Receiving objects: 15% (11570/77128), 14.34 MiB | 28.67 MiB/s Receiving objects: 16% (12341/77128), 14.34 MiB | 28.67 MiB/s Receiving objects: 17% (13112/77128), 14.34 MiB | 28.67 MiB/s Receiving objects: 18% (13884/77128), 14.34 MiB | 28.67 MiB/s Receiving objects: 19% (14655/77128), 14.34 MiB | 28.67 MiB/s Receiving objects: 20% (15426/77128), 14.34 MiB | 28.67 MiB/s Receiving objects: 21% (16197/77128), 14.34 MiB | 28.67 MiB/s Receiving objects: 22% (16969/77128), 14.34 MiB | 28.67 MiB/s Receiving objects: 23% (17740/77128), 14.34 MiB | 28.67 MiB/s Receiving objects: 24% (18511/77128), 14.34 MiB | 28.67 MiB/s Receiving objects: 25% (19282/77128), 14.34 MiB | 28.67 MiB/s Receiving objects: 26% (20054/77128), 14.34 MiB | 28.67 MiB/s Receiving objects: 27% (20825/77128), 14.34 MiB | 28.67 MiB/s Receiving objects: 28% (21596/77128), 14.34 MiB | 28.67 MiB/s Receiving objects: 29% (22368/77128), 14.34 MiB | 28.67 MiB/s Receiving objects: 30% (23139/77128), 14.34 MiB | 28.67 MiB/s Receiving objects: 31% (23910/77128), 14.34 MiB | 28.67 MiB/s Receiving objects: 32% (24681/77128), 14.34 MiB | 28.67 MiB/s Receiving objects: 33% (25453/77128), 14.34 MiB | 28.67 MiB/s Receiving objects: 34% (26224/77128), 14.34 MiB | 28.67 MiB/s Receiving objects: 35% (26995/77128), 14.34 MiB | 28.67 MiB/s Receiving objects: 36% (27767/77128), 14.34 MiB | 28.67 MiB/s Receiving objects: 37% (28538/77128), 14.34 MiB | 28.67 MiB/s Receiving objects: 38% (29309/77128), 14.34 MiB | 28.67 MiB/s Receiving objects: 39% (30080/77128), 14.34 MiB | 28.67 MiB/s Receiving objects: 40% (30852/77128), 14.34 MiB | 28.67 MiB/s Receiving objects: 41% (31623/77128), 14.34 MiB | 28.67 MiB/s Receiving objects: 42% (32394/77128), 14.34 MiB | 28.67 MiB/s Receiving objects: 43% (33166/77128), 14.34 MiB | 28.67 MiB/s Receiving objects: 44% (33937/77128), 14.34 MiB | 28.67 MiB/s Receiving objects: 44% (34065/77128), 32.91 MiB | 32.12 MiB/s Receiving objects: 45% (34708/77128), 32.91 MiB | 32.12 MiB/s Receiving objects: 46% (35479/77128), 32.91 MiB | 32.12 MiB/s Receiving objects: 47% (36251/77128), 32.91 MiB | 32.12 MiB/s Receiving objects: 48% (37022/77128), 32.91 MiB | 32.12 MiB/s Receiving objects: 49% (37793/77128), 32.91 MiB | 32.12 MiB/s Receiving objects: 50% (38564/77128), 32.91 MiB | 32.12 MiB/s Receiving objects: 51% (39336/77128), 32.91 MiB | 32.12 MiB/s Receiving objects: 52% (40107/77128), 32.91 MiB | 32.12 MiB/s Receiving objects: 53% (40878/77128), 32.91 MiB | 32.12 MiB/s Receiving objects: 54% (41650/77128), 32.91 MiB | 32.12 MiB/s Receiving objects: 55% (42421/77128), 32.91 MiB | 32.12 MiB/s Receiving objects: 56% (43192/77128), 50.64 MiB | 33.11 MiB/s Receiving objects: 57% (43963/77128), 50.64 MiB | 33.11 MiB/s Receiving objects: 58% (44735/77128), 50.64 MiB | 33.11 MiB/s Receiving objects: 59% (45506/77128), 50.64 MiB | 33.11 MiB/s Receiving objects: 60% (46277/77128), 50.64 MiB | 33.11 MiB/s Receiving objects: 61% (47049/77128), 50.64 MiB | 33.11 MiB/s Receiving objects: 62% (47820/77128), 50.64 MiB | 33.11 MiB/s Receiving objects: 63% (48591/77128), 50.64 MiB | 33.11 MiB/s Receiving objects: 63% (48902/77128), 66.28 MiB | 32.36 MiB/s Receiving objects: 64% (49362/77128), 66.28 MiB | 32.36 MiB/s Receiving objects: 65% (50134/77128), 66.28 MiB | 32.36 MiB/s Receiving objects: 66% (50905/77128), 66.28 MiB | 32.36 MiB/s Receiving objects: 67% (51676/77128), 66.28 MiB | 32.36 MiB/s Receiving objects: 68% (52448/77128), 66.28 MiB | 32.36 MiB/s Receiving objects: 69% (53219/77128), 66.28 MiB | 32.36 MiB/s Receiving objects: 70% (53990/77128), 66.28 MiB | 32.36 MiB/s Receiving objects: 71% (54761/77128), 66.28 MiB | 32.36 MiB/s Receiving objects: 72% (55533/77128), 66.28 MiB | 32.36 MiB/s Receiving objects: 73% (56304/77128), 66.28 MiB | 32.36 MiB/s Receiving objects: 74% (57075/77128), 66.28 MiB | 32.36 MiB/s Receiving objects: 75% (57846/77128), 66.28 MiB | 32.36 MiB/s Receiving objects: 76% (58618/77128), 84.18 MiB | 33.03 MiB/s Receiving objects: 77% (59389/77128), 84.18 MiB | 33.03 MiB/s Receiving objects: 78% (60160/77128), 84.18 MiB | 33.03 MiB/s Receiving objects: 79% (60932/77128), 84.18 MiB | 33.03 MiB/s Receiving objects: 80% (61703/77128), 84.18 MiB | 33.03 MiB/s Receiving objects: 81% (62474/77128), 84.18 MiB | 33.03 MiB/s Receiving objects: 81% (62859/77128), 84.18 MiB | 33.03 MiB/s Receiving objects: 82% (63245/77128), 84.18 MiB | 33.03 MiB/s Receiving objects: 83% (64017/77128), 100.89 MiB | 32.83 MiB/s Receiving objects: 84% (64788/77128), 100.89 MiB | 32.83 MiB/s Receiving objects: 85% (65559/77128), 100.89 MiB | 32.83 MiB/s Receiving objects: 86% (66331/77128), 100.89 MiB | 32.83 MiB/s Receiving objects: 87% (67102/77128), 100.89 MiB | 32.83 MiB/s Receiving objects: 88% (67873/77128), 100.89 MiB | 32.83 MiB/s Receiving objects: 89% (68644/77128), 100.89 MiB | 32.83 MiB/s Receiving objects: 90% (69416/77128), 100.89 MiB | 32.83 MiB/s Receiving objects: 91% (70187/77128), 100.89 MiB | 32.83 MiB/s Receiving objects: 92% (70958/77128), 100.89 MiB | 32.83 MiB/s Receiving objects: 93% (71730/77128), 100.89 MiB | 32.83 MiB/s Receiving objects: 94% (72501/77128), 100.89 MiB | 32.83 MiB/s Receiving objects: 95% (73272/77128), 100.89 MiB | 32.83 MiB/s Receiving objects: 96% (74043/77128), 100.89 MiB | 32.83 MiB/s Receiving objects: 97% (74815/77128), 100.89 MiB | 32.83 MiB/s Receiving objects: 98% (75586/77128), 100.89 MiB | 32.83 MiB/s Receiving objects: 99% (76357/77128), 118.77 MiB | 33.25 MiB/s remote: Total 77128 (delta 9347), reused 10916 (delta 8362), pack-reused 64157 (from 2)
  7. 7.15 s Receiving objects: 100% (77128/77128), 118.77 MiB | 33.25 MiB/s Receiving objects: 100% (77128/77128), 119.49 MiB | 33.34 MiB/s, done.
  8. 8.04 s Resolving deltas: 0% (0/52645) Resolving deltas: 1% (527/52645) Resolving deltas: 2% (1055/52645) Resolving deltas: 3% (1580/52645) Resolving deltas: 4% (2106/52645) Resolving deltas: 5% (2633/52645) Resolving deltas: 6% (3159/52645) Resolving deltas: 7% (3686/52645) Resolving deltas: 8% (4213/52645) Resolving deltas: 9% (4739/52645) Resolving deltas: 10% (5265/52645) Resolving deltas: 11% (5792/52645) Resolving deltas: 12% (6318/52645) Resolving deltas: 13% (6844/52645) Resolving deltas: 14% (7371/52645) Resolving deltas: 15% (7897/52645) Resolving deltas: 16% (8424/52645) Resolving deltas: 17% (8950/52645) Resolving deltas: 18% (9478/52645) Resolving deltas: 19% (10004/52645) Resolving deltas: 20% (10530/52645) Resolving deltas: 21% (11056/52645) Resolving deltas: 22% (11582/52645) Resolving deltas: 23% (12109/52645) Resolving deltas: 24% (12635/52645) Resolving deltas: 25% (13162/52645) Resolving deltas: 26% (13688/52645) Resolving deltas: 27% (14215/52645) Resolving deltas: 28% (14741/52645) Resolving deltas: 29% (15268/52645) Resolving deltas: 30% (15794/52645) Resolving deltas: 31% (16322/52645) Resolving deltas: 32% (16847/52645) Resolving deltas: 33% (17375/52645) Resolving deltas: 34% (17900/52645) Resolving deltas: 35% (18426/52645) Resolving deltas: 36% (18953/52645) Resolving deltas: 37% (19479/52645) Resolving deltas: 38% (20006/52645) Resolving deltas: 39% (20532/52645) Resolving deltas: 40% (21059/52645) Resolving deltas: 41% (21585/52645) Resolving deltas: 42% (22112/52645) Resolving deltas: 43% (22638/52645) Resolving deltas: 44% (23164/52645) Resolving deltas: 45% (23691/52645) Resolving deltas: 46% (24217/52645) Resolving deltas: 47% (24745/52645) Resolving deltas: 48% (25270/52645) Resolving deltas: 49% (25798/52645) Resolving deltas: 50% (26323/52645) Resolving deltas: 51% (26849/52645) Resolving deltas: 52% (27380/52645) Resolving deltas: 53% (27903/52645) Resolving deltas: 54% (28429/52645) Resolving deltas: 55% (28955/52645) Resolving deltas: 56% (29482/52645) Resolving deltas: 57% (30008/52645) Resolving deltas: 58% (30535/52645) Resolving deltas: 59% (31061/52645) Resolving deltas: 60% (31587/52645) Resolving deltas: 61% (32114/52645) Resolving deltas: 62% (32640/52645) Resolving deltas: 63% (33167/52645) Resolving deltas: 64% (33693/52645) Resolving deltas: 65% (34221/52645) Resolving deltas: 66% (34746/52645) Resolving deltas: 67% (35273/52645) Resolving deltas: 68% (35799/52645) Resolving deltas: 69% (36326/52645) Resolving deltas: 70% (36852/52645) Resolving deltas: 71% (37379/52645) Resolving deltas: 72% (37905/52645) Resolving deltas: 73% (38431/52645) Resolving deltas: 74% (38958/52645) Resolving deltas: 75% (39484/52645) Resolving deltas: 76% (40012/52645) Resolving deltas: 77% (40537/52645) Resolving deltas: 78% (41064/52645) Resolving deltas: 79% (41590/52645) Resolving deltas: 80% (42118/52645) Resolving deltas: 81% (42645/52645) Resolving deltas: 82% (43171/52645) Resolving deltas: 83% (43696/52645) Resolving deltas: 84% (44222/52645) Resolving deltas: 85% (44750/52645) Resolving deltas: 86% (45275/52645) Resolving deltas: 87% (45803/52645) Resolving deltas: 88% (46329/52645) Resolving deltas: 89% (46855/52645) Resolving deltas: 90% (47381/52645) Resolving deltas: 91% (47907/52645) Resolving deltas: 92% (48434/52645) Resolving deltas: 93% (48960/52645) Resolving deltas: 94% (49489/52645) Resolving deltas: 95% (50013/52645) Resolving deltas: 96% (50542/52645) Resolving deltas: 97% (51068/52645) Resolving deltas: 98% (51593/52645) Resolving deltas: 99% (52119/52645) Resolving deltas: 100% (52645/52645) Resolving deltas: 100% (52645/52645), done.
  9. 8.41 s Fetching commit 509bcc282222aff4015c291e6846ce47e83f1919 for docs ...
  10. 8.41 s $ /nix/store/bcnisk3ydfgv26v2gw3zlky24g00yww2-git-2.54.0/bin/git fetch origin 509bcc282222aff4015c291e6846ce47e83f1919
  11. 8.86 s From https://github.com/alphal00p/gammaloop
  12. 8.86 s * branch 509bcc282222aff4015c291e6846ce47e83f1919 -> FETCH_HEAD
  13. 8.87 s $ /nix/store/9ypz3flqsrl5xl495mm8h645gadjsxi1-coreutils-9.11/bin/timeout --kill-after=15s 7200s /nix/store/bcnisk3ydfgv26v2gw3zlky24g00yww2-git-2.54.0/bin/git -c advice.detachedHead=false checkout 509bcc282222aff4015c291e6846ce47e83f1919
  14. 9.08 s HEAD is now at 509bcc282 fix docs CI and Pages publication
  15. 9.08 s $ /nix/store/9ypz3flqsrl5xl495mm8h645gadjsxi1-coreutils-9.11/bin/timeout --kill-after=15s 7200s /nix/store/23zk8sgzamrbmj1fday15szf7f2279s8-nix-2.34.7/bin/nix --extra-experimental-features nix-command --extra-experimental-features flakes --log-format internal-json run .#packages.x86_64-linux.nix-ci-check-gammaloop-nextest-docs --print-build-logs
  16. 9.31 s stdenv.isDarwin is deprecated, use stdenv.hostPlatform.isDarwin instead
  17. 13.55 s
  18. 14.04 s evaluating derivation 'gevaluation warning: stdenv.isDarwin is deprecated, use stdenv.hostPlatform.isDarwin instead
  19. 21.40 s copying '/nix/store/j9kx evaluating derivation 'g copying '/nix/store/j9kx evaluating derivation 'g copying '/nix/store/j9kx evaluating derivation 'g copying '/nix/store/j9kx evaluating derivation 'g copying '/nix/store/j9kx evaluating derivation 'g copying '/nix/store/j9kx evaluating derivation 'g querying gammaloop-nexte [0.0 KiB DL] querying in [15.5 KiB DL] querying p [0/2 built, 16/0/42 copi [0/2 built, 7/24/42 copi [0/2 built, 7/31/42 copi [0/2 built, 3/38/42 copi [0/2 built, 1/40/42 copi [0/2 built, 1/41/42 copi [0/1 built, 42 copied (2 [1/0/1 built, 42 copied gammaloop-nextest-docs> Extracting 2 binaries to /build/nextest-archive-9T267b
  20. 21.45 s gammaloop-nextest-docs> Extracted 5 files to /build/nextest-archive-9T267b in 0.05s
  21. 21.46 s gammaloop-nextest-docs> ------------
  22. 21.46 s gammaloop-nextest-docs> Nextest run ID fb459d40-a54d-4f6e-b467-c223c765a54b with nextest profile: ci_gammaloop
  23. 21.46 s gammaloop-nextest-docs> Starting 119 tests across 2 binaries
  24. 21.48 s gammaloop-nextest-docs> FAIL [ 0.013s] ( 25/119) alphal00p-docs-builder tests::developer_architecture_is_classified_searchable_and_source_backed
  25. 21.48 s gammaloop-nextest-docs> stdout ---
  26. 21.48 s gammaloop-nextest-docs>
  27. 21.48 s gammaloop-nextest-docs> running 1 test
  28. 21.48 s gammaloop-nextest-docs> test tests::developer_architecture_is_classified_searchable_and_source_backed ... FAILED
  29. 21.48 s gammaloop-nextest-docs>
  30. 21.48 s gammaloop-nextest-docs> failures:
  31. 21.48 s gammaloop-nextest-docs>
  32. 21.48 s gammaloop-nextest-docs> failures:
  33. 21.48 s gammaloop-nextest-docs> tests::developer_architecture_is_classified_searchable_and_source_backed
  34. 21.48 s gammaloop-nextest-docs>
  35. 21.48 s gammaloop-nextest-docs> test result: FAILED. 0 passed; 1 failed; 0 ignored; 0 measured; 118 filtered out; finished in 0.01s
  36. 21.48 s gammaloop-nextest-docs>
  37. 21.48 s gammaloop-nextest-docs> stderr ---
  38. 21.48 s gammaloop-nextest-docs>
  39. 21.48 s gammaloop-nextest-docs> thread 'tests::developer_architecture_is_classified_searchable_and_source_backed' (248) panicked at crates/alphal00p-docs-builder/src/lib.rs:12354:14:
  40. 21.48 s gammaloop-nextest-docs> called `Result::unwrap()` on an `Err` value: cannot determine the documented Git commit; set ALPHAL00P_DOCS_GIT_COMMIT
  41. 21.48 s gammaloop-nextest-docs>
  42. 21.48 s gammaloop-nextest-docs> Location:
  43. 21.48 s gammaloop-nextest-docs> crates/alphal00p-docs-builder/src/lib.rs:4137:9
  44. 21.48 s gammaloop-nextest-docs> stack backtrace:
  45. 21.48 s gammaloop-nextest-docs> 0: __rustc::rust_begin_unwind
  46. 21.48 s gammaloop-nextest-docs> 1: core::panicking::panic_fmt
  47. 21.48 s gammaloop-nextest-docs> 2: core::result::unwrap_failed
  48. 21.48 s gammaloop-nextest-docs> 3: alphal00p_docs_builder::tests::developer_architecture_is_classified_searchable_and_source_backed
  49. 21.48 s gammaloop-nextest-docs> 4: <alphal00p_docs_builder::tests::developer_architecture_is_classified_searchable_and_source_backed::{closure#0} as core::ops::function::FnOnce<()>>::call_once
  50. 21.48 s gammaloop-nextest-docs> note: Some details are omitted, run with `RUST_BACKTRACE=full` for a verbose backtrace.
  51. 21.48 s gammaloop-nextest-docs>
  52. 21.51 s gammaloop-nextest-docs> FAIL [ 0.007s] ( 46/119) alphal00p-docs-builder tests::persistent_rustdoc_target_rejects_symlink_escape
  53. 21.51 s gammaloop-nextest-docs> stdout ---
  54. 21.51 s gammaloop-nextest-docs>
  55. 21.51 s gammaloop-nextest-docs> running 1 test
  56. 21.51 s gammaloop-nextest-docs> test tests::persistent_rustdoc_target_rejects_symlink_escape ... FAILED
  57. 21.51 s gammaloop-nextest-docs>
  58. 21.51 s gammaloop-nextest-docs> failures:
  59. 21.51 s gammaloop-nextest-docs>
  60. 21.51 s gammaloop-nextest-docs> failures:
  61. 21.51 s gammaloop-nextest-docs> tests::persistent_rustdoc_target_rejects_symlink_escape
  62. 21.51 s gammaloop-nextest-docs>
  63. 21.51 s gammaloop-nextest-docs> test result: FAILED. 0 passed; 1 failed; 0 ignored; 0 measured; 118 filtered out; finished in 0.00s
  64. 21.51 s gammaloop-nextest-docs>
  65. 21.51 s gammaloop-nextest-docs> stderr ---
  66. 21.51 s gammaloop-nextest-docs>
  67. 21.51 s gammaloop-nextest-docs> thread 'tests::persistent_rustdoc_target_rejects_symlink_escape' (350) panicked at crates/alphal00p-docs-builder/src/lib.rs:10490:82:
  68. 21.51 s gammaloop-nextest-docs> called `Result::unwrap_err()` on an `Ok` value: "/build/.tmpP0jBmQ/escape/cache/cargo-target-v1"
  69. 21.51 s gammaloop-nextest-docs> stack backtrace:
  70. 21.51 s gammaloop-nextest-docs> 0: __rustc::rust_begin_unwind
  71. 21.51 s gammaloop-nextest-docs> 1: core::panicking::panic_fmt
  72. 21.51 s gammaloop-nextest-docs> 2: core::result::unwrap_failed
  73. 21.51 s gammaloop-nextest-docs> 3: alphal00p_docs_builder::tests::persistent_rustdoc_target_rejects_symlink_escape
  74. 21.51 s gammaloop-nextest-docs> 4: <alphal00p_docs_builder::tests::persistent_rustdoc_target_rejects_symlink_escape::{closure#0} as core::ops::function::FnOnce<()>>::call_once
  75. 21.51 s gammaloop-nextest-docs> note: Some details are omitted, run with `RUST_BACKTRACE=full` for a verbose backtrace.
  76. 21.51 s gammaloop-nextest-docs>
  77. 21.51 s gammaloop-nextest-docs> FAIL [ 0.007s] ( 47/119) alphal00p-docs-builder tests::persistent_rustdoc_targets_reject_workspace_and_arbitrary_roots
  78. 21.51 s gammaloop-nextest-docs> stdout ---
  79. 21.51 s gammaloop-nextest-docs>
  80. 21.51 s gammaloop-nextest-docs> running 1 test
  81. 21.51 s gammaloop-nextest-docs> test tests::persistent_rustdoc_targets_reject_workspace_and_arbitrary_roots ... FAILED
  82. 21.51 s gammaloop-nextest-docs>
  83. 21.51 s gammaloop-nextest-docs> failures:
  84. 21.51 s gammaloop-nextest-docs>
  85. 21.51 s gammaloop-nextest-docs> failures:
  86. 21.51 s gammaloop-nextest-docs> tests::persistent_rustdoc_targets_reject_workspace_and_arbitrary_roots
  87. 21.51 s gammaloop-nextest-docs>
  88. 21.51 s gammaloop-nextest-docs> test result: FAILED. 0 passed; 1 failed; 0 ignored; 0 measured; 118 filtered out; finished in 0.00s
  89. 21.51 s gammaloop-nextest-docs>
  90. 21.51 s gammaloop-nextest-docs> stderr ---
  91. 21.51 s gammaloop-nextest-docs>
  92. 21.51 s gammaloop-nextest-docs> thread 'tests::persistent_rustdoc_targets_reject_workspace_and_arbitrary_roots' (356) panicked at crates/alphal00p-docs-builder/src/lib.rs:10467:9:
  93. 21.51 s gammaloop-nextest-docs> assertion failed: prepare_persistent_rustdoc_target(workspace, &arbitrary).is_err()
  94. 21.51 s gammaloop-nextest-docs> stack backtrace:
  95. 21.51 s gammaloop-nextest-docs> 0: __rustc::rust_begin_unwind
  96. 21.51 s gammaloop-nextest-docs> 1: core::panicking::panic_fmt
  97. 21.51 s gammaloop-nextest-docs> 2: core::panicking::panic
  98. 21.51 s gammaloop-nextest-docs> 3: alphal00p_docs_builder::tests::persistent_rustdoc_targets_reject_workspace_and_arbitrary_roots
  99. 21.51 s gammaloop-nextest-docs> 4: <alphal00p_docs_builder::tests::persistent_rustdoc_targets_reject_workspace_and_arbitrary_roots::{closure#0} as core::ops::function::FnOnce<()>>::call_once
  100. 21.51 s gammaloop-nextest-docs> note: Some details are omitted, run with `RUST_BACKTRACE=full` for a verbose backtrace.
  101. 21.51 s gammaloop-nextest-docs>
  102. 21.56 s gammaloop-nextest-docs> FAIL [ 0.063s] ( 68/119) alphal00p-docs-builder tests::portal_and_developer_pages_use_federated_search_and_feedback
  103. 21.56 s gammaloop-nextest-docs> stdout ---
  104. 21.56 s gammaloop-nextest-docs>
  105. 21.56 s gammaloop-nextest-docs> running 1 test
  106. 21.56 s gammaloop-nextest-docs> test tests::portal_and_developer_pages_use_federated_search_and_feedback ... FAILED
  107. 21.56 s gammaloop-nextest-docs>
  108. 21.56 s gammaloop-nextest-docs> failures:
  109. 21.56 s gammaloop-nextest-docs>
  110. 21.56 s gammaloop-nextest-docs> failures:
  111. 21.56 s gammaloop-nextest-docs> tests::portal_and_developer_pages_use_federated_search_and_feedback
  112. 21.56 s gammaloop-nextest-docs>
  113. 21.56 s gammaloop-nextest-docs> test result: FAILED. 0 passed; 1 failed; 0 ignored; 0 measured; 118 filtered out; finished in 0.06s
  114. 21.56 s gammaloop-nextest-docs>
  115. 21.56 s gammaloop-nextest-docs> stderr ---
  116. 21.56 s gammaloop-nextest-docs> warning: bundle export is experimental
  117. 21.56 s gammaloop-nextest-docs> = hint: its behaviour may change at any time
  118. 21.56 s gammaloop-nextest-docs> = hint: do not rely on this feature for production use cases
  119. 21.56 s gammaloop-nextest-docs>
  120. 21.56 s gammaloop-nextest-docs>
  121. 21.56 s gammaloop-nextest-docs> thread 'tests::portal_and_developer_pages_use_federated_search_and_feedback' (353) panicked at crates/alphal00p-docs-builder/src/lib.rs:12758:14:
  122. 21.56 s gammaloop-nextest-docs> called `Result::unwrap()` on an `Err` value: cannot determine the documented Git commit; set ALPHAL00P_DOCS_GIT_COMMIT
  123. 21.56 s gammaloop-nextest-docs>
  124. 21.56 s gammaloop-nextest-docs> Location:
  125. 21.56 s gammaloop-nextest-docs> crates/alphal00p-docs-builder/src/lib.rs:4137:9
  126. 21.56 s gammaloop-nextest-docs> stack backtrace:
  127. 21.56 s gammaloop-nextest-docs> 0: __rustc::rust_begin_unwind
  128. 21.56 s gammaloop-nextest-docs> 1: core::panicking::panic_fmt
  129. 21.56 s gammaloop-nextest-docs> 2: core::result::unwrap_failed
  130. 21.56 s gammaloop-nextest-docs> 3: alphal00p_docs_builder::tests::portal_and_developer_pages_use_federated_search_and_feedback
  131. 21.56 s gammaloop-nextest-docs> 4: <alphal00p_docs_builder::tests::portal_and_developer_pages_use_federated_search_and_feedback::{closure#0} as core::ops::function::FnOnce<()>>::call_once
  132. 21.56 s gammaloop-nextest-docs> note: Some details are omitted, run with `RUST_BACKTRACE=full` for a verbose backtrace.
  133. 21.56 s gammaloop-nextest-docs>
  134. 34.10 s gammaloop-nextest-docs> FAIL [ 12.631s] (118/119) alphal00p-docs-builder tests::every_product_orients_rust_to_native_rustdoc_and_keeps_legacy_redirects
  135. 34.10 s gammaloop-nextest-docs> stdout ---
  136. 34.10 s gammaloop-nextest-docs>
  137. 34.10 s gammaloop-nextest-docs> running 1 test
  138. 34.10 s gammaloop-nextest-docs> test tests::every_product_orients_rust_to_native_rustdoc_and_keeps_legacy_redirects ... FAILED
  139. 34.10 s gammaloop-nextest-docs>
  140. 34.10 s gammaloop-nextest-docs> failures:
  141. 34.10 s gammaloop-nextest-docs>
  142. 34.10 s gammaloop-nextest-docs> failures:
  143. 34.10 s gammaloop-nextest-docs> tests::every_product_orients_rust_to_native_rustdoc_and_keeps_legacy_redirects
  144. 34.10 s gammaloop-nextest-docs>
  145. 34.10 s gammaloop-nextest-docs> test result: FAILED. 0 passed; 1 failed; 0 ignored; 0 measured; 118 filtered out; finished in 12.63s
  146. 34.10 s gammaloop-nextest-docs>
  147. 34.10 s gammaloop-nextest-docs> stderr ---
  148. 34.10 s gammaloop-nextest-docs>
  149. 34.10 s gammaloop-nextest-docs> thread 'tests::every_product_orients_rust_to_native_rustdoc_and_keeps_legacy_redirects' (261) panicked at crates/alphal00p-docs-builder/src/lib.rs:12166:18:
  150. 34.10 s gammaloop-nextest-docs> called `Result::unwrap()` on an `Err` value: cannot determine the documented Git commit; set ALPHAL00P_DOCS_GIT_COMMIT
  151. 34.10 s gammaloop-nextest-docs>
  152. 34.10 s gammaloop-nextest-docs> Location:
  153. 34.10 s gammaloop-nextest-docs> crates/alphal00p-docs-builder/src/lib.rs:2054:9
  154. 34.10 s gammaloop-nextest-docs> stack backtrace:
  155. 34.10 s gammaloop-nextest-docs> 0: __rustc::rust_begin_unwind
  156. 34.10 s gammaloop-nextest-docs> 1: core::panicking::panic_fmt
  157. 34.10 s gammaloop-nextest-docs> 2: core::result::unwrap_failed
  158. 34.10 s gammaloop-nextest-docs> 3: alphal00p_docs_builder::tests::every_product_orients_rust_to_native_rustdoc_and_keeps_legacy_redirects
  159. 34.10 s gammaloop-nextest-docs> 4: <alphal00p_docs_builder::tests::every_product_orients_rust_to_native_rustdoc_and_keeps_legacy_redirects::{closure#0} as core::ops::function::FnOnce<()>>::call_once
  160. 34.10 s gammaloop-nextest-docs> note: Some details are omitted, run with `RUST_BACKTRACE=full` for a verbose backtrace.
  161. 34.10 s gammaloop-nextest-docs>
  162. 36.68 s gammaloop-nextest-docs> ------------
  163. 36.68 s gammaloop-nextest-docs> Summary [ 15.227s] 119 tests run: 114 passed, 5 failed, 0 skipped
  164. 36.68 s gammaloop-nextest-docs> FAIL [ 0.013s] ( 25/119) alphal00p-docs-builder tests::developer_architecture_is_classified_searchable_and_source_backed
  165. 36.68 s gammaloop-nextest-docs> stdout ---
  166. 36.68 s gammaloop-nextest-docs>
  167. 36.68 s gammaloop-nextest-docs> running 1 test
  168. 36.68 s gammaloop-nextest-docs> test tests::developer_architecture_is_classified_searchable_and_source_backed ... FAILED
  169. 36.68 s gammaloop-nextest-docs>
  170. 36.68 s gammaloop-nextest-docs> failures:
  171. 36.68 s gammaloop-nextest-docs>
  172. 36.68 s gammaloop-nextest-docs> failures:
  173. 36.68 s gammaloop-nextest-docs> tests::developer_architecture_is_classified_searchable_and_source_backed
  174. 36.68 s gammaloop-nextest-docs>
  175. 36.68 s gammaloop-nextest-docs> test result: FAILED. 0 passed; 1 failed; 0 ignored; 0 measured; 118 filtered out; finished in 0.01s
  176. 36.68 s gammaloop-nextest-docs>
  177. 36.68 s gammaloop-nextest-docs> stderr ---
  178. 36.68 s gammaloop-nextest-docs>
  179. 36.68 s gammaloop-nextest-docs> thread 'tests::developer_architecture_is_classified_searchable_and_source_backed' (248) panicked at crates/alphal00p-docs-builder/src/lib.rs:12354:14:
  180. 36.68 s gammaloop-nextest-docs> called `Result::unwrap()` on an `Err` value: cannot determine the documented Git commit; set ALPHAL00P_DOCS_GIT_COMMIT
  181. 36.68 s gammaloop-nextest-docs>
  182. 36.68 s gammaloop-nextest-docs> Location:
  183. 36.68 s gammaloop-nextest-docs> crates/alphal00p-docs-builder/src/lib.rs:4137:9
  184. 36.68 s gammaloop-nextest-docs> stack backtrace:
  185. 36.68 s gammaloop-nextest-docs> 0: __rustc::rust_begin_unwind
  186. 36.68 s gammaloop-nextest-docs> 1: core::panicking::panic_fmt
  187. 36.68 s gammaloop-nextest-docs> 2: core::result::unwrap_failed
  188. 36.68 s gammaloop-nextest-docs> 3: alphal00p_docs_builder::tests::developer_architecture_is_classified_searchable_and_source_backed
  189. 36.68 s gammaloop-nextest-docs> 4: <alphal00p_docs_builder::tests::developer_architecture_is_classified_searchable_and_source_backed::{closure#0} as core::ops::function::FnOnce<()>>::call_once
  190. 36.68 s gammaloop-nextest-docs> note: Some details are omitted, run with `RUST_BACKTRACE=full` for a verbose backtrace.
  191. 36.68 s gammaloop-nextest-docs>
  192. 36.68 s gammaloop-nextest-docs> FAIL [ 0.007s] ( 46/119) alphal00p-docs-builder tests::persistent_rustdoc_target_rejects_symlink_escape
  193. 36.68 s gammaloop-nextest-docs> stdout ---
  194. 36.68 s gammaloop-nextest-docs>
  195. 36.68 s gammaloop-nextest-docs> running 1 test
  196. 36.68 s gammaloop-nextest-docs> test tests::persistent_rustdoc_target_rejects_symlink_escape ... FAILED
  197. 36.68 s gammaloop-nextest-docs>
  198. 36.68 s gammaloop-nextest-docs> failures:
  199. 36.68 s gammaloop-nextest-docs>
  200. 36.68 s gammaloop-nextest-docs> failures:
  201. 36.68 s gammaloop-nextest-docs> tests::persistent_rustdoc_target_rejects_symlink_escape
  202. 36.68 s gammaloop-nextest-docs>
  203. 36.68 s gammaloop-nextest-docs> test result: FAILED. 0 passed; 1 failed; 0 ignored; 0 measured; 118 filtered out; finished in 0.00s
  204. 36.68 s gammaloop-nextest-docs>
  205. 36.68 s gammaloop-nextest-docs> stderr ---
  206. 36.68 s gammaloop-nextest-docs>
  207. 36.68 s gammaloop-nextest-docs> thread 'tests::persistent_rustdoc_target_rejects_symlink_escape' (350) panicked at crates/alphal00p-docs-builder/src/lib.rs:10490:82:
  208. 36.68 s gammaloop-nextest-docs> called `Result::unwrap_err()` on an `Ok` value: "/build/.tmpP0jBmQ/escape/cache/cargo-target-v1"
  209. 36.68 s gammaloop-nextest-docs> stack backtrace:
  210. 36.68 s gammaloop-nextest-docs> 0: __rustc::rust_begin_unwind
  211. 36.68 s gammaloop-nextest-docs> 1: core::panicking::panic_fmt
  212. 36.68 s gammaloop-nextest-docs> 2: core::result::unwrap_failed
  213. 36.68 s gammaloop-nextest-docs> 3: alphal00p_docs_builder::tests::persistent_rustdoc_target_rejects_symlink_escape
  214. 36.68 s gammaloop-nextest-docs> 4: <alphal00p_docs_builder::tests::persistent_rustdoc_target_rejects_symlink_escape::{closure#0} as core::ops::function::FnOnce<()>>::call_once
  215. 36.68 s gammaloop-nextest-docs> note: Some details are omitted, run with `RUST_BACKTRACE=full` for a verbose backtrace.
  216. 36.68 s gammaloop-nextest-docs>
  217. 36.68 s gammaloop-nextest-docs> FAIL [ 0.007s] ( 47/119) alphal00p-docs-builder tests::persistent_rustdoc_targets_reject_workspace_and_arbitrary_roots
  218. 36.68 s gammaloop-nextest-docs> stdout ---
  219. 36.68 s gammaloop-nextest-docs>
  220. 36.68 s gammaloop-nextest-docs> running 1 test
  221. 36.68 s gammaloop-nextest-docs> test tests::persistent_rustdoc_targets_reject_workspace_and_arbitrary_roots ... FAILED
  222. 36.68 s gammaloop-nextest-docs>
  223. 36.68 s gammaloop-nextest-docs> failures:
  224. 36.68 s gammaloop-nextest-docs>
  225. 36.68 s gammaloop-nextest-docs> failures:
  226. 36.68 s gammaloop-nextest-docs> tests::persistent_rustdoc_targets_reject_workspace_and_arbitrary_roots
  227. 36.68 s gammaloop-nextest-docs>
  228. 36.68 s gammaloop-nextest-docs> test result: FAILED. 0 passed; 1 failed; 0 ignored; 0 measured; 118 filtered out; finished in 0.00s
  229. 36.68 s gammaloop-nextest-docs>
  230. 36.68 s gammaloop-nextest-docs> stderr ---
  231. 36.68 s gammaloop-nextest-docs>
  232. 36.68 s gammaloop-nextest-docs> thread 'tests::persistent_rustdoc_targets_reject_workspace_and_arbitrary_roots' (356) panicked at crates/alphal00p-docs-builder/src/lib.rs:10467:9:
  233. 36.68 s gammaloop-nextest-docs> assertion failed: prepare_persistent_rustdoc_target(workspace, &arbitrary).is_err()
  234. 36.68 s gammaloop-nextest-docs> stack backtrace:
  235. 36.68 s gammaloop-nextest-docs> 0: __rustc::rust_begin_unwind
  236. 36.68 s gammaloop-nextest-docs> 1: core::panicking::panic_fmt
  237. 36.68 s gammaloop-nextest-docs> 2: core::panicking::panic
  238. 36.68 s gammaloop-nextest-docs> 3: alphal00p_docs_builder::tests::persistent_rustdoc_targets_reject_workspace_and_arbitrary_roots
  239. 36.68 s gammaloop-nextest-docs> 4: <alphal00p_docs_builder::tests::persistent_rustdoc_targets_reject_workspace_and_arbitrary_roots::{closure#0} as core::ops::function::FnOnce<()>>::call_once
  240. 36.68 s gammaloop-nextest-docs> note: Some details are omitted, run with `RUST_BACKTRACE=full` for a verbose backtrace.
  241. 36.68 s gammaloop-nextest-docs>
  242. 36.68 s gammaloop-nextest-docs> FAIL [ 0.063s] ( 68/119) alphal00p-docs-builder tests::portal_and_developer_pages_use_federated_search_and_feedback
  243. 36.68 s gammaloop-nextest-docs> stdout ---
  244. 36.68 s gammaloop-nextest-docs>
  245. 36.68 s gammaloop-nextest-docs> running 1 test
  246. 36.69 s gammaloop-nextest-docs> test tests::portal_and_developer_pages_use_federated_search_and_feedback ... FAILED
  247. 36.69 s gammaloop-nextest-docs>
  248. 36.69 s gammaloop-nextest-docs> failures:
  249. 36.69 s gammaloop-nextest-docs>
  250. 36.69 s gammaloop-nextest-docs> failures:
  251. 36.69 s gammaloop-nextest-docs> tests::portal_and_developer_pages_use_federated_search_and_feedback
  252. 36.69 s gammaloop-nextest-docs>
  253. 36.69 s gammaloop-nextest-docs> test result: FAILED. 0 passed; 1 failed; 0 ignored; 0 measured; 118 filtered out; finished in 0.06s
  254. 36.69 s gammaloop-nextest-docs>
  255. 36.69 s gammaloop-nextest-docs> stderr ---
  256. 36.69 s gammaloop-nextest-docs> warning: bundle export is experimental
  257. 36.69 s gammaloop-nextest-docs> = hint: its behaviour may change at any time
  258. 36.69 s gammaloop-nextest-docs> = hint: do not rely on this feature for production use cases
  259. 36.69 s gammaloop-nextest-docs>
  260. 36.69 s gammaloop-nextest-docs>
  261. 36.69 s gammaloop-nextest-docs> thread 'tests::portal_and_developer_pages_use_federated_search_and_feedback' (353) panicked at crates/alphal00p-docs-builder/src/lib.rs:12758:14:
  262. 36.69 s gammaloop-nextest-docs> called `Result::unwrap()` on an `Err` value: cannot determine the documented Git commit; set ALPHAL00P_DOCS_GIT_COMMIT
  263. 36.69 s gammaloop-nextest-docs>
  264. 36.69 s gammaloop-nextest-docs> Location:
  265. 36.69 s gammaloop-nextest-docs> crates/alphal00p-docs-builder/src/lib.rs:4137:9
  266. 36.69 s gammaloop-nextest-docs> stack backtrace:
  267. 36.69 s gammaloop-nextest-docs> 0: __rustc::rust_begin_unwind
  268. 36.69 s gammaloop-nextest-docs> 1: core::panicking::panic_fmt
  269. 36.69 s gammaloop-nextest-docs> 2: core::result::unwrap_failed
  270. 36.69 s gammaloop-nextest-docs> 3: alphal00p_docs_builder::tests::portal_and_developer_pages_use_federated_search_and_feedback
  271. 36.69 s gammaloop-nextest-docs> 4: <alphal00p_docs_builder::tests::portal_and_developer_pages_use_federated_search_and_feedback::{closure#0} as core::ops::function::FnOnce<()>>::call_once
  272. 36.69 s gammaloop-nextest-docs> note: Some details are omitted, run with `RUST_BACKTRACE=full` for a verbose backtrace.
  273. 36.69 s gammaloop-nextest-docs>
  274. 36.69 s gammaloop-nextest-docs> FAIL [ 12.631s] (118/119) alphal00p-docs-builder tests::every_product_orients_rust_to_native_rustdoc_and_keeps_legacy_redirects
  275. 36.69 s gammaloop-nextest-docs> stdout ---
  276. 36.69 s gammaloop-nextest-docs>
  277. 36.69 s gammaloop-nextest-docs> running 1 test
  278. 36.69 s gammaloop-nextest-docs> test tests::every_product_orients_rust_to_native_rustdoc_and_keeps_legacy_redirects ... FAILED
  279. 36.69 s gammaloop-nextest-docs>
  280. 36.69 s gammaloop-nextest-docs> failures:
  281. 36.69 s gammaloop-nextest-docs>
  282. 36.69 s gammaloop-nextest-docs> failures:
  283. 36.69 s gammaloop-nextest-docs> tests::every_product_orients_rust_to_native_rustdoc_and_keeps_legacy_redirects
  284. 36.69 s gammaloop-nextest-docs>
  285. 36.69 s gammaloop-nextest-docs> test result: FAILED. 0 passed; 1 failed; 0 ignored; 0 measured; 118 filtered out; finished in 12.63s
  286. 36.69 s gammaloop-nextest-docs>
  287. 36.69 s gammaloop-nextest-docs> stderr ---
  288. 36.69 s gammaloop-nextest-docs>
  289. 36.69 s gammaloop-nextest-docs> thread 'tests::every_product_orients_rust_to_native_rustdoc_and_keeps_legacy_redirects' (261) panicked at crates/alphal00p-docs-builder/src/lib.rs:12166:18:
  290. 36.69 s gammaloop-nextest-docs> called `Result::unwrap()` on an `Err` value: cannot determine the documented Git commit; set ALPHAL00P_DOCS_GIT_COMMIT
  291. 36.69 s gammaloop-nextest-docs>
  292. 36.69 s gammaloop-nextest-docs> Location:
  293. 36.69 s gammaloop-nextest-docs> crates/alphal00p-docs-builder/src/lib.rs:2054:9
  294. 36.69 s gammaloop-nextest-docs> stack backtrace:
  295. 36.69 s gammaloop-nextest-docs> 0: __rustc::rust_begin_unwind
  296. 36.69 s gammaloop-nextest-docs> 1: core::panicking::panic_fmt
  297. 36.69 s gammaloop-nextest-docs> 2: core::result::unwrap_failed
  298. 36.69 s gammaloop-nextest-docs> 3: alphal00p_docs_builder::tests::every_product_orients_rust_to_native_rustdoc_and_keeps_legacy_redirects
  299. 36.69 s gammaloop-nextest-docs> 4: <alphal00p_docs_builder::tests::every_product_orients_rust_to_native_rustdoc_and_keeps_legacy_redirects::{closure#0} as core::ops::function::FnOnce<()>>::call_once
  300. 36.69 s gammaloop-nextest-docs> note: Some details are omitted, run with `RUST_BACKTRACE=full` for a verbose backtrace.
  301. 36.69 s gammaloop-nextest-docs>
  302. 36.70 s gammaloop-nextest-docs> error: test run failed
  303. 36.72 s gammaloop-nextest-docs>
  304. 36.72 s gammaloop-nextest-docs> ========== nextest test summary ==========
  305. 36.72 s gammaloop-nextest-docs> report: target/nextest/ci_gammaloop/junit.xml
  306. 36.72 s gammaloop-nextest-docs> tests: 119, failures: 5, errors: 0
  307. 36.72 s gammaloop-nextest-docs>
  308. 36.72 s gammaloop-nextest-docs> 1. alphal00p-docs-builder::tests::developer_architecture_is_classified_searchable_and_source_backed
  309. 36.72 s gammaloop-nextest-docs> failure: test failure with exit code 101
  310. 36.72 s gammaloop-nextest-docs> thread 'tests::developer_architecture_is_classified_searchable_and_source_backed' (248) panicked at crates/alphal00p-docs-builder/src/lib.rs:12354:14:
  311. 36.72 s gammaloop-nextest-docs> called `Result::unwrap()` on an `Err` value: cannot determine the documented Git commit; set ALPHAL00P_DOCS_GIT_COMMIT
  312. 36.72 s gammaloop-nextest-docs>
  313. 36.72 s gammaloop-nextest-docs> Location:
  314. 36.72 s gammaloop-nextest-docs> crates/alphal00p-docs-builder/src/lib.rs:4137:9
  315. 36.72 s gammaloop-nextest-docs> stack backtrace:
  316. 36.72 s gammaloop-nextest-docs> 0: __rustc::rust_begin_unwind
  317. 36.72 s gammaloop-nextest-docs> 1: core::panicking::panic_fmt
  318. 36.72 s gammaloop-nextest-docs> 2: core::result::unwrap_failed
  319. 36.72 s gammaloop-nextest-docs> 3: alphal00p_docs_builder::tests::developer_architecture_is_classified_searchable_and_source_backed
  320. 36.72 s gammaloop-nextest-docs> 4: <alphal00p_docs_builder::tests::developer_architecture_is_classified_searchable_and_source_backed::{closure#0} as core::ops::function::FnOnce<()>>::call_once
  321. 36.72 s gammaloop-nextest-docs> note: Some details are omitted, run with `RUST_BACKTRACE=full` for a verbose backtrace.
  322. 36.72 s gammaloop-nextest-docs> system-out
  323. 36.72 s gammaloop-nextest-docs> running 1 test
  324. 36.72 s gammaloop-nextest-docs> test tests::developer_architecture_is_classified_searchable_and_source_backed ... FAILED
  325. 36.72 s gammaloop-nextest-docs>
  326. 36.72 s gammaloop-nextest-docs> failures:
  327. 36.72 s gammaloop-nextest-docs>
  328. 36.72 s gammaloop-nextest-docs> failures:
  329. 36.72 s gammaloop-nextest-docs> tests::developer_architecture_is_classified_searchable_and_source_backed
  330. 36.72 s gammaloop-nextest-docs>
  331. 36.72 s gammaloop-nextest-docs> test result: FAILED. 0 passed; 1 failed; 0 ignored; 0 measured; 118 filtered out; finished in 0.01s
  332. 36.72 s gammaloop-nextest-docs> system-err
  333. 36.72 s gammaloop-nextest-docs> thread 'tests::developer_architecture_is_classified_searchable_and_source_backed' (248) panicked at crates/alphal00p-docs-builder/src/lib.rs:12354:14:
  334. 36.72 s gammaloop-nextest-docs> called `Result::unwrap()` on an `Err` value: cannot determine the documented Git commit; set ALPHAL00P_DOCS_GIT_COMMIT
  335. 36.72 s gammaloop-nextest-docs>
  336. 36.72 s gammaloop-nextest-docs> Location:
  337. 36.72 s gammaloop-nextest-docs> crates/alphal00p-docs-builder/src/lib.rs:4137:9
  338. 36.72 s gammaloop-nextest-docs> stack backtrace:
  339. 36.72 s gammaloop-nextest-docs> 0: __rustc::rust_begin_unwind
  340. 36.72 s gammaloop-nextest-docs> 1: core::panicking::panic_fmt
  341. 36.72 s gammaloop-nextest-docs> 2: core::result::unwrap_failed
  342. 36.72 s gammaloop-nextest-docs> 3: alphal00p_docs_builder::tests::developer_architecture_is_classified_searchable_and_source_backed
  343. 36.72 s gammaloop-nextest-docs> 4: <alphal00p_docs_builder::tests::developer_architecture_is_classified_searchable_and_source_backed::{closure#0} as core::ops::function::FnOnce<()>>::call_once
  344. 36.72 s gammaloop-nextest-docs> note: Some details are omitted, run with `RUST_BACKTRACE=full` for a verbose backtrace.
  345. 36.72 s gammaloop-nextest-docs>
  346. 36.72 s gammaloop-nextest-docs> 2. alphal00p-docs-builder::tests::persistent_rustdoc_target_rejects_symlink_escape
  347. 36.72 s gammaloop-nextest-docs> failure: test failure with exit code 101
  348. 36.72 s gammaloop-nextest-docs> thread 'tests::persistent_rustdoc_target_rejects_symlink_escape' (350) panicked at crates/alphal00p-docs-builder/src/lib.rs:10490:82:
  349. 36.72 s gammaloop-nextest-docs> called `Result::unwrap_err()` on an `Ok` value: "/build/.tmpP0jBmQ/escape/cache/cargo-target-v1"
  350. 36.72 s gammaloop-nextest-docs> stack backtrace:
  351. 36.72 s gammaloop-nextest-docs> 0: __rustc::rust_begin_unwind
  352. 36.72 s gammaloop-nextest-docs> 1: core::panicking::panic_fmt
  353. 36.72 s gammaloop-nextest-docs> 2: core::result::unwrap_failed
  354. 36.72 s gammaloop-nextest-docs> 3: alphal00p_docs_builder::tests::persistent_rustdoc_target_rejects_symlink_escape
  355. 36.72 s gammaloop-nextest-docs> 4: <alphal00p_docs_builder::tests::persistent_rustdoc_target_rejects_symlink_escape::{closure#0} as core::ops::function::FnOnce<()>>::call_once
  356. 36.72 s gammaloop-nextest-docs> note: Some details are omitted, run with `RUST_BACKTRACE=full` for a verbose backtrace.
  357. 36.72 s gammaloop-nextest-docs> system-out
  358. 36.72 s gammaloop-nextest-docs> running 1 test
  359. 36.72 s gammaloop-nextest-docs> test tests::persistent_rustdoc_target_rejects_symlink_escape ... FAILED
  360. 36.72 s gammaloop-nextest-docs>
  361. 36.72 s gammaloop-nextest-docs> failures:
  362. 36.72 s gammaloop-nextest-docs>
  363. 36.72 s gammaloop-nextest-docs> failures:
  364. 36.72 s gammaloop-nextest-docs> tests::persistent_rustdoc_target_rejects_symlink_escape
  365. 36.72 s gammaloop-nextest-docs>
  366. 36.72 s gammaloop-nextest-docs> test result: FAILED. 0 passed; 1 failed; 0 ignored; 0 measured; 118 filtered out; finished in 0.00s
  367. 36.72 s gammaloop-nextest-docs> system-err
  368. 36.72 s gammaloop-nextest-docs> thread 'tests::persistent_rustdoc_target_rejects_symlink_escape' (350) panicked at crates/alphal00p-docs-builder/src/lib.rs:10490:82:
  369. 36.72 s gammaloop-nextest-docs> called `Result::unwrap_err()` on an `Ok` value: "/build/.tmpP0jBmQ/escape/cache/cargo-target-v1"
  370. 36.72 s gammaloop-nextest-docs> stack backtrace:
  371. 36.72 s gammaloop-nextest-docs> 0: __rustc::rust_begin_unwind
  372. 36.72 s gammaloop-nextest-docs> 1: core::panicking::panic_fmt
  373. 36.72 s gammaloop-nextest-docs> 2: core::result::unwrap_failed
  374. 36.72 s gammaloop-nextest-docs> 3: alphal00p_docs_builder::tests::persistent_rustdoc_target_rejects_symlink_escape
  375. 36.72 s gammaloop-nextest-docs> 4: <alphal00p_docs_builder::tests::persistent_rustdoc_target_rejects_symlink_escape::{closure#0} as core::ops::function::FnOnce<()>>::call_once
  376. 36.72 s gammaloop-nextest-docs> note: Some details are omitted, run with `RUST_BACKTRACE=full` for a verbose backtrace.
  377. 36.72 s gammaloop-nextest-docs>
  378. 36.72 s gammaloop-nextest-docs> 3. alphal00p-docs-builder::tests::persistent_rustdoc_targets_reject_workspace_and_arbitrary_roots
  379. 36.72 s gammaloop-nextest-docs> failure: test failure with exit code 101
  380. 36.72 s gammaloop-nextest-docs> thread 'tests::persistent_rustdoc_targets_reject_workspace_and_arbitrary_roots' (356) panicked at crates/alphal00p-docs-builder/src/lib.rs:10467:9:
  381. 36.72 s gammaloop-nextest-docs> assertion failed: prepare_persistent_rustdoc_target(workspace, &arbitrary).is_err()
  382. 36.72 s gammaloop-nextest-docs> stack backtrace:
  383. 36.72 s gammaloop-nextest-docs> 0: __rustc::rust_begin_unwind
  384. 36.72 s gammaloop-nextest-docs> 1: core::panicking::panic_fmt
  385. 36.72 s gammaloop-nextest-docs> 2: core::panicking::panic
  386. 36.72 s gammaloop-nextest-docs> 3: alphal00p_docs_builder::tests::persistent_rustdoc_targets_reject_workspace_and_arbitrary_roots
  387. 36.72 s gammaloop-nextest-docs> 4: <alphal00p_docs_builder::tests::persistent_rustdoc_targets_reject_workspace_and_arbitrary_roots::{closure#0} as core::ops::function::FnOnce<()>>::call_once
  388. 36.72 s gammaloop-nextest-docs> note: Some details are omitted, run with `RUST_BACKTRACE=full` for a verbose backtrace.
  389. 36.72 s gammaloop-nextest-docs> system-out
  390. 36.72 s gammaloop-nextest-docs> running 1 test
  391. 36.72 s gammaloop-nextest-docs> test tests::persistent_rustdoc_targets_reject_workspace_and_arbitrary_roots ... FAILED
  392. 36.72 s gammaloop-nextest-docs>
  393. 36.72 s gammaloop-nextest-docs> failures:
  394. 36.72 s gammaloop-nextest-docs>
  395. 36.72 s gammaloop-nextest-docs> failures:
  396. 36.72 s gammaloop-nextest-docs> tests::persistent_rustdoc_targets_reject_workspace_and_arbitrary_roots
  397. 36.72 s gammaloop-nextest-docs>
  398. 36.72 s gammaloop-nextest-docs> test result: FAILED. 0 passed; 1 failed; 0 ignored; 0 measured; 118 filtered out; finished in 0.00s
  399. 36.72 s gammaloop-nextest-docs> system-err
  400. 36.72 s gammaloop-nextest-docs> thread 'tests::persistent_rustdoc_targets_reject_workspace_and_arbitrary_roots' (356) panicked at crates/alphal00p-docs-builder/src/lib.rs:10467:9:
  401. 36.72 s gammaloop-nextest-docs> assertion failed: prepare_persistent_rustdoc_target(workspace, &arbitrary).is_err()
  402. 36.72 s gammaloop-nextest-docs> stack backtrace:
  403. 36.72 s gammaloop-nextest-docs> 0: __rustc::rust_begin_unwind
  404. 36.72 s gammaloop-nextest-docs> 1: core::panicking::panic_fmt
  405. 36.72 s gammaloop-nextest-docs> 2: core::panicking::panic
  406. 36.72 s gammaloop-nextest-docs> 3: alphal00p_docs_builder::tests::persistent_rustdoc_targets_reject_workspace_and_arbitrary_roots
  407. 36.72 s gammaloop-nextest-docs> 4: <alphal00p_docs_builder::tests::persistent_rustdoc_targets_reject_workspace_and_arbitrary_roots::{closure#0} as core::ops::function::FnOnce<()>>::call_once
  408. 36.72 s gammaloop-nextest-docs> note: Some details are omitted, run with `RUST_BACKTRACE=full` for a verbose backtrace.
  409. 36.72 s gammaloop-nextest-docs>
  410. 36.72 s gammaloop-nextest-docs> 4. alphal00p-docs-builder::tests::portal_and_developer_pages_use_federated_search_and_feedback
  411. 36.72 s gammaloop-nextest-docs> failure: test failure with exit code 101
  412. 36.72 s gammaloop-nextest-docs> thread 'tests::portal_and_developer_pages_use_federated_search_and_feedback' (353) panicked at crates/alphal00p-docs-builder/src/lib.rs:12758:14:
  413. 36.72 s gammaloop-nextest-docs> called `Result::unwrap()` on an `Err` value: cannot determine the documented Git commit; set ALPHAL00P_DOCS_GIT_COMMIT
  414. 36.72 s gammaloop-nextest-docs>
  415. 36.72 s gammaloop-nextest-docs> Location:
  416. 36.72 s gammaloop-nextest-docs> crates/alphal00p-docs-builder/src/lib.rs:4137:9
  417. 36.72 s gammaloop-nextest-docs> stack backtrace:
  418. 36.72 s gammaloop-nextest-docs> 0: __rustc::rust_begin_unwind
  419. 36.72 s gammaloop-nextest-docs> 1: core::panicking::panic_fmt
  420. 36.72 s gammaloop-nextest-docs> 2: core::result::unwrap_failed
  421. 36.72 s gammaloop-nextest-docs> 3: alphal00p_docs_builder::tests::portal_and_developer_pages_use_federated_search_and_feedback
  422. 36.72 s gammaloop-nextest-docs> 4: <alphal00p_docs_builder::tests::portal_and_developer_pages_use_federated_search_and_feedback::{closure#0} as core::ops::function::FnOnce<()>>::call_once
  423. 36.72 s gammaloop-nextest-docs> note: Some details are omitted, run with `RUST_BACKTRACE=full` for a verbose backtrace.
  424. 36.72 s gammaloop-nextest-docs> system-out
  425. 36.72 s gammaloop-nextest-docs> running 1 test
  426. 36.72 s gammaloop-nextest-docs> test tests::portal_and_developer_pages_use_federated_search_and_feedback ... FAILED
  427. 36.72 s gammaloop-nextest-docs>
  428. 36.72 s gammaloop-nextest-docs> failures:
  429. 36.72 s gammaloop-nextest-docs>
  430. 36.72 s gammaloop-nextest-docs> failures:
  431. 36.72 s gammaloop-nextest-docs> tests::portal_and_developer_pages_use_federated_search_and_feedback
  432. 36.72 s gammaloop-nextest-docs>
  433. 36.72 s gammaloop-nextest-docs> test result: FAILED. 0 passed; 1 failed; 0 ignored; 0 measured; 118 filtered out; finished in 0.06s
  434. 36.72 s gammaloop-nextest-docs> system-err
  435. 36.72 s gammaloop-nextest-docs> warning: bundle export is experimental
  436. 36.72 s gammaloop-nextest-docs> = hint: its behaviour may change at any time
  437. 36.72 s gammaloop-nextest-docs> = hint: do not rely on this feature for production use cases
  438. 36.72 s gammaloop-nextest-docs>
  439. 36.72 s gammaloop-nextest-docs>
  440. 36.72 s gammaloop-nextest-docs> thread 'tests::portal_and_developer_pages_use_federated_search_and_feedback' (353) panicked at crates/alphal00p-docs-builder/src/lib.rs:12758:14:
  441. 36.72 s gammaloop-nextest-docs> called `Result::unwrap()` on an `Err` value: cannot determine the documented Git commit; set ALPHAL00P_DOCS_GIT_COMMIT
  442. 36.72 s gammaloop-nextest-docs>
  443. 36.72 s gammaloop-nextest-docs> Location:
  444. 36.72 s gammaloop-nextest-docs> crates/alphal00p-docs-builder/src/lib.rs:4137:9
  445. 36.72 s gammaloop-nextest-docs> stack backtrace:
  446. 36.72 s gammaloop-nextest-docs> 0: __rustc::rust_begin_unwind
  447. 36.72 s gammaloop-nextest-docs> 1: core::panicking::panic_fmt
  448. 36.72 s gammaloop-nextest-docs> 2: core::result::unwrap_failed
  449. 36.72 s gammaloop-nextest-docs> 3: alphal00p_docs_builder::tests::portal_and_developer_pages_use_federated_search_and_feedback
  450. 36.72 s gammaloop-nextest-docs> 4: <alphal00p_docs_builder::tests::portal_and_developer_pages_use_federated_search_and_feedback::{closure#0} as core::ops::function::FnOnce<()>>::call_once
  451. 36.72 s gammaloop-nextest-docs> note: Some details are omitted, run with `RUST_BACKTRACE=full` for a verbose backtrace.
  452. 36.72 s gammaloop-nextest-docs>
  453. 36.72 s gammaloop-nextest-docs> 5. alphal00p-docs-builder::tests::every_product_orients_rust_to_native_rustdoc_and_keeps_legacy_redirects
  454. 36.72 s gammaloop-nextest-docs> failure: test failure with exit code 101
  455. 36.72 s gammaloop-nextest-docs> thread 'tests::every_product_orients_rust_to_native_rustdoc_and_keeps_legacy_redirects' (261) panicked at crates/alphal00p-docs-builder/src/lib.rs:12166:18:
  456. 36.72 s gammaloop-nextest-docs> called `Result::unwrap()` on an `Err` value: cannot determine the documented Git commit; set ALPHAL00P_DOCS_GIT_COMMIT
  457. 36.72 s gammaloop-nextest-docs>
  458. 36.72 s gammaloop-nextest-docs> Location:
  459. 36.72 s gammaloop-nextest-docs> crates/alphal00p-docs-builder/src/lib.rs:2054:9
  460. 36.72 s gammaloop-nextest-docs> stack backtrace:
  461. 36.72 s gammaloop-nextest-docs> 0: __rustc::rust_begin_unwind
  462. 36.72 s gammaloop-nextest-docs> 1: core::panicking::panic_fmt
  463. 36.72 s gammaloop-nextest-docs> 2: core::result::unwrap_failed
  464. 36.72 s gammaloop-nextest-docs> 3: alphal00p_docs_builder::tests::every_product_orients_rust_to_native_rustdoc_and_keeps_legacy_redirects
  465. 36.72 s gammaloop-nextest-docs> 4: <alphal00p_docs_builder::tests::every_product_orients_rust_to_native_rustdoc_and_keeps_legacy_redirects::{closure#0} as core::ops::function::FnOnce<()>>::call_once
  466. 36.72 s gammaloop-nextest-docs> note: Some details are omitted, run with `RUST_BACKTRACE=full` for a verbose backtrace.
  467. 36.72 s gammaloop-nextest-docs> system-out
  468. 36.72 s gammaloop-nextest-docs> running 1 test
  469. 36.72 s gammaloop-nextest-docs> test tests::every_product_orients_rust_to_native_rustdoc_and_keeps_legacy_redirects ... FAILED
  470. 36.72 s gammaloop-nextest-docs>
  471. 36.72 s gammaloop-nextest-docs> failures:
  472. 36.72 s gammaloop-nextest-docs>
  473. 36.72 s gammaloop-nextest-docs> failures:
  474. 36.72 s gammaloop-nextest-docs> tests::every_product_orients_rust_to_native_rustdoc_and_keeps_legacy_redirects
  475. 36.72 s gammaloop-nextest-docs>
  476. 36.72 s gammaloop-nextest-docs> test result: FAILED. 0 passed; 1 failed; 0 ignored; 0 measured; 118 filtered out; finished in 12.63s
  477. 36.72 s gammaloop-nextest-docs> system-err
  478. 36.72 s gammaloop-nextest-docs> thread 'tests::every_product_orients_rust_to_native_rustdoc_and_keeps_legacy_redirects' (261) panicked at crates/alphal00p-docs-builder/src/lib.rs:12166:18:
  479. 36.72 s gammaloop-nextest-docs> called `Result::unwrap()` on an `Err` value: cannot determine the documented Git commit; set ALPHAL00P_DOCS_GIT_COMMIT
  480. 36.72 s gammaloop-nextest-docs>
  481. 36.72 s gammaloop-nextest-docs> Location:
  482. 36.72 s gammaloop-nextest-docs> crates/alphal00p-docs-builder/src/lib.rs:2054:9
  483. 36.72 s gammaloop-nextest-docs> stack backtrace:
  484. 36.72 s gammaloop-nextest-docs> 0: __rustc::rust_begin_unwind
  485. 36.72 s gammaloop-nextest-docs> 1: core::panicking::panic_fmt
  486. 36.72 s gammaloop-nextest-docs> 2: core::result::unwrap_failed
  487. 36.72 s gammaloop-nextest-docs> 3: alphal00p_docs_builder::tests::every_product_orients_rust_to_native_rustdoc_and_keeps_legacy_redirects
  488. 36.72 s gammaloop-nextest-docs> 4: <alphal00p_docs_builder::tests::every_product_orients_rust_to_native_rustdoc_and_keeps_legacy_redirects::{closure#0} as core::ops::function::FnOnce<()>>::call_once
  489. 36.72 s gammaloop-nextest-docs> note: Some details are omitted, run with `RUST_BACKTRACE=full` for a verbose backtrace.
  490. 36.72 s gammaloop-nextest-docs> =========================================
  491. 36.74 s gammaloop-nextest-docs> Extracting 2 binaries to /build/nextest-archive-ePw8S4
  492. 36.77 s gammaloop-nextest-docs> Extracted 5 files to /build/nextest-archive-ePw8S4 in 0.04s
  493. 36.78 s gammaloop-nextest-docs> ------------
  494. 36.78 s gammaloop-nextest-docs> Nextest run ID 168a535e-273b-4ad7-aa7d-59cfa56c6ca6 with nextest profile: ci_gammaloop
  495. 36.78 s gammaloop-nextest-docs> Starting 21 tests across 2 binaries
  496. 36.79 s gammaloop-nextest-docs> ------------
  497. 36.79 s gammaloop-nextest-docs> Summary [ 0.015s] 21 tests run: 21 passed, 0 skipped
  498. 36.83 s gammaloop-nextest-docs>
  499. 36.83 s gammaloop-nextest-docs> ========== nextest test summary ==========
  500. 36.83 s gammaloop-nextest-docs> report: target/nextest/ci_gammaloop/junit.xml
  501. 36.83 s gammaloop-nextest-docs> tests: 21, failures: 0, errors: 0
  502. 36.83 s gammaloop-nextest-docs> No failing testcases found.
  503. 36.83 s gammaloop-nextest-docs> =========================================
  504. 36.84 s gammaloop-nextest-docs> Extracting 3 binaries (including 2 non-test binaries), 1 build script output directory, and 2 linked paths to /build/nextest-archive-zwLSjs
  505. 37.08 s gammaloop-nextest-docs> Extracted 22 files to /build/nextest-archive-zwLSjs in 0.24s
  506. 37.09 s gammaloop-nextest-docs> ------------
  507. 37.09 s gammaloop-nextest-docs> Nextest run ID 15cd9d6e-5ed1-40d6-a24f-2ece0ec90002 with nextest profile: ci_gammaloop
  508. 37.09 s gammaloop-nextest-docs> Starting 89 tests across 1 binary
  509. 37.12 s gammaloop-nextest-docs> ------------
  510. 37.12 s gammaloop-nextest-docs> Summary [ 0.037s] 89 tests run: 89 passed, 0 skipped
  511. 37.19 s gammaloop-nextest-docs>
  512. 37.19 s gammaloop-nextest-docs> ========== nextest test summary ==========
  513. 37.19 s gammaloop-nextest-docs> report: target/nextest/ci_gammaloop/junit.xml
  514. 37.19 s gammaloop-nextest-docs> tests: 89, failures: 0, errors: 0
  515. 37.19 s gammaloop-nextest-docs> No failing testcases found.
  516. 37.19 s gammaloop-nextest-docs> =========================================
  517. 37.20 s gammaloop-nextest-docs> Extracting 2 binaries to /build/nextest-archive-HfxznJ
  518. 37.24 s gammaloop-nextest-docs> Extracted 5 files to /build/nextest-archive-HfxznJ in 0.04s
  519. 37.25 s gammaloop-nextest-docs> ------------
  520. 37.25 s gammaloop-nextest-docs> Nextest run ID 1299a1fb-2dbe-4182-bf54-00ff27b3c7b1 with nextest profile: ci_gammaloop
  521. 37.25 s gammaloop-nextest-docs> Starting 10 tests across 2 binaries
  522. 51.70 s gammaloop-nextest-docs> ------------
  523. 51.70 s gammaloop-nextest-docs> Summary [ 14.450s] 10 tests run: 10 passed, 0 skipped
  524. 51.73 s gammaloop-nextest-docs>
  525. 51.73 s gammaloop-nextest-docs> ========== nextest test summary ==========
  526. 51.73 s gammaloop-nextest-docs> report: target/nextest/ci_gammaloop/junit.xml
  527. 51.73 s gammaloop-nextest-docs> tests: 10, failures: 0, errors: 0
  528. 51.73 s gammaloop-nextest-docs> No failing testcases found.
  529. 51.73 s gammaloop-nextest-docs> =========================================
  530. 51.74 s gammaloop-nextest-docs> Extracting 1 binary to /build/nextest-archive-XSz6ZR
  531. 51.77 s gammaloop-nextest-docs> Extracted 4 files to /build/nextest-archive-XSz6ZR in 0.03s
  532. 51.78 s gammaloop-nextest-docs> ------------
  533. 51.78 s gammaloop-nextest-docs> Nextest run ID 9750a0b7-14b4-4c08-97b7-eb4492e058be with nextest profile: ci_gammaloop
  534. 51.78 s gammaloop-nextest-docs> Starting 0 tests across 1 binary
  535. 51.78 s gammaloop-nextest-docs> ------------
  536. 51.78 s gammaloop-nextest-docs> Summary [ 0.000s] 0 tests run: 0 passed, 0 skipped
  537. 51.81 s gammaloop-nextest-docs>
  538. 51.81 s gammaloop-nextest-docs> ========== nextest test summary ==========
  539. 51.81 s gammaloop-nextest-docs> report: target/nextest/ci_gammaloop/junit.xml
  540. 51.81 s gammaloop-nextest-docs> tests: 0, failures: 0, errors: 0
  541. 51.81 s gammaloop-nextest-docs> No failing testcases found.
  542. 51.81 s gammaloop-nextest-docs> =========================================
  543. 51.83 s gammaloop-nextest-docs> Extracting 1 binary to /build/nextest-archive-06orrs
  544. 51.86 s gammaloop-nextest-docs> Extracted 4 files to /build/nextest-archive-06orrs in 0.04s
  545. 51.87 s gammaloop-nextest-docs> ------------
  546. 51.87 s gammaloop-nextest-docs> Nextest run ID 3c554ecb-9e0b-456f-9141-0a5ee71c9670 with nextest profile: ci_gammaloop
  547. 51.87 s gammaloop-nextest-docs> Starting 4 tests across 1 binary
  548. 51.88 s gammaloop-nextest-docs> ------------
  549. 51.88 s gammaloop-nextest-docs> Summary [ 0.005s] 4 tests run: 4 passed, 0 skipped
  550. 51.91 s gammaloop-nextest-docs>
  551. 51.91 s gammaloop-nextest-docs> ========== nextest test summary ==========
  552. 51.91 s gammaloop-nextest-docs> report: target/nextest/ci_gammaloop/junit.xml
  553. 51.91 s gammaloop-nextest-docs> tests: 4, failures: 0, errors: 0
  554. 51.91 s gammaloop-nextest-docs> No failing testcases found.
  555. 51.91 s gammaloop-nextest-docs> =========================================
  556. 52.07 s error: Cannot build '/nix/store/97637lakc6i3dvs2xjwvp87fmqr4wngc-gammaloop-nextest-docs.drv'.
  557. 52.07 s Reason: builder failed with exit code 100.
  558. 52.07 s Output paths:
  559. 52.07 s /nix/store/z1xh981kw745hgllv03mrbf9cyaf6c35-gammaloop-nextest-docs
  560. 52.07 s Last 537 log lines:
  561. 52.07 s > Extracting 2 binaries to /build/nextest-archive-9T267b
  562. 52.07 s > Extracted 5 files to /build/nextest-archive-9T267b in 0.05s
  563. 52.07 s > ------------
  564. 52.07 s > Nextest run ID fb459d40-a54d-4f6e-b467-c223c765a54b with nextest profile: ci_gammaloop
  565. 52.07 s > Starting 119 tests across 2 binaries
  566. 52.07 s > FAIL [ 0.013s] ( 25/119) alphal00p-docs-builder tests::developer_architecture_is_classified_searchable_and_source_backed
  567. 52.07 s > stdout ---
  568. 52.07 s >
  569. 52.07 s > running 1 test
  570. 52.07 s > test tests::developer_architecture_is_classified_searchable_and_source_backed ... FAILED
  571. 52.07 s >
  572. 52.07 s > failures:
  573. 52.07 s >
  574. 52.07 s > failures:
  575. 52.07 s > tests::developer_architecture_is_classified_searchable_and_source_backed
  576. 52.07 s >
  577. 52.07 s > test result: FAILED. 0 passed; 1 failed; 0 ignored; 0 measured; 118 filtered out; finished in 0.01s
  578. 52.07 s >
  579. 52.07 s > stderr ---
  580. 52.07 s >
  581. 52.07 s > thread 'tests::developer_architecture_is_classified_searchable_and_source_backed' (248) panicked at crates/alphal00p-docs-builder/src/lib.rs:12354:14:
  582. 52.07 s > called `Result::unwrap()` on an `Err` value: cannot determine the documented Git commit; set ALPHAL00P_DOCS_GIT_COMMIT
  583. 52.07 s >
  584. 52.07 s > Location:
  585. 52.07 s > crates/alphal00p-docs-builder/src/lib.rs:4137:9
  586. 52.07 s > stack backtrace:
  587. 52.07 s > 0: __rustc::rust_begin_unwind
  588. 52.07 s > 1: core::panicking::panic_fmt
  589. 52.07 s > 2: core::result::unwrap_failed
  590. 52.07 s > 3: alphal00p_docs_builder::tests::developer_architecture_is_classified_searchable_and_source_backed
  591. 52.07 s > 4: <alphal00p_docs_builder::tests::developer_architecture_is_classified_searchable_and_source_backed::{closure#0} as core::ops::function::FnOnce<()>>::call_once
  592. 52.07 s > note: Some details are omitted, run with `RUST_BACKTRACE=full` for a verbose backtrace.
  593. 52.07 s >
  594. 52.07 s > FAIL [ 0.007s] ( 46/119) alphal00p-docs-builder tests::persistent_rustdoc_target_rejects_symlink_escape
  595. 52.07 s > stdout ---
  596. 52.07 s >
  597. 52.07 s > running 1 test
  598. 52.07 s > test tests::persistent_rustdoc_target_rejects_symlink_escape ... FAILED
  599. 52.07 s >
  600. 52.07 s > failures:
  601. 52.07 s >
  602. 52.07 s > failures:
  603. 52.07 s > tests::persistent_rustdoc_target_rejects_symlink_escape
  604. 52.07 s >
  605. 52.07 s > test result: FAILED. 0 passed; 1 failed; 0 ignored; 0 measured; 118 filtered out; finished in 0.00s
  606. 52.07 s >
  607. 52.07 s > stderr ---
  608. 52.07 s >
  609. 52.07 s > thread 'tests::persistent_rustdoc_target_rejects_symlink_escape' (350) panicked at crates/alphal00p-docs-builder/src/lib.rs:10490:82:
  610. 52.07 s > called `Result::unwrap_err()` on an `Ok` value: "/build/.tmpP0jBmQ/escape/cache/cargo-target-v1"
  611. 52.07 s > stack backtrace:
  612. 52.07 s > 0: __rustc::rust_begin_unwind
  613. 52.07 s > 1: core::panicking::panic_fmt
  614. 52.07 s > 2: core::result::unwrap_failed
  615. 52.07 s > 3: alphal00p_docs_builder::tests::persistent_rustdoc_target_rejects_symlink_escape
  616. 52.07 s > 4: <alphal00p_docs_builder::tests::persistent_rustdoc_target_rejects_symlink_escape::{closure#0} as core::ops::function::FnOnce<()>>::call_once
  617. 52.07 s > note: Some details are omitted, run with `RUST_BACKTRACE=full` for a verbose backtrace.
  618. 52.07 s >
  619. 52.07 s > FAIL [ 0.007s] ( 47/119) alphal00p-docs-builder tests::persistent_rustdoc_targets_reject_workspace_and_arbitrary_roots
  620. 52.07 s > stdout ---
  621. 52.07 s >
  622. 52.07 s > running 1 test
  623. 52.07 s > test tests::persistent_rustdoc_targets_reject_workspace_and_arbitrary_roots ... FAILED
  624. 52.07 s >
  625. 52.07 s > failures:
  626. 52.07 s >
  627. 52.07 s > failures:
  628. 52.07 s > tests::persistent_rustdoc_targets_reject_workspace_and_arbitrary_roots
  629. 52.07 s >
  630. 52.07 s > test result: FAILED. 0 passed; 1 failed; 0 ignored; 0 measured; 118 filtered out; finished in 0.00s
  631. 52.07 s >
  632. 52.07 s > stderr ---
  633. 52.07 s >
  634. 52.07 s > thread 'tests::persistent_rustdoc_targets_reject_workspace_and_arbitrary_roots' (356) panicked at crates/alphal00p-docs-builder/src/lib.rs:10467:9:
  635. 52.07 s > assertion failed: prepare_persistent_rustdoc_target(workspace, &arbitrary).is_err()
  636. 52.07 s > stack backtrace:
  637. 52.07 s > 0: __rustc::rust_begin_unwind
  638. 52.07 s > 1: core::panicking::panic_fmt
  639. 52.07 s > 2: core::panicking::panic
  640. 52.07 s > 3: alphal00p_docs_builder::tests::persistent_rustdoc_targets_reject_workspace_and_arbitrary_roots
  641. 52.07 s > 4: <alphal00p_docs_builder::tests::persistent_rustdoc_targets_reject_workspace_and_arbitrary_roots::{closure#0} as core::ops::function::FnOnce<()>>::call_once
  642. 52.07 s > note: Some details are omitted, run with `RUST_BACKTRACE=full` for a verbose backtrace.
  643. 52.07 s >
  644. 52.07 s > FAIL [ 0.063s] ( 68/119) alphal00p-docs-builder tests::portal_and_developer_pages_use_federated_search_and_feedback
  645. 52.07 s > stdout ---
  646. 52.07 s >
  647. 52.07 s > running 1 test
  648. 52.07 s > test tests::portal_and_developer_pages_use_federated_search_and_feedback ... FAILED
  649. 52.07 s >
  650. 52.07 s > failures:
  651. 52.07 s >
  652. 52.07 s > failures:
  653. 52.07 s > tests::portal_and_developer_pages_use_federated_search_and_feedback
  654. 52.07 s >
  655. 52.07 s > test result: FAILED. 0 passed; 1 failed; 0 ignored; 0 measured; 118 filtered out; finished in 0.06s
  656. 52.07 s >
  657. 52.07 s > stderr ---
  658. 52.07 s > warning: bundle export is experimental
  659. 52.07 s > = hint: its behaviour may change at any time
  660. 52.07 s > = hint: do not rely on this feature for production use cases
  661. 52.07 s >
  662. 52.07 s >
  663. 52.07 s > thread 'tests::portal_and_developer_pages_use_federated_search_and_feedback' (353) panicked at crates/alphal00p-docs-builder/src/lib.rs:12758:14:
  664. 52.07 s > called `Result::unwrap()` on an `Err` value: cannot determine the documented Git commit; set ALPHAL00P_DOCS_GIT_COMMIT
  665. 52.07 s >
  666. 52.07 s > Location:
  667. 52.07 s > crates/alphal00p-docs-builder/src/lib.rs:4137:9
  668. 52.07 s > stack backtrace:
  669. 52.07 s > 0: __rustc::rust_begin_unwind
  670. 52.07 s > 1: core::panicking::panic_fmt
  671. 52.07 s > 2: core::result::unwrap_failed
  672. 52.07 s > 3: alphal00p_docs_builder::tests::portal_and_developer_pages_use_federated_search_and_feedback
  673. 52.07 s > 4: <alphal00p_docs_builder::tests::portal_and_developer_pages_use_federated_search_and_feedback::{closure#0} as core::ops::function::FnOnce<()>>::call_once
  674. 52.07 s > note: Some details are omitted, run with `RUST_BACKTRACE=full` for a verbose backtrace.
  675. 52.07 s >
  676. 52.07 s > FAIL [ 12.631s] (118/119) alphal00p-docs-builder tests::every_product_orients_rust_to_native_rustdoc_and_keeps_legacy_redirects
  677. 52.07 s > stdout ---
  678. 52.07 s >
  679. 52.07 s > running 1 test
  680. 52.07 s > test tests::every_product_orients_rust_to_native_rustdoc_and_keeps_legacy_redirects ... FAILED
  681. 52.07 s >
  682. 52.07 s > failures:
  683. 52.07 s >
  684. 52.07 s > failures:
  685. 52.07 s > tests::every_product_orients_rust_to_native_rustdoc_and_keeps_legacy_redirects
  686. 52.07 s >
  687. 52.07 s > test result: FAILED. 0 passed; 1 failed; 0 ignored; 0 measured; 118 filtered out; finished in 12.63s
  688. 52.07 s >
  689. 52.07 s > stderr ---
  690. 52.07 s >
  691. 52.07 s > thread 'tests::every_product_orients_rust_to_native_rustdoc_and_keeps_legacy_redirects' (261) panicked at crates/alphal00p-docs-builder/src/lib.rs:12166:18:
  692. 52.07 s > called `Result::unwrap()` on an `Err` value: cannot determine the documented Git commit; set ALPHAL00P_DOCS_GIT_COMMIT
  693. 52.07 s >
  694. 52.07 s > Location:
  695. 52.07 s > crates/alphal00p-docs-builder/src/lib.rs:2054:9
  696. 52.07 s > stack backtrace:
  697. 52.07 s > 0: __rustc::rust_begin_unwind
  698. 52.07 s > 1: core::panicking::panic_fmt
  699. 52.07 s > 2: core::result::unwrap_failed
  700. 52.07 s > 3: alphal00p_docs_builder::tests::every_product_orients_rust_to_native_rustdoc_and_keeps_legacy_redirects
  701. 52.07 s > 4: <alphal00p_docs_builder::tests::every_product_orients_rust_to_native_rustdoc_and_keeps_legacy_redirects::{closure#0} as core::ops::function::FnOnce<()>>::call_once
  702. 52.07 s > note: Some details are omitted, run with `RUST_BACKTRACE=full` for a verbose backtrace.
  703. 52.07 s >
  704. 52.07 s > ------------
  705. 52.07 s > Summary [ 15.227s] 119 tests run: 114 passed, 5 failed, 0 skipped
  706. 52.07 s > FAIL [ 0.013s] ( 25/119) alphal00p-docs-builder tests::developer_architecture_is_classified_searchable_and_source_backed
  707. 52.07 s > stdout ---
  708. 52.07 s >
  709. 52.07 s > running 1 test
  710. 52.07 s > test tests::developer_architecture_is_classified_searchable_and_source_backed ... FAILED
  711. 52.07 s >
  712. 52.07 s > failures:
  713. 52.07 s >
  714. 52.07 s > failures:
  715. 52.07 s > tests::developer_architecture_is_classified_searchable_and_source_backed
  716. 52.07 s >
  717. 52.07 s > test result: FAILED. 0 passed; 1 failed; 0 ignored; 0 measured; 118 filtered out; finished in 0.01s
  718. 52.07 s >
  719. 52.07 s > stderr ---
  720. 52.07 s >
  721. 52.07 s > thread 'tests::developer_architecture_is_classified_searchable_and_source_backed' (248) panicked at crates/alphal00p-docs-builder/src/lib.rs:12354:14:
  722. 52.07 s > called `Result::unwrap()` on an `Err` value: cannot determine the documented Git commit; set ALPHAL00P_DOCS_GIT_COMMIT
  723. 52.07 s >
  724. 52.07 s > Location:
  725. 52.07 s > crates/alphal00p-docs-builder/src/lib.rs:4137:9
  726. 52.07 s > stack backtrace:
  727. 52.07 s > 0: __rustc::rust_begin_unwind
  728. 52.07 s > 1: core::panicking::panic_fmt
  729. 52.07 s > 2: core::result::unwrap_failed
  730. 52.07 s > 3: alphal00p_docs_builder::tests::developer_architecture_is_classified_searchable_and_source_backed
  731. 52.07 s > 4: <alphal00p_docs_builder::tests::developer_architecture_is_classified_searchable_and_source_backed::{closure#0} as core::ops::function::FnOnce<()>>::call_once
  732. 52.07 s > note: Some details are omitted, run with `RUST_BACKTRACE=full` for a verbose backtrace.
  733. 52.07 s >
  734. 52.07 s > FAIL [ 0.007s] ( 46/119) alphal00p-docs-builder tests::persistent_rustdoc_target_rejects_symlink_escape
  735. 52.07 s > stdout ---
  736. 52.07 s >
  737. 52.07 s > running 1 test
  738. 52.07 s > test tests::persistent_rustdoc_target_rejects_symlink_escape ... FAILED
  739. 52.07 s >
  740. 52.07 s > failures:
  741. 52.07 s >
  742. 52.07 s > failures:
  743. 52.07 s > tests::persistent_rustdoc_target_rejects_symlink_escape
  744. 52.07 s >
  745. 52.07 s > test result: FAILED. 0 passed; 1 failed; 0 ignored; 0 measured; 118 filtered out; finished in 0.00s
  746. 52.07 s >
  747. 52.07 s > stderr ---
  748. 52.07 s >
  749. 52.07 s > thread 'tests::persistent_rustdoc_target_rejects_symlink_escape' (350) panicked at crates/alphal00p-docs-builder/src/lib.rs:10490:82:
  750. 52.07 s > called `Result::unwrap_err()` on an `Ok` value: "/build/.tmpP0jBmQ/escape/cache/cargo-target-v1"
  751. 52.07 s > stack backtrace:
  752. 52.07 s > 0: __rustc::rust_begin_unwind
  753. 52.07 s > 1: core::panicking::panic_fmt
  754. 52.07 s > 2: core::result::unwrap_failed
  755. 52.07 s > 3: alphal00p_docs_builder::tests::persistent_rustdoc_target_rejects_symlink_escape
  756. 52.07 s > 4: <alphal00p_docs_builder::tests::persistent_rustdoc_target_rejects_symlink_escape::{closure#0} as core::ops::function::FnOnce<()>>::call_once
  757. 52.07 s > note: Some details are omitted, run with `RUST_BACKTRACE=full` for a verbose backtrace.
  758. 52.07 s >
  759. 52.07 s > FAIL [ 0.007s] ( 47/119) alphal00p-docs-builder tests::persistent_rustdoc_targets_reject_workspace_and_arbitrary_roots
  760. 52.07 s > stdout ---
  761. 52.07 s >
  762. 52.07 s > running 1 test
  763. 52.07 s > test tests::persistent_rustdoc_targets_reject_workspace_and_arbitrary_roots ... FAILED
  764. 52.07 s >
  765. 52.07 s > failures:
  766. 52.07 s >
  767. 52.07 s > failures:
  768. 52.07 s > tests::persistent_rustdoc_targets_reject_workspace_and_arbitrary_roots
  769. 52.07 s >
  770. 52.07 s > test result: FAILED. 0 passed; 1 failed; 0 ignored; 0 measured; 118 filtered out; finished in 0.00s
  771. 52.07 s >
  772. 52.07 s > stderr ---
  773. 52.07 s >
  774. 52.07 s > thread 'tests::persistent_rustdoc_targets_reject_workspace_and_arbitrary_roots' (356) panicked at crates/alphal00p-docs-builder/src/lib.rs:10467:9:
  775. 52.07 s > assertion failed: prepare_persistent_rustdoc_target(workspace, &arbitrary).is_err()
  776. 52.07 s > stack backtrace:
  777. 52.07 s > 0: __rustc::rust_begin_unwind
  778. 52.07 s > 1: core::panicking::panic_fmt
  779. 52.07 s > 2: core::panicking::panic
  780. 52.07 s > 3: alphal00p_docs_builder::tests::persistent_rustdoc_targets_reject_workspace_and_arbitrary_roots
  781. 52.07 s > 4: <alphal00p_docs_builder::tests::persistent_rustdoc_targets_reject_workspace_and_arbitrary_roots::{closure#0} as core::ops::function::FnOnce<()>>::call_once
  782. 52.07 s > note: Some details are omitted, run with `RUST_BACKTRACE=full` for a verbose backtrace.
  783. 52.07 s >
  784. 52.07 s > FAIL [ 0.063s] ( 68/119) alphal00p-docs-builder tests::portal_and_developer_pages_use_federated_search_and_feedback
  785. 52.07 s > stdout ---
  786. 52.07 s >
  787. 52.07 s > running 1 test
  788. 52.07 s > test tests::portal_and_developer_pages_use_federated_search_and_feedback ... FAILED
  789. 52.07 s >
  790. 52.07 s > failures:
  791. 52.07 s >
  792. 52.07 s > failures:
  793. 52.07 s > tests::portal_and_developer_pages_use_federated_search_and_feedback
  794. 52.07 s >
  795. 52.07 s > test result: FAILED. 0 passed; 1 failed; 0 ignored; 0 measured; 118 filtered out; finished in 0.06s
  796. 52.07 s >
  797. 52.07 s > stderr ---
  798. 52.07 s > warning: bundle export is experimental
  799. 52.08 s > = hint: its behaviour may change at any time
  800. 52.08 s > = hint: do not rely on this feature for production use cases
  801. 52.08 s >
  802. 52.08 s >
  803. 52.08 s > thread 'tests::portal_and_developer_pages_use_federated_search_and_feedback' (353) panicked at crates/alphal00p-docs-builder/src/lib.rs:12758:14:
  804. 52.08 s > called `Result::unwrap()` on an `Err` value: cannot determine the documented Git commit; set ALPHAL00P_DOCS_GIT_COMMIT
  805. 52.08 s >
  806. 52.08 s > Location:
  807. 52.08 s > crates/alphal00p-docs-builder/src/lib.rs:4137:9
  808. 52.08 s > stack backtrace:
  809. 52.08 s > 0: __rustc::rust_begin_unwind
  810. 52.08 s > 1: core::panicking::panic_fmt
  811. 52.08 s > 2: core::result::unwrap_failed
  812. 52.08 s > 3: alphal00p_docs_builder::tests::portal_and_developer_pages_use_federated_search_and_feedback
  813. 52.08 s > 4: <alphal00p_docs_builder::tests::portal_and_developer_pages_use_federated_search_and_feedback::{closure#0} as core::ops::function::FnOnce<()>>::call_once
  814. 52.08 s > note: Some details are omitted, run with `RUST_BACKTRACE=full` for a verbose backtrace.
  815. 52.08 s >
  816. 52.08 s > FAIL [ 12.631s] (118/119) alphal00p-docs-builder tests::every_product_orients_rust_to_native_rustdoc_and_keeps_legacy_redirects
  817. 52.08 s > stdout ---
  818. 52.08 s >
  819. 52.08 s > running 1 test
  820. 52.08 s > test tests::every_product_orients_rust_to_native_rustdoc_and_keeps_legacy_redirects ... FAILED
  821. 52.08 s >
  822. 52.08 s > failures:
  823. 52.08 s >
  824. 52.08 s > failures:
  825. 52.08 s > tests::every_product_orients_rust_to_native_rustdoc_and_keeps_legacy_redirects
  826. 52.08 s >
  827. 52.08 s > test result: FAILED. 0 passed; 1 failed; 0 ignored; 0 measured; 118 filtered out; finished in 12.63s
  828. 52.08 s >
  829. 52.08 s > stderr ---
  830. 52.08 s >
  831. 52.08 s > thread 'tests::every_product_orients_rust_to_native_rustdoc_and_keeps_legacy_redirects' (261) panicked at crates/alphal00p-docs-builder/src/lib.rs:12166:18:
  832. 52.08 s > called `Result::unwrap()` on an `Err` value: cannot determine the documented Git commit; set ALPHAL00P_DOCS_GIT_COMMIT
  833. 52.08 s >
  834. 52.08 s > Location:
  835. 52.08 s > crates/alphal00p-docs-builder/src/lib.rs:2054:9
  836. 52.08 s > stack backtrace:
  837. 52.08 s > 0: __rustc::rust_begin_unwind
  838. 52.08 s > 1: core::panicking::panic_fmt
  839. 52.08 s > 2: core::result::unwrap_failed
  840. 52.08 s > 3: alphal00p_docs_builder::tests::every_product_orients_rust_to_native_rustdoc_and_keeps_legacy_redirects
  841. 52.08 s > 4: <alphal00p_docs_builder::tests::every_product_orients_rust_to_native_rustdoc_and_keeps_legacy_redirects::{closure#0} as core::ops::function::FnOnce<()>>::call_once
  842. 52.08 s > note: Some details are omitted, run with `RUST_BACKTRACE=full` for a verbose backtrace.
  843. 52.08 s >
  844. 52.08 s > error: test run failed
  845. 52.08 s >
  846. 52.08 s > ========== nextest test summary ==========
  847. 52.08 s > report: target/nextest/ci_gammaloop/junit.xml
  848. 52.08 s > tests: 119, failures: 5, errors: 0
  849. 52.08 s >
  850. 52.08 s > 1. alphal00p-docs-builder::tests::developer_architecture_is_classified_searchable_and_source_backed
  851. 52.08 s > failure: test failure with exit code 101
  852. 52.08 s > thread 'tests::developer_architecture_is_classified_searchable_and_source_backed' (248) panicked at crates/alphal00p-docs-builder/src/lib.rs:12354:14:
  853. 52.08 s > called `Result::unwrap()` on an `Err` value: cannot determine the documented Git commit; set ALPHAL00P_DOCS_GIT_COMMIT
  854. 52.08 s >
  855. 52.08 s > Location:
  856. 52.08 s > crates/alphal00p-docs-builder/src/lib.rs:4137:9
  857. 52.08 s > stack backtrace:
  858. 52.08 s > 0: __rustc::rust_begin_unwind
  859. 52.08 s > 1: core::panicking::panic_fmt
  860. 52.08 s > 2: core::result::unwrap_failed
  861. 52.08 s > 3: alphal00p_docs_builder::tests::developer_architecture_is_classified_searchable_and_source_backed
  862. 52.08 s > 4: <alphal00p_docs_builder::tests::developer_architecture_is_classified_searchable_and_source_backed::{closure#0} as core::ops::function::FnOnce<()>>::call_once
  863. 52.08 s > note: Some details are omitted, run with `RUST_BACKTRACE=full` for a verbose backtrace.
  864. 52.08 s > system-out
  865. 52.08 s > running 1 test
  866. 52.08 s > test tests::developer_architecture_is_classified_searchable_and_source_backed ... FAILED
  867. 52.08 s >
  868. 52.08 s > failures:
  869. 52.08 s >
  870. 52.08 s > failures:
  871. 52.08 s > tests::developer_architecture_is_classified_searchable_and_source_backed
  872. 52.08 s >
  873. 52.08 s > test result: FAILED. 0 passed; 1 failed; 0 ignored; 0 measured; 118 filtered out; finished in 0.01s
  874. 52.08 s > system-err
  875. 52.08 s > thread 'tests::developer_architecture_is_classified_searchable_and_source_backed' (248) panicked at crates/alphal00p-docs-builder/src/lib.rs:12354:14:
  876. 52.08 s > called `Result::unwrap()` on an `Err` value: cannot determine the documented Git commit; set ALPHAL00P_DOCS_GIT_COMMIT
  877. 52.08 s >
  878. 52.08 s > Location:
  879. 52.08 s > crates/alphal00p-docs-builder/src/lib.rs:4137:9
  880. 52.08 s > stack backtrace:
  881. 52.08 s > 0: __rustc::rust_begin_unwind
  882. 52.08 s > 1: core::panicking::panic_fmt
  883. 52.08 s > 2: core::result::unwrap_failed
  884. 52.08 s > 3: alphal00p_docs_builder::tests::developer_architecture_is_classified_searchable_and_source_backed
  885. 52.08 s > 4: <alphal00p_docs_builder::tests::developer_architecture_is_classified_searchable_and_source_backed::{closure#0} as core::ops::function::FnOnce<()>>::call_once
  886. 52.08 s > note: Some details are omitted, run with `RUST_BACKTRACE=full` for a verbose backtrace.
  887. 52.08 s >
  888. 52.08 s > 2. alphal00p-docs-builder::tests::persistent_rustdoc_target_rejects_symlink_escape
  889. 52.08 s > failure: test failure with exit code 101
  890. 52.08 s > thread 'tests::persistent_rustdoc_target_rejects_symlink_escape' (350) panicked at crates/alphal00p-docs-builder/src/lib.rs:10490:82:
  891. 52.08 s > called `Result::unwrap_err()` on an `Ok` value: "/build/.tmpP0jBmQ/escape/cache/cargo-target-v1"
  892. 52.08 s > stack backtrace:
  893. 52.08 s > 0: __rustc::rust_begin_unwind
  894. 52.08 s > 1: core::panicking::panic_fmt
  895. 52.08 s > 2: core::result::unwrap_failed
  896. 52.08 s > 3: alphal00p_docs_builder::tests::persistent_rustdoc_target_rejects_symlink_escape
  897. 52.08 s > 4: <alphal00p_docs_builder::tests::persistent_rustdoc_target_rejects_symlink_escape::{closure#0} as core::ops::function::FnOnce<()>>::call_once
  898. 52.08 s > note: Some details are omitted, run with `RUST_BACKTRACE=full` for a verbose backtrace.
  899. 52.08 s > system-out
  900. 52.08 s > running 1 test
  901. 52.08 s > test tests::persistent_rustdoc_target_rejects_symlink_escape ... FAILED
  902. 52.08 s >
  903. 52.08 s > failures:
  904. 52.08 s >
  905. 52.08 s > failures:
  906. 52.08 s > tests::persistent_rustdoc_target_rejects_symlink_escape
  907. 52.08 s >
  908. 52.08 s > test result: FAILED. 0 passed; 1 failed; 0 ignored; 0 measured; 118 filtered out; finished in 0.00s
  909. 52.08 s > system-err
  910. 52.08 s > thread 'tests::persistent_rustdoc_target_rejects_symlink_escape' (350) panicked at crates/alphal00p-docs-builder/src/lib.rs:10490:82:
  911. 52.08 s > called `Result::unwrap_err()` on an `Ok` value: "/build/.tmpP0jBmQ/escape/cache/cargo-target-v1"
  912. 52.08 s > stack backtrace:
  913. 52.08 s > 0: __rustc::rust_begin_unwind
  914. 52.08 s > 1: core::panicking::panic_fmt
  915. 52.08 s > 2: core::result::unwrap_failed
  916. 52.08 s > 3: alphal00p_docs_builder::tests::persistent_rustdoc_target_rejects_symlink_escape
  917. 52.08 s > 4: <alphal00p_docs_builder::tests::persistent_rustdoc_target_rejects_symlink_escape::{closure#0} as core::ops::function::FnOnce<()>>::call_once
  918. 52.08 s > note: Some details are omitted, run with `RUST_BACKTRACE=full` for a verbose backtrace.
  919. 52.08 s >
  920. 52.08 s > 3. alphal00p-docs-builder::tests::persistent_rustdoc_targets_reject_workspace_and_arbitrary_roots
  921. 52.08 s > failure: test failure with exit code 101
  922. 52.08 s > thread 'tests::persistent_rustdoc_targets_reject_workspace_and_arbitrary_roots' (356) panicked at crates/alphal00p-docs-builder/src/lib.rs:10467:9:
  923. 52.08 s > assertion failed: prepare_persistent_rustdoc_target(workspace, &arbitrary).is_err()
  924. 52.08 s > stack backtrace:
  925. 52.08 s > 0: __rustc::rust_begin_unwind
  926. 52.08 s > 1: core::panicking::panic_fmt
  927. 52.08 s > 2: core::panicking::panic
  928. 52.08 s > 3: alphal00p_docs_builder::tests::persistent_rustdoc_targets_reject_workspace_and_arbitrary_roots
  929. 52.08 s > 4: <alphal00p_docs_builder::tests::persistent_rustdoc_targets_reject_workspace_and_arbitrary_roots::{closure#0} as core::ops::function::FnOnce<()>>::call_once
  930. 52.08 s > note: Some details are omitted, run with `RUST_BACKTRACE=full` for a verbose backtrace.
  931. 52.08 s > system-out
  932. 52.08 s > running 1 test
  933. 52.08 s > test tests::persistent_rustdoc_targets_reject_workspace_and_arbitrary_roots ... FAILED
  934. 52.08 s >
  935. 52.08 s > failures:
  936. 52.08 s >
  937. 52.08 s > failures:
  938. 52.08 s > tests::persistent_rustdoc_targets_reject_workspace_and_arbitrary_roots
  939. 52.08 s >
  940. 52.08 s > test result: FAILED. 0 passed; 1 failed; 0 ignored; 0 measured; 118 filtered out; finished in 0.00s
  941. 52.08 s > system-err
  942. 52.08 s > thread 'tests::persistent_rustdoc_targets_reject_workspace_and_arbitrary_roots' (356) panicked at crates/alphal00p-docs-builder/src/lib.rs:10467:9:
  943. 52.08 s > assertion failed: prepare_persistent_rustdoc_target(workspace, &arbitrary).is_err()
  944. 52.08 s > stack backtrace:
  945. 52.08 s > 0: __rustc::rust_begin_unwind
  946. 52.08 s > 1: core::panicking::panic_fmt
  947. 52.08 s > 2: core::panicking::panic
  948. 52.08 s > 3: alphal00p_docs_builder::tests::persistent_rustdoc_targets_reject_workspace_and_arbitrary_roots
  949. 52.08 s > 4: <alphal00p_docs_builder::tests::persistent_rustdoc_targets_reject_workspace_and_arbitrary_roots::{closure#0} as core::ops::function::FnOnce<()>>::call_once
  950. 52.08 s > note: Some details are omitted, run with `RUST_BACKTRACE=full` for a verbose backtrace.
  951. 52.08 s >
  952. 52.08 s > 4. alphal00p-docs-builder::tests::portal_and_developer_pages_use_federated_search_and_feedback
  953. 52.08 s > failure: test failure with exit code 101
  954. 52.08 s > thread 'tests::portal_and_developer_pages_use_federated_search_and_feedback' (353) panicked at crates/alphal00p-docs-builder/src/lib.rs:12758:14:
  955. 52.08 s > called `Result::unwrap()` on an `Err` value: cannot determine the documented Git commit; set ALPHAL00P_DOCS_GIT_COMMIT
  956. 52.08 s >
  957. 52.08 s > Location:
  958. 52.08 s > crates/alphal00p-docs-builder/src/lib.rs:4137:9
  959. 52.08 s > stack backtrace:
  960. 52.08 s > 0: __rustc::rust_begin_unwind
  961. 52.08 s > 1: core::panicking::panic_fmt
  962. 52.08 s > 2: core::result::unwrap_failed
  963. 52.08 s > 3: alphal00p_docs_builder::tests::portal_and_developer_pages_use_federated_search_and_feedback
  964. 52.08 s > 4: <alphal00p_docs_builder::tests::portal_and_developer_pages_use_federated_search_and_feedback::{closure#0} as core::ops::function::FnOnce<()>>::call_once
  965. 52.08 s > note: Some details are omitted, run with `RUST_BACKTRACE=full` for a verbose backtrace.
  966. 52.08 s > system-out
  967. 52.08 s > running 1 test
  968. 52.08 s > test tests::portal_and_developer_pages_use_federated_search_and_feedback ... FAILED
  969. 52.08 s >
  970. 52.08 s > failures:
  971. 52.08 s >
  972. 52.08 s > failures:
  973. 52.08 s > tests::portal_and_developer_pages_use_federated_search_and_feedback
  974. 52.08 s >
  975. 52.08 s > test result: FAILED. 0 passed; 1 failed; 0 ignored; 0 measured; 118 filtered out; finished in 0.06s
  976. 52.08 s > system-err
  977. 52.08 s > warning: bundle export is experimental
  978. 52.08 s > = hint: its behaviour may change at any time
  979. 52.08 s > = hint: do not rely on this feature for production use cases
  980. 52.08 s >
  981. 52.08 s >
  982. 52.08 s > thread 'tests::portal_and_developer_pages_use_federated_search_and_feedback' (353) panicked at crates/alphal00p-docs-builder/src/lib.rs:12758:14:
  983. 52.08 s > called `Result::unwrap()` on an `Err` value: cannot determine the documented Git commit; set ALPHAL00P_DOCS_GIT_COMMIT
  984. 52.08 s >
  985. 52.08 s > Location:
  986. 52.08 s > crates/alphal00p-docs-builder/src/lib.rs:4137:9
  987. 52.08 s > stack backtrace:
  988. 52.08 s > 0: __rustc::rust_begin_unwind
  989. 52.08 s > 1: core::panicking::panic_fmt
  990. 52.08 s > 2: core::result::unwrap_failed
  991. 52.08 s > 3: alphal00p_docs_builder::tests::portal_and_developer_pages_use_federated_search_and_feedback
  992. 52.08 s > 4: <alphal00p_docs_builder::tests::portal_and_developer_pages_use_federated_search_and_feedback::{closure#0} as core::ops::function::FnOnce<()>>::call_once
  993. 52.08 s > note: Some details are omitted, run with `RUST_BACKTRACE=full` for a verbose backtrace.
  994. 52.08 s >
  995. 52.08 s > 5. alphal00p-docs-builder::tests::every_product_orients_rust_to_native_rustdoc_and_keeps_legacy_redirects
  996. 52.08 s > failure: test failure with exit code 101
  997. 52.08 s > thread 'tests::every_product_orients_rust_to_native_rustdoc_and_keeps_legacy_redirects' (261) panicked at crates/alphal00p-docs-builder/src/lib.rs:12166:18:
  998. 52.08 s > called `Result::unwrap()` on an `Err` value: cannot determine the documented Git commit; set ALPHAL00P_DOCS_GIT_COMMIT
  999. 52.08 s >
  1000. 52.08 s > Location:
  1001. 52.08 s > crates/alphal00p-docs-builder/src/lib.rs:2054:9
  1002. 52.08 s > stack backtrace:
  1003. 52.08 s > 0: __rustc::rust_begin_unwind
  1004. 52.08 s > 1: core::panicking::panic_fmt
  1005. 52.08 s > 2: core::result::unwrap_failed
  1006. 52.08 s > 3: alphal00p_docs_builder::tests::every_product_orients_rust_to_native_rustdoc_and_keeps_legacy_redirects
  1007. 52.08 s > 4: <alphal00p_docs_builder::tests::every_product_orients_rust_to_native_rustdoc_and_keeps_legacy_redirects::{closure#0} as core::ops::function::FnOnce<()>>::call_once
  1008. 52.08 s > note: Some details are omitted, run with `RUST_BACKTRACE=full` for a verbose backtrace.
  1009. 52.08 s > system-out
  1010. 52.08 s > running 1 test
  1011. 52.08 s > test tests::every_product_orients_rust_to_native_rustdoc_and_keeps_legacy_redirects ... FAILED
  1012. 52.08 s >
  1013. 52.08 s > failures:
  1014. 52.08 s >
  1015. 52.08 s > failures:
  1016. 52.08 s > tests::every_product_orients_rust_to_native_rustdoc_and_keeps_legacy_redirects
  1017. 52.08 s >
  1018. 52.08 s > test result: FAILED. 0 passed; 1 failed; 0 ignored; 0 measured; 118 filtered out; finished in 12.63s
  1019. 52.08 s > system-err
  1020. 52.08 s > thread 'tests::every_product_orients_rust_to_native_rustdoc_and_keeps_legacy_redirects' (261) panicked at crates/alphal00p-docs-builder/src/lib.rs:12166:18:
  1021. 52.08 s > called `Result::unwrap()` on an `Err` value: cannot determine the documented Git commit; set ALPHAL00P_DOCS_GIT_COMMIT
  1022. 52.08 s >
  1023. 52.08 s > Location:
  1024. 52.08 s > crates/alphal00p-docs-builder/src/lib.rs:2054:9
  1025. 52.08 s > stack backtrace:
  1026. 52.08 s > 0: __rustc::rust_begin_unwind
  1027. 52.08 s > 1: core::panicking::panic_fmt
  1028. 52.08 s > 2: core::result::unwrap_failed
  1029. 52.08 s > 3: alphal00p_docs_builder::tests::every_product_orients_rust_to_native_rustdoc_and_keeps_legacy_redirects
  1030. 52.08 s > 4: <alphal00p_docs_builder::tests::every_product_orients_rust_to_native_rustdoc_and_keeps_legacy_redirects::{closure#0} as core::ops::function::FnOnce<()>>::call_once
  1031. 52.08 s > note: Some details are omitted, run with `RUST_BACKTRACE=full` for a verbose backtrace.
  1032. 52.08 s > =========================================
  1033. 52.08 s > Extracting 2 binaries to /build/nextest-archive-ePw8S4
  1034. 52.08 s > Extracted 5 files to /build/nextest-archive-ePw8S4 in 0.04s
  1035. 52.08 s > ------------
  1036. 52.08 s > Nextest run ID 168a535e-273b-4ad7-aa7d-59cfa56c6ca6 with nextest profile: ci_gammaloop
  1037. 52.08 s > Starting 21 tests across 2 binaries
  1038. 52.08 s > ------------
  1039. 52.08 s > Summary [ 0.015s] 21 tests run: 21 passed, 0 skipped
  1040. 52.08 s >
  1041. 52.08 s > ========== nextest test summary ==========
  1042. 52.08 s > report: target/nextest/ci_gammaloop/junit.xml
  1043. 52.08 s > tests: 21, failures: 0, errors: 0
  1044. 52.08 s > No failing testcases found.
  1045. 52.08 s > =========================================
  1046. 52.08 s > Extracting 3 binaries (including 2 non-test binaries), 1 build script output directory, and 2 linked paths to /build/nextest-archive-zwLSjs
  1047. 52.08 s > Extracted 22 files to /build/nextest-archive-zwLSjs in 0.24s
  1048. 52.08 s > ------------
  1049. 52.08 s > Nextest run ID 15cd9d6e-5ed1-40d6-a24f-2ece0ec90002 with nextest profile: ci_gammaloop
  1050. 52.08 s > Starting 89 tests across 1 binary
  1051. 52.08 s > ------------
  1052. 52.08 s > Summary [ 0.037s] 89 tests run: 89 passed, 0 skipped
  1053. 52.08 s >
  1054. 52.08 s > ========== nextest test summary ==========
  1055. 52.08 s > report: target/nextest/ci_gammaloop/junit.xml
  1056. 52.08 s > tests: 89, failures: 0, errors: 0
  1057. 52.08 s > No failing testcases found.
  1058. 52.08 s > =========================================
  1059. 52.08 s > Extracting 2 binaries to /build/nextest-archive-HfxznJ
  1060. 52.08 s > Extracted 5 files to /build/nextest-archive-HfxznJ in 0.04s
  1061. 52.08 s > ------------
  1062. 52.08 s > Nextest run ID 1299a1fb-2dbe-4182-bf54-00ff27b3c7b1 with nextest profile: ci_gammaloop
  1063. 52.08 s > Starting 10 tests across 2 binaries
  1064. 52.08 s > ------------
  1065. 52.08 s > Summary [ 14.450s] 10 tests run: 10 passed, 0 skipped
  1066. 52.08 s >
  1067. 52.08 s > ========== nextest test summary ==========
  1068. 52.08 s > report: target/nextest/ci_gammaloop/junit.xml
  1069. 52.08 s > tests: 10, failures: 0, errors: 0
  1070. 52.08 s > No failing testcases found.
  1071. 52.08 s > =========================================
  1072. 52.08 s > Extracting 1 binary to /build/nextest-archive-XSz6ZR
  1073. 52.08 s > Extracted 4 files to /build/nextest-archive-XSz6ZR in 0.03s
  1074. 52.08 s > ------------
  1075. 52.08 s > Nextest run ID 9750a0b7-14b4-4c08-97b7-eb4492e058be with nextest profile: ci_gammaloop
  1076. 52.08 s > Starting 0 tests across 1 binary
  1077. 52.08 s > ------------
  1078. 52.08 s > Summary [ 0.000s] 0 tests run: 0 passed, 0 skipped
  1079. 52.08 s >
  1080. 52.08 s > ========== nextest test summary ==========
  1081. 52.08 s > report: target/nextest/ci_gammaloop/junit.xml
  1082. 52.08 s > tests: 0, failures: 0, errors: 0
  1083. 52.08 s > No failing testcases found.
  1084. 52.08 s > =========================================
  1085. 52.08 s > Extracting 1 binary to /build/nextest-archive-06orrs
  1086. 52.08 s > Extracted 4 files to /build/nextest-archive-06orrs in 0.04s
  1087. 52.08 s > ------------
  1088. 52.08 s > Nextest run ID 3c554ecb-9e0b-456f-9141-0a5ee71c9670 with nextest profile: ci_gammaloop
  1089. 52.08 s > Starting 4 tests across 1 binary
  1090. 52.08 s > ------------
  1091. 52.08 s > Summary [ 0.005s] 4 tests run: 4 passed, 0 skipped
  1092. 52.08 s >
  1093. 52.08 s > ========== nextest test summary ==========
  1094. 52.08 s > report: target/nextest/ci_gammaloop/junit.xml
  1095. 52.08 s > tests: 4, failures: 0, errors: 0
  1096. 52.08 s > No failing testcases found.
  1097. 52.08 s > =========================================
  1098. 52.08 s For full logs, run:
  1099. 52.08 s nix log /nix/store/97637lakc6i3dvs2xjwvp87fmqr4wngc-gammaloop-nextest-docs.drv
  1100. 52.25 s [0 built (1 failed), 42 Run failed.