0.37 s
$ /nix/store/9ypz3flqsrl5xl495mm8h645gadjsxi1-coreutils-9.11/bin/timeout --kill-after=15s 7200s /nix/store/23zk8sgzamrbmj1fday15szf7f2279s8-nix-2.34.7/bin/nix --extra-experimental-features nix-command --extra-experimental-features flakes flake clone git+https://github.com/alphal00p/gammaloop --dest /tmp/nix-ci-worker/stable-pwd/repo/
0.60 s
Cloning into '/tmp/nix-ci-worker/stable-pwd/repo'...
1.82 s
remote: Enumerating objects: 81172, done.
1.93 s
remote: Counting objects: 0% (1/10767)
remote: Counting objects: 1% (108/10767)
remote: Counting objects: 2% (216/10767)
remote: Counting objects: 3% (324/10767)
remote: Counting objects: 4% (431/10767)
remote: Counting objects: 5% (539/10767)
remote: Counting objects: 6% (647/10767)
remote: Counting objects: 7% (754/10767)
remote: Counting objects: 8% (862/10767)
remote: Counting objects: 9% (970/10767)
remote: Counting objects: 10% (1077/10767)
remote: Counting objects: 11% (1185/10767)
remote: Counting objects: 12% (1293/10767)
remote: Counting objects: 13% (1400/10767)
remote: Counting objects: 14% (1508/10767)
remote: Counting objects: 15% (1616/10767)
remote: Counting objects: 16% (1723/10767)
remote: Counting objects: 17% (1831/10767)
remote: Counting objects: 18% (1939/10767)
remote: Counting objects: 19% (2046/10767)
remote: Counting objects: 20% (2154/10767)
remote: Counting objects: 21% (2262/10767)
remote: Counting objects: 22% (2369/10767)
remote: Counting objects: 23% (2477/10767)
remote: Counting objects: 24% (2585/10767)
remote: Counting objects: 25% (2692/10767)
remote: Counting objects: 26% (2800/10767)
remote: Counting objects: 27% (2908/10767)
remote: Counting objects: 28% (3015/10767)
remote: Counting objects: 29% (3123/10767)
remote: Counting objects: 30% (3231/10767)
remote: Counting objects: 31% (3338/10767)
remote: Counting objects: 32% (3446/10767)
remote: Counting objects: 33% (3554/10767)
remote: Counting objects: 34% (3661/10767)
remote: Counting objects: 35% (3769/10767)
remote: Counting objects: 36% (3877/10767)
remote: Counting objects: 37% (3984/10767)
remote: Counting objects: 38% (4092/10767)
remote: Counting objects: 39% (4200/10767)
remote: Counting objects: 40% (4307/10767)
remote: Counting objects: 41% (4415/10767)
remote: Counting objects: 42% (4523/10767)
remote: Counting objects: 43% (4630/10767)
remote: Counting objects: 44% (4738/10767)
remote: Counting objects: 45% (4846/10767)
remote: Counting objects: 46% (4953/10767)
remote: Counting objects: 47% (5061/10767)
remote: Counting objects: 48% (5169/10767)
remote: Counting objects: 49% (5276/10767)
remote: Counting objects: 50% (5384/10767)
remote: Counting objects: 51% (5492/10767)
remote: Counting objects: 52% (5599/10767)
remote: Counting objects: 53% (5707/10767)
remote: Counting objects: 54% (5815/10767)
remote: Counting objects: 55% (5922/10767)
remote: Counting objects: 56% (6030/10767)
remote: Counting objects: 57% (6138/10767)
remote: Counting objects: 58% (6245/10767)
remote: Counting objects: 59% (6353/10767)
remote: Counting objects: 60% (6461/10767)
remote: Counting objects: 61% (6568/10767)
remote: Counting objects: 62% (6676/10767)
remote: Counting objects: 63% (6784/10767)
remote: Counting objects: 64% (6891/10767)
remote: Counting objects: 65% (6999/10767)
remote: Counting objects: 66% (7107/10767)
remote: Counting objects: 67% (7214/10767)
remote: Counting objects: 68% (7322/10767)
remote: Counting objects: 69% (7430/10767)
remote: Counting objects: 70% (7537/10767)
remote: Counting objects: 71% (7645/10767)
remote: Counting objects: 72% (7753/10767)
remote: Counting objects: 73% (7860/10767)
remote: Counting objects: 74% (7968/10767)
remote: Counting objects: 75% (8076/10767)
remote: Counting objects: 76% (8183/10767)
remote: Counting objects: 77% (8291/10767)
remote: Counting objects: 78% (8399/10767)
remote: Counting objects: 79% (8506/10767)
remote: Counting objects: 80% (8614/10767)
remote: Counting objects: 81% (8722/10767)
remote: Counting objects: 82% (8829/10767)
remote: Counting objects: 83% (8937/10767)
remote: Counting objects: 84% (9045/10767)
remote: Counting objects: 85% (9152/10767)
remote: Counting objects: 86% (9260/10767)
remote: Counting objects: 87% (9368/10767)
remote: Counting objects: 88% (9475/10767)
remote: Counting objects: 89% (9583/10767)
remote: Counting objects: 90% (9691/10767)
remote: Counting objects: 91% (9798/10767)
remote: Counting objects: 92% (9906/10767)
remote: Counting objects: 93% (10014/10767)
remote: Counting objects: 94% (10121/10767)
remote: Counting objects: 95% (10229/10767)
remote: Counting objects: 96% (10337/10767)
remote: Counting objects: 97% (10444/10767)
remote: Counting objects: 98% (10552/10767)
remote: Counting objects: 99% (10660/10767)
remote: Counting objects: 100% (10767/10767)
remote: Counting objects: 100% (10767/10767), done.
4.33 s
remote: Compressing objects: 0% (1/2501)
remote: Compressing objects: 1% (26/2501)
remote: Compressing objects: 2% (51/2501)
remote: Compressing objects: 3% (76/2501)
remote: Compressing objects: 4% (101/2501)
remote: Compressing objects: 5% (126/2501)
remote: Compressing objects: 6% (151/2501)
remote: Compressing objects: 7% (176/2501)
remote: Compressing objects: 8% (201/2501)
remote: Compressing objects: 9% (226/2501)
remote: Compressing objects: 10% (251/2501)
remote: Compressing objects: 11% (276/2501)
remote: Compressing objects: 12% (301/2501)
remote: Compressing objects: 13% (326/2501)
remote: Compressing objects: 14% (351/2501)
remote: Compressing objects: 15% (376/2501)
remote: Compressing objects: 16% (401/2501)
remote: Compressing objects: 17% (426/2501)
remote: Compressing objects: 18% (451/2501)
remote: Compressing objects: 19% (476/2501)
remote: Compressing objects: 20% (501/2501)
remote: Compressing objects: 20% (504/2501)
remote: Compressing objects: 21% (526/2501)
remote: Compressing objects: 22% (551/2501)
remote: Compressing objects: 23% (576/2501)
remote: Compressing objects: 24% (601/2501)
remote: Compressing objects: 25% (626/2501)
remote: Compressing objects: 26% (651/2501)
remote: Compressing objects: 26% (674/2501)
remote: Compressing objects: 27% (676/2501)
remote: Compressing objects: 28% (701/2501)
remote: Compressing objects: 29% (726/2501)
remote: Compressing objects: 30% (751/2501)
remote: Compressing objects: 31% (776/2501)
remote: Compressing objects: 32% (801/2501)
remote: Compressing objects: 33% (826/2501)
remote: Compressing objects: 34% (851/2501)
remote: Compressing objects: 35% (876/2501)
remote: Compressing objects: 36% (901/2501)
remote: Compressing objects: 37% (926/2501)
remote: Compressing objects: 38% (951/2501)
remote: Compressing objects: 39% (976/2501)
remote: Compressing objects: 40% (1001/2501)
remote: Compressing objects: 41% (1026/2501)
remote: Compressing objects: 42% (1051/2501)
remote: Compressing objects: 43% (1076/2501)
remote: Compressing objects: 44% (1101/2501)
remote: Compressing objects: 45% (1126/2501)
remote: Compressing objects: 46% (1151/2501)
remote: Compressing objects: 47% (1176/2501)
remote: Compressing objects: 48% (1201/2501)
remote: Compressing objects: 49% (1226/2501)
remote: Compressing objects: 50% (1251/2501)
remote: Compressing objects: 51% (1276/2501)
remote: Compressing objects: 52% (1301/2501)
remote: Compressing objects: 53% (1326/2501)
remote: Compressing objects: 54% (1351/2501)
remote: Compressing objects: 55% (1376/2501)
remote: Compressing objects: 56% (1401/2501)
remote: Compressing objects: 57% (1426/2501)
remote: Compressing objects: 58% (1451/2501)
remote: Compressing objects: 59% (1476/2501)
remote: Compressing objects: 60% (1501/2501)
remote: Compressing objects: 61% (1526/2501)
remote: Compressing objects: 62% (1551/2501)
remote: Compressing objects: 63% (1576/2501)
remote: Compressing objects: 64% (1601/2501)
remote: Compressing objects: 65% (1626/2501)
remote: Compressing objects: 66% (1651/2501)
remote: Compressing objects: 67% (1676/2501)
remote: Compressing objects: 68% (1701/2501)
remote: Compressing objects: 69% (1726/2501)
remote: Compressing objects: 70% (1751/2501)
remote: Compressing objects: 71% (1776/2501)
remote: Compressing objects: 72% (1801/2501)
remote: Compressing objects: 73% (1826/2501)
remote: Compressing objects: 74% (1851/2501)
remote: Compressing objects: 75% (1876/2501)
remote: Compressing objects: 76% (1901/2501)
remote: Compressing objects: 77% (1926/2501)
remote: Compressing objects: 78% (1951/2501)
remote: Compressing objects: 79% (1976/2501)
remote: Compressing objects: 80% (2001/2501)
remote: Compressing objects: 81% (2026/2501)
remote: Compressing objects: 82% (2051/2501)
remote: Compressing objects: 83% (2076/2501)
remote: Compressing objects: 84% (2101/2501)
remote: Compressing objects: 85% (2126/2501)
remote: Compressing objects: 86% (2151/2501)
remote: Compressing objects: 87% (2176/2501)
remote: Compressing objects: 88% (2201/2501)
remote: Compressing objects: 89% (2226/2501)
remote: Compressing objects: 90% (2251/2501)
remote: Compressing objects: 91% (2276/2501)
remote: Compressing objects: 92% (2301/2501)
remote: Compressing objects: 93% (2326/2501)
remote: Compressing objects: 94% (2351/2501)
remote: Compressing objects: 95% (2376/2501)
remote: Compressing objects: 96% (2401/2501)
remote: Compressing objects: 97% (2426/2501)
remote: Compressing objects: 98% (2451/2501)
remote: Compressing objects: 99% (2476/2501)
remote: Compressing objects: 100% (2501/2501)
remote: Compressing objects: 100% (2501/2501), done.
8.48 s
Receiving objects: 0% (1/81172)
Receiving objects: 1% (812/81172)
Receiving objects: 2% (1624/81172)
Receiving objects: 3% (2436/81172)
Receiving objects: 4% (3247/81172)
Receiving objects: 5% (4059/81172)
Receiving objects: 6% (4871/81172), 9.21 MiB | 18.36 MiB/s
Receiving objects: 7% (5683/81172), 9.21 MiB | 18.36 MiB/s
Receiving objects: 8% (6494/81172), 9.21 MiB | 18.36 MiB/s
Receiving objects: 9% (7306/81172), 9.21 MiB | 18.36 MiB/s
Receiving objects: 10% (8118/81172), 9.21 MiB | 18.36 MiB/s
Receiving objects: 11% (8929/81172), 9.21 MiB | 18.36 MiB/s
Receiving objects: 12% (9741/81172), 9.21 MiB | 18.36 MiB/s
Receiving objects: 13% (10553/81172), 9.21 MiB | 18.36 MiB/s
Receiving objects: 14% (11365/81172), 9.21 MiB | 18.36 MiB/s
Receiving objects: 15% (12176/81172), 9.21 MiB | 18.36 MiB/s
Receiving objects: 16% (12988/81172), 9.21 MiB | 18.36 MiB/s
Receiving objects: 17% (13800/81172), 9.21 MiB | 18.36 MiB/s
Receiving objects: 18% (14611/81172), 9.21 MiB | 18.36 MiB/s
Receiving objects: 19% (15423/81172), 9.21 MiB | 18.36 MiB/s
Receiving objects: 20% (16235/81172), 9.21 MiB | 18.36 MiB/s
Receiving objects: 21% (17047/81172), 9.21 MiB | 18.36 MiB/s
Receiving objects: 22% (17858/81172), 9.21 MiB | 18.36 MiB/s
Receiving objects: 23% (18670/81172), 9.21 MiB | 18.36 MiB/s
Receiving objects: 24% (19482/81172), 9.21 MiB | 18.36 MiB/s
Receiving objects: 25% (20293/81172), 9.21 MiB | 18.36 MiB/s
Receiving objects: 26% (21105/81172), 9.21 MiB | 18.36 MiB/s
Receiving objects: 27% (21917/81172), 9.21 MiB | 18.36 MiB/s
Receiving objects: 27% (22441/81172), 9.21 MiB | 18.36 MiB/s
Receiving objects: 28% (22729/81172), 23.07 MiB | 23.07 MiB/s
Receiving objects: 29% (23540/81172), 23.07 MiB | 23.07 MiB/s
Receiving objects: 30% (24352/81172), 23.07 MiB | 23.07 MiB/s
Receiving objects: 31% (25164/81172), 23.07 MiB | 23.07 MiB/s
Receiving objects: 32% (25976/81172), 23.07 MiB | 23.07 MiB/s
Receiving objects: 33% (26787/81172), 23.07 MiB | 23.07 MiB/s
Receiving objects: 34% (27599/81172), 23.07 MiB | 23.07 MiB/s
Receiving objects: 35% (28411/81172), 23.07 MiB | 23.07 MiB/s
Receiving objects: 36% (29222/81172), 23.07 MiB | 23.07 MiB/s
Receiving objects: 37% (30034/81172), 23.07 MiB | 23.07 MiB/s
Receiving objects: 38% (30846/81172), 23.07 MiB | 23.07 MiB/s
Receiving objects: 39% (31658/81172), 23.07 MiB | 23.07 MiB/s
Receiving objects: 40% (32469/81172), 23.07 MiB | 23.07 MiB/s
Receiving objects: 41% (33281/81172), 23.07 MiB | 23.07 MiB/s
Receiving objects: 42% (34093/81172), 23.07 MiB | 23.07 MiB/s
Receiving objects: 43% (34904/81172), 23.07 MiB | 23.07 MiB/s
Receiving objects: 44% (35716/81172), 23.07 MiB | 23.07 MiB/s
Receiving objects: 45% (36528/81172), 23.07 MiB | 23.07 MiB/s
Receiving objects: 46% (37340/81172), 23.07 MiB | 23.07 MiB/s
Receiving objects: 47% (38151/81172), 23.07 MiB | 23.07 MiB/s
Receiving objects: 48% (38963/81172), 23.07 MiB | 23.07 MiB/s
Receiving objects: 49% (39775/81172), 44.69 MiB | 29.79 MiB/s
Receiving objects: 50% (40586/81172), 44.69 MiB | 29.79 MiB/s
Receiving objects: 51% (41398/81172), 44.69 MiB | 29.79 MiB/s
Receiving objects: 52% (42210/81172), 44.69 MiB | 29.79 MiB/s
Receiving objects: 53% (43022/81172), 44.69 MiB | 29.79 MiB/s
Receiving objects: 54% (43833/81172), 44.69 MiB | 29.79 MiB/s
Receiving objects: 55% (44645/81172), 44.69 MiB | 29.79 MiB/s
Receiving objects: 56% (45457/81172), 44.69 MiB | 29.79 MiB/s
Receiving objects: 57% (46269/81172), 44.69 MiB | 29.79 MiB/s
Receiving objects: 58% (47080/81172), 44.69 MiB | 29.79 MiB/s
Receiving objects: 58% (47787/81172), 44.69 MiB | 29.79 MiB/s
Receiving objects: 59% (47892/81172), 44.69 MiB | 29.79 MiB/s
Receiving objects: 60% (48704/81172), 60.66 MiB | 30.32 MiB/s
Receiving objects: 61% (49515/81172), 60.66 MiB | 30.32 MiB/s
Receiving objects: 62% (50327/81172), 60.66 MiB | 30.32 MiB/s
Receiving objects: 63% (51139/81172), 60.66 MiB | 30.32 MiB/s
Receiving objects: 64% (51951/81172), 60.66 MiB | 30.32 MiB/s
Receiving objects: 65% (52762/81172), 60.66 MiB | 30.32 MiB/s
Receiving objects: 66% (53574/81172), 60.66 MiB | 30.32 MiB/s
Receiving objects: 67% (54386/81172), 77.00 MiB | 30.80 MiB/s
Receiving objects: 68% (55197/81172), 77.00 MiB | 30.80 MiB/s
Receiving objects: 69% (56009/81172), 77.00 MiB | 30.80 MiB/s
Receiving objects: 70% (56821/81172), 77.00 MiB | 30.80 MiB/s
Receiving objects: 71% (57633/81172), 77.00 MiB | 30.80 MiB/s
Receiving objects: 72% (58444/81172), 77.00 MiB | 30.80 MiB/s
Receiving objects: 73% (59256/81172), 77.00 MiB | 30.80 MiB/s
Receiving objects: 74% (60068/81172), 77.00 MiB | 30.80 MiB/s
Receiving objects: 74% (60659/81172), 77.00 MiB | 30.80 MiB/s
Receiving objects: 75% (60879/81172), 90.69 MiB | 30.23 MiB/s
Receiving objects: 76% (61691/81172), 90.69 MiB | 30.23 MiB/s
Receiving objects: 77% (62503/81172), 90.69 MiB | 30.23 MiB/s
Receiving objects: 78% (63315/81172), 90.69 MiB | 30.23 MiB/s
Receiving objects: 79% (64126/81172), 107.70 MiB | 30.77 MiB/s
Receiving objects: 80% (64938/81172), 107.70 MiB | 30.77 MiB/s
Receiving objects: 81% (65750/81172), 107.70 MiB | 30.77 MiB/s
Receiving objects: 82% (66562/81172), 107.70 MiB | 30.77 MiB/s
Receiving objects: 83% (67373/81172), 107.70 MiB | 30.77 MiB/s
Receiving objects: 84% (68185/81172), 107.70 MiB | 30.77 MiB/s
Receiving objects: 85% (68997/81172), 107.70 MiB | 30.77 MiB/s
Receiving objects: 86% (69808/81172), 107.70 MiB | 30.77 MiB/s
Receiving objects: 87% (70620/81172), 107.70 MiB | 30.77 MiB/s
Receiving objects: 88% (71432/81172), 107.70 MiB | 30.77 MiB/s
Receiving objects: 89% (72244/81172), 107.70 MiB | 30.77 MiB/s
Receiving objects: 90% (73055/81172), 107.70 MiB | 30.77 MiB/s
Receiving objects: 91% (73867/81172), 107.70 MiB | 30.77 MiB/s
Receiving objects: 92% (74679/81172), 107.70 MiB | 30.77 MiB/s
Receiving objects: 93% (75490/81172), 107.70 MiB | 30.77 MiB/s
Receiving objects: 94% (76302/81172), 107.70 MiB | 30.77 MiB/s
Receiving objects: 95% (77114/81172), 107.70 MiB | 30.77 MiB/s
Receiving objects: 96% (77926/81172), 107.70 MiB | 30.77 MiB/s
Receiving objects: 97% (78737/81172), 107.70 MiB | 30.77 MiB/s
Receiving objects: 97% (79326/81172), 107.70 MiB | 30.77 MiB/s
Receiving objects: 98% (79549/81172), 123.02 MiB | 30.75 MiB/s
Receiving objects: 99% (80361/81172), 123.02 MiB | 30.75 MiB/s
remote: Total 81172 (delta 8546), reused 8781 (delta 7735), pack-reused 70405 (from 2)
8.48 s
Receiving objects: 100% (81172/81172), 123.02 MiB | 30.75 MiB/s
Receiving objects: 100% (81172/81172), 127.48 MiB | 30.78 MiB/s, done.
10.59 s
Resolving deltas: 0% (0/55027)
Resolving deltas: 1% (551/55027)
Resolving deltas: 2% (1101/55027)
Resolving deltas: 3% (1651/55027)
Resolving deltas: 4% (2202/55027)
Resolving deltas: 5% (2753/55027)
Resolving deltas: 6% (3302/55027)
Resolving deltas: 7% (3852/55027)
Resolving deltas: 8% (4403/55027)
Resolving deltas: 9% (4953/55027)
Resolving deltas: 10% (5503/55027)
Resolving deltas: 11% (6053/55027)
Resolving deltas: 12% (6604/55027)
Resolving deltas: 13% (7154/55027)
Resolving deltas: 14% (7704/55027)
Resolving deltas: 15% (8255/55027)
Resolving deltas: 16% (8805/55027)
Resolving deltas: 17% (9355/55027)
Resolving deltas: 18% (9905/55027)
Resolving deltas: 19% (10456/55027)
Resolving deltas: 20% (11006/55027)
Resolving deltas: 21% (11556/55027)
Resolving deltas: 22% (12106/55027)
Resolving deltas: 23% (12657/55027)
Resolving deltas: 24% (13207/55027)
Resolving deltas: 25% (13757/55027)
Resolving deltas: 26% (14308/55027)
Resolving deltas: 27% (14858/55027)
Resolving deltas: 28% (15408/55027)
Resolving deltas: 29% (15958/55027)
Resolving deltas: 30% (16509/55027)
Resolving deltas: 31% (17059/55027)
Resolving deltas: 32% (17609/55027)
Resolving deltas: 33% (18159/55027)
Resolving deltas: 34% (18710/55027)
Resolving deltas: 35% (19260/55027)
Resolving deltas: 36% (19810/55027)
Resolving deltas: 37% (20360/55027)
Resolving deltas: 38% (20911/55027)
Resolving deltas: 39% (21461/55027)
Resolving deltas: 40% (22011/55027)
Resolving deltas: 41% (22562/55027)
Resolving deltas: 42% (23113/55027)
Resolving deltas: 43% (23662/55027)
Resolving deltas: 44% (24212/55027)
Resolving deltas: 45% (24763/55027)
Resolving deltas: 46% (25313/55027)
Resolving deltas: 47% (25863/55027)
Resolving deltas: 48% (26413/55027)
Resolving deltas: 49% (26964/55027)
Resolving deltas: 50% (27515/55027)
Resolving deltas: 51% (28065/55027)
Resolving deltas: 52% (28615/55027)
Resolving deltas: 53% (29165/55027)
Resolving deltas: 54% (29715/55027)
Resolving deltas: 55% (30265/55027)
Resolving deltas: 56% (30816/55027)
Resolving deltas: 56% (31298/55027)
Resolving deltas: 57% (31366/55027)
Resolving deltas: 58% (31916/55027)
Resolving deltas: 59% (32466/55027)
Resolving deltas: 60% (33017/55027)
Resolving deltas: 61% (33567/55027)
Resolving deltas: 62% (34117/55027)
Resolving deltas: 63% (34668/55027)
Resolving deltas: 64% (35218/55027)
Resolving deltas: 65% (35768/55027)
Resolving deltas: 66% (36318/55027)
Resolving deltas: 67% (36871/55027)
Resolving deltas: 68% (37419/55027)
Resolving deltas: 69% (37970/55027)
Resolving deltas: 70% (38519/55027)
Resolving deltas: 71% (39070/55027)
Resolving deltas: 72% (39620/55027)
Resolving deltas: 73% (40170/55027)
Resolving deltas: 74% (40720/55027)
Resolving deltas: 75% (41271/55027)
Resolving deltas: 76% (41821/55027)
Resolving deltas: 77% (42371/55027)
Resolving deltas: 78% (42922/55027)
Resolving deltas: 79% (43472/55027)
Resolving deltas: 80% (44022/55027)
Resolving deltas: 81% (44572/55027)
Resolving deltas: 82% (45123/55027)
Resolving deltas: 83% (45673/55027)
Resolving deltas: 84% (46224/55027)
Resolving deltas: 85% (46773/55027)
Resolving deltas: 86% (47324/55027)
Resolving deltas: 87% (47874/55027)
Resolving deltas: 88% (48424/55027)
Resolving deltas: 89% (48975/55027)
Resolving deltas: 90% (49525/55027)
Resolving deltas: 91% (50075/55027)
Resolving deltas: 92% (50625/55027)
Resolving deltas: 93% (51176/55027)
Resolving deltas: 94% (51726/55027)
Resolving deltas: 94% (52018/55027)
Resolving deltas: 95% (52278/55027)
Resolving deltas: 96% (52826/55027)
Resolving deltas: 97% (53377/55027)
Resolving deltas: 98% (53927/55027)
Resolving deltas: 99% (54478/55027)
Resolving deltas: 100% (55027/55027)
Resolving deltas: 100% (55027/55027), done.
11.19 s
Fetching commit 6acf3a1c65d1e8c66bc3fa8bd1c90d314fd16d9c for docs ...
11.19 s
$ /nix/store/bcnisk3ydfgv26v2gw3zlky24g00yww2-git-2.54.0/bin/git fetch origin 6acf3a1c65d1e8c66bc3fa8bd1c90d314fd16d9c
11.67 s
From https://github.com/alphal00p/gammaloop
11.67 s
* branch 6acf3a1c65d1e8c66bc3fa8bd1c90d314fd16d9c -> FETCH_HEAD
11.69 s
$ /nix/store/9ypz3flqsrl5xl495mm8h645gadjsxi1-coreutils-9.11/bin/timeout --kill-after=15s 7200s /nix/store/bcnisk3ydfgv26v2gw3zlky24g00yww2-git-2.54.0/bin/git -c advice.detachedHead=false checkout 6acf3a1c65d1e8c66bc3fa8bd1c90d314fd16d9c
11.94 s
HEAD is now at 6acf3a1c6 fix GammaLoop links and collaboration portal
11.95 s
$ /nix/store/9ypz3flqsrl5xl495mm8h645gadjsxi1-coreutils-9.11/bin/timeout --kill-after=15s 7200s /nix/store/23zk8sgzamrbmj1fday15szf7f2279s8-nix-2.34.7/bin/nix --extra-experimental-features nix-command --extra-experimental-features flakes --log-format internal-json run .#packages.x86_64-linux.nix-ci-check-gammaloop-nextest-docs --print-build-logs
12.13 s
12.73 s
evaluating derivation 'gevaluation warning: stdenv.isDarwin is deprecated, use stdenv.hostPlatform.isDarwin instead
20.53 s
copying '/nix/store/3idf
evaluating derivation 'g
copying '/nix/store/3idf
evaluating derivation 'g
copying '/nix/store/3idf
evaluating derivation 'g
copying '/nix/store/3idf
evaluating derivation 'g
copying '/nix/store/3idf
evaluating derivation 'g
copying '/nix/store/3idf
evaluating derivation 'g
copying '/nix/store/3idf
evaluating derivation 'g
copying '/nix/store/3idf
evaluating derivation 'g
copying '/nix/store/3idf
evaluating derivation 'g
copying '/nix/store/3idf
evaluating derivation 'g
copying '/nix/store/3idf
evaluating derivation 'g
[0 /1 built]
[1 /0 /1 built] building g gammaloop-nextest-docs> Extracting 2 binaries to /build/source/target/nix-ci-tmp/nextest-archive-W1NPrq
20.59 s
gammaloop-nextest-docs> Extracted 5 files to /build/source/target/nix-ci-tmp/nextest-archive-W1NPrq in 0.06s
20.60 s
gammaloop-nextest-docs> ------------
20.60 s
gammaloop-nextest-docs> Nextest run ID 16a1c9c9-3391-4b55-aa97-9682059fddb1 with nextest profile: ci_gammaloop
20.60 s
gammaloop-nextest-docs> Starting 119 tests across 2 binaries
20.80 s
gammaloop-nextest-docs> FAIL [ 0.135s] ( 84/119) alphal00p-docs-builder tests :: portal_focuses_on_projects_and_keeps_dedicated_routes
20.80 s
gammaloop-nextest-docs> stdout ---
20.80 s
gammaloop-nextest-docs>
20.80 s
gammaloop-nextest-docs> running 1 test
20.80 s
gammaloop-nextest-docs> test tests::portal_focuses_on_projects_and_keeps_dedicated_routes ... FAILED
20.80 s
gammaloop-nextest-docs>
20.80 s
gammaloop-nextest-docs> failures:
20.80 s
gammaloop-nextest-docs>
20.80 s
gammaloop-nextest-docs> failures:
20.80 s
gammaloop-nextest-docs> tests::portal_focuses_on_projects_and_keeps_dedicated_routes
20.80 s
gammaloop-nextest-docs>
20.80 s
gammaloop-nextest-docs> test result: FAILED. 0 passed; 1 failed; 0 ignored; 0 measured; 118 filtered out; finished in 0.13s
20.80 s
gammaloop-nextest-docs>
20.80 s
gammaloop-nextest-docs> stderr ---
20.80 s
gammaloop-nextest-docs> warning: bundle export is experimental
20.80 s
gammaloop-nextest-docs> = hint: its behaviour may change at any time
20.80 s
gammaloop-nextest-docs> = hint: do not rely on this feature for production use cases
20.80 s
gammaloop-nextest-docs>
20.80 s
gammaloop-nextest-docs>
20.80 s
gammaloop-nextest-docs> thread 'tests::portal_focuses_on_projects_and_keeps_dedicated_routes' (342) panicked at crates/alphal00p-docs-builder/src/lib.rs:11904:9:
20.80 s
gammaloop-nextest-docs> assertion `left == right` failed
20.80 s
gammaloop-nextest-docs> left: 8
20.80 s
gammaloop-nextest-docs> right: 7
20.80 s
gammaloop-nextest-docs> stack backtrace:
20.80 s
gammaloop-nextest-docs> 0: __rustc::rust_begin_unwind
20.80 s
gammaloop-nextest-docs> 1: core::panicking::panic_fmt
20.80 s
gammaloop-nextest-docs> 2: core::panicking::assert_failed_inner
20.80 s
gammaloop-nextest-docs> 3: core::panicking::assert_failed::<usize, usize>
20.80 s
gammaloop-nextest-docs> 4: alphal00p_docs_builder::tests::portal_focuses_on_projects_and_keeps_dedicated_routes
20.80 s
gammaloop-nextest-docs> 5: <alphal00p_docs_builder::tests::portal_focuses_on_projects_and_keeps_dedicated_routes::{closure#0} as core::ops::function::FnOnce<()>>::call_once
20.80 s
gammaloop-nextest-docs> note: Some details are omitted, run with `RUST_BACKTRACE=full` for a verbose backtrace.
20.80 s
gammaloop-nextest-docs>
50.06 s
gammaloop-nextest-docs> ------------
50.06 s
gammaloop-nextest-docs> Summary [ 29.448s] 119 tests run: 118 passed , 1 failed , 0 skipped
50.06 s
gammaloop-nextest-docs> FAIL [ 0.135s] ( 84/119) alphal00p-docs-builder tests :: portal_focuses_on_projects_and_keeps_dedicated_routes
50.06 s
gammaloop-nextest-docs> stdout ---
50.06 s
gammaloop-nextest-docs>
50.06 s
gammaloop-nextest-docs> running 1 test
50.06 s
gammaloop-nextest-docs> test tests::portal_focuses_on_projects_and_keeps_dedicated_routes ... FAILED
50.06 s
gammaloop-nextest-docs>
50.06 s
gammaloop-nextest-docs> failures:
50.06 s
gammaloop-nextest-docs>
50.06 s
gammaloop-nextest-docs> failures:
50.06 s
gammaloop-nextest-docs> tests::portal_focuses_on_projects_and_keeps_dedicated_routes
50.06 s
gammaloop-nextest-docs>
50.06 s
gammaloop-nextest-docs> test result: FAILED. 0 passed; 1 failed; 0 ignored; 0 measured; 118 filtered out; finished in 0.13s
50.06 s
gammaloop-nextest-docs>
50.06 s
gammaloop-nextest-docs> stderr ---
50.06 s
gammaloop-nextest-docs> warning: bundle export is experimental
50.06 s
gammaloop-nextest-docs> = hint: its behaviour may change at any time
50.06 s
gammaloop-nextest-docs> = hint: do not rely on this feature for production use cases
50.06 s
gammaloop-nextest-docs>
50.06 s
gammaloop-nextest-docs>
50.06 s
gammaloop-nextest-docs> thread 'tests::portal_focuses_on_projects_and_keeps_dedicated_routes' (342) panicked at crates/alphal00p-docs-builder/src/lib.rs:11904:9:
50.06 s
gammaloop-nextest-docs> assertion `left == right` failed
50.06 s
gammaloop-nextest-docs> left: 8
50.06 s
gammaloop-nextest-docs> right: 7
50.06 s
gammaloop-nextest-docs> stack backtrace:
50.06 s
gammaloop-nextest-docs> 0: __rustc::rust_begin_unwind
50.06 s
gammaloop-nextest-docs> 1: core::panicking::panic_fmt
50.06 s
gammaloop-nextest-docs> 2: core::panicking::assert_failed_inner
50.06 s
gammaloop-nextest-docs> 3: core::panicking::assert_failed::<usize, usize>
50.06 s
gammaloop-nextest-docs> 4: alphal00p_docs_builder::tests::portal_focuses_on_projects_and_keeps_dedicated_routes
50.06 s
gammaloop-nextest-docs> 5: <alphal00p_docs_builder::tests::portal_focuses_on_projects_and_keeps_dedicated_routes::{closure#0} as core::ops::function::FnOnce<()>>::call_once
50.06 s
gammaloop-nextest-docs> note: Some details are omitted, run with `RUST_BACKTRACE=full` for a verbose backtrace.
50.06 s
gammaloop-nextest-docs>
50.07 s
gammaloop-nextest-docs> error : test run failed
50.13 s
gammaloop-nextest-docs>
50.13 s
gammaloop-nextest-docs> ========== nextest test summary ==========
50.13 s
gammaloop-nextest-docs> report: target/nextest/ci_gammaloop/junit.xml
50.13 s
gammaloop-nextest-docs> tests: 119, failures: 1, errors: 0
50.13 s
gammaloop-nextest-docs>
50.13 s
gammaloop-nextest-docs> 1. alphal00p-docs-builder::tests::portal_focuses_on_projects_and_keeps_dedicated_routes
50.13 s
gammaloop-nextest-docs> failure: test failure with exit code 101
50.13 s
gammaloop-nextest-docs> thread 'tests::portal_focuses_on_projects_and_keeps_dedicated_routes' (342) panicked at crates/alphal00p-docs-builder/src/lib.rs:11904:9:
50.13 s
gammaloop-nextest-docs> assertion `left == right` failed
50.13 s
gammaloop-nextest-docs> left: 8
50.13 s
gammaloop-nextest-docs> right: 7
50.13 s
gammaloop-nextest-docs> stack backtrace:
50.13 s
gammaloop-nextest-docs> 0: __rustc::rust_begin_unwind
50.13 s
gammaloop-nextest-docs> 1: core::panicking::panic_fmt
50.13 s
gammaloop-nextest-docs> 2: core::panicking::assert_failed_inner
50.13 s
gammaloop-nextest-docs> 3: core::panicking::assert_failed::<usize, usize>
50.13 s
gammaloop-nextest-docs> 4: alphal00p_docs_builder::tests::portal_focuses_on_projects_and_keeps_dedicated_routes
50.13 s
gammaloop-nextest-docs> 5: <alphal00p_docs_builder::tests::portal_focuses_on_projects_and_keeps_dedicated_routes::{closure#0} as core::ops::function::FnOnce<()>>::call_once
50.13 s
gammaloop-nextest-docs> note: Some details are omitted, run with `RUST_BACKTRACE=full` for a verbose backtrace.
50.13 s
gammaloop-nextest-docs> system-out
50.13 s
gammaloop-nextest-docs> running 1 test
50.13 s
gammaloop-nextest-docs> test tests::portal_focuses_on_projects_and_keeps_dedicated_routes ... FAILED
50.13 s
gammaloop-nextest-docs>
50.13 s
gammaloop-nextest-docs> failures:
50.13 s
gammaloop-nextest-docs>
50.13 s
gammaloop-nextest-docs> failures:
50.13 s
gammaloop-nextest-docs> tests::portal_focuses_on_projects_and_keeps_dedicated_routes
50.13 s
gammaloop-nextest-docs>
50.13 s
gammaloop-nextest-docs> test result: FAILED. 0 passed; 1 failed; 0 ignored; 0 measured; 118 filtered out; finished in 0.13s
50.13 s
gammaloop-nextest-docs> system-err
50.13 s
gammaloop-nextest-docs> warning: bundle export is experimental
50.13 s
gammaloop-nextest-docs> = hint: its behaviour may change at any time
50.13 s
gammaloop-nextest-docs> = hint: do not rely on this feature for production use cases
50.13 s
gammaloop-nextest-docs>
50.13 s
gammaloop-nextest-docs>
50.13 s
gammaloop-nextest-docs> thread 'tests::portal_focuses_on_projects_and_keeps_dedicated_routes' (342) panicked at crates/alphal00p-docs-builder/src/lib.rs:11904:9:
50.13 s
gammaloop-nextest-docs> assertion `left == right` failed
50.13 s
gammaloop-nextest-docs> left: 8
50.13 s
gammaloop-nextest-docs> right: 7
50.13 s
gammaloop-nextest-docs> stack backtrace:
50.13 s
gammaloop-nextest-docs> 0: __rustc::rust_begin_unwind
50.13 s
gammaloop-nextest-docs> 1: core::panicking::panic_fmt
50.13 s
gammaloop-nextest-docs> 2: core::panicking::assert_failed_inner
50.13 s
gammaloop-nextest-docs> 3: core::panicking::assert_failed::<usize, usize>
50.13 s
gammaloop-nextest-docs> 4: alphal00p_docs_builder::tests::portal_focuses_on_projects_and_keeps_dedicated_routes
50.13 s
gammaloop-nextest-docs> 5: <alphal00p_docs_builder::tests::portal_focuses_on_projects_and_keeps_dedicated_routes::{closure#0} as core::ops::function::FnOnce<()>>::call_once
50.13 s
gammaloop-nextest-docs> note: Some details are omitted, run with `RUST_BACKTRACE=full` for a verbose backtrace.
50.13 s
gammaloop-nextest-docs> =========================================
50.16 s
gammaloop-nextest-docs> Extracting 2 binaries to /build/source/target/nix-ci-tmp/nextest-archive-dN2c8z
50.22 s
gammaloop-nextest-docs> Extracted 5 files to /build/source/target/nix-ci-tmp/nextest-archive-dN2c8z in 0.07s
50.25 s
gammaloop-nextest-docs> ------------
50.25 s
gammaloop-nextest-docs> Nextest run ID bf3c7234-422e-4a28-bc41-2989ac54d2ba with nextest profile: ci_gammaloop
50.25 s
gammaloop-nextest-docs> Starting 21 tests across 2 binaries
50.30 s
gammaloop-nextest-docs> ------------
50.30 s
gammaloop-nextest-docs> Summary [ 0.053s] 21 tests run: 21 passed , 0 skipped
50.37 s
gammaloop-nextest-docs>
50.37 s
gammaloop-nextest-docs> ========== nextest test summary ==========
50.37 s
gammaloop-nextest-docs> report: target/nextest/ci_gammaloop/junit.xml
50.37 s
gammaloop-nextest-docs> tests: 21, failures: 0, errors: 0
50.37 s
gammaloop-nextest-docs> No failing testcases found.
50.37 s
gammaloop-nextest-docs> =========================================
50.40 s
gammaloop-nextest-docs> Extracting 3 binaries (including 2 non-test binaries), 1 build script output directory, and 2 linked paths to /build/source/target/nix-ci-tmp/nextest-archive-wE6SO9
50.83 s
gammaloop-nextest-docs> Extracted 22 files to /build/source/target/nix-ci-tmp/nextest-archive-wE6SO9 in 0.43s
50.88 s
gammaloop-nextest-docs> ------------
50.88 s
gammaloop-nextest-docs> Nextest run ID 6cc2614f-eebe-4cee-901b-1ab29036effa with nextest profile: ci_gammaloop
50.88 s
gammaloop-nextest-docs> Starting 89 tests across 1 binary
51.01 s
gammaloop-nextest-docs> ------------
51.01 s
gammaloop-nextest-docs> Summary [ 0.131s] 89 tests run: 89 passed , 0 skipped
51.15 s
gammaloop-nextest-docs>
51.15 s
gammaloop-nextest-docs> ========== nextest test summary ==========
51.15 s
gammaloop-nextest-docs> report: target/nextest/ci_gammaloop/junit.xml
51.15 s
gammaloop-nextest-docs> tests: 89, failures: 0, errors: 0
51.15 s
gammaloop-nextest-docs> No failing testcases found.
51.15 s
gammaloop-nextest-docs> =========================================
51.18 s
gammaloop-nextest-docs> Extracting 2 binaries to /build/source/target/nix-ci-tmp/nextest-archive-8Iq5N8
51.26 s
gammaloop-nextest-docs> Extracted 5 files to /build/source/target/nix-ci-tmp/nextest-archive-8Iq5N8 in 0.08s
51.29 s
gammaloop-nextest-docs> ------------
51.29 s
gammaloop-nextest-docs> Nextest run ID 40a926a7-2040-4bb8-b8ae-964fb42d7f3b with nextest profile: ci_gammaloop
51.29 s
gammaloop-nextest-docs> Starting 10 tests across 2 binaries
85.31 s
gammaloop-nextest-docs> ------------
85.31 s
gammaloop-nextest-docs> Summary [ 34.023s] 10 tests run: 10 passed , 0 skipped
85.41 s
gammaloop-nextest-docs>
85.41 s
gammaloop-nextest-docs> ========== nextest test summary ==========
85.41 s
gammaloop-nextest-docs> report: target/nextest/ci_gammaloop/junit.xml
85.41 s
gammaloop-nextest-docs> tests: 10, failures: 0, errors: 0
85.41 s
gammaloop-nextest-docs> No failing testcases found.
85.41 s
gammaloop-nextest-docs> =========================================
85.45 s
gammaloop-nextest-docs> Extracting 1 binary to /build/source/target/nix-ci-tmp/nextest-archive-MkaQOW
85.55 s
gammaloop-nextest-docs> Extracted 4 files to /build/source/target/nix-ci-tmp/nextest-archive-MkaQOW in 0.10s
85.60 s
gammaloop-nextest-docs> ------------
85.60 s
gammaloop-nextest-docs> Nextest run ID 096e9653-4fd3-4fa8-8243-df2b80b8f30b with nextest profile: ci_gammaloop
85.60 s
gammaloop-nextest-docs> Starting 0 tests across 1 binary
85.61 s
gammaloop-nextest-docs> ------------
85.61 s
gammaloop-nextest-docs> Summary [ 0.006s] 0 tests run: 0 passed , 0 skipped
85.69 s
gammaloop-nextest-docs>
85.69 s
gammaloop-nextest-docs> ========== nextest test summary ==========
85.69 s
gammaloop-nextest-docs> report: target/nextest/ci_gammaloop/junit.xml
85.69 s
gammaloop-nextest-docs> tests: 0, failures: 0, errors: 0
85.69 s
gammaloop-nextest-docs> No failing testcases found.
85.69 s
gammaloop-nextest-docs> =========================================
85.74 s
gammaloop-nextest-docs> Extracting 1 binary to /build/source/target/nix-ci-tmp/nextest-archive-nO0t9Z
85.83 s
gammaloop-nextest-docs> Extracted 4 files to /build/source/target/nix-ci-tmp/nextest-archive-nO0t9Z in 0.10s
85.86 s
gammaloop-nextest-docs> ------------
85.86 s
gammaloop-nextest-docs> Nextest run ID 7d439720-da30-49a0-9d20-80a68a2629bf with nextest profile: ci_gammaloop
85.86 s
gammaloop-nextest-docs> Starting 4 tests across 1 binary
85.89 s
gammaloop-nextest-docs> ------------
85.89 s
gammaloop-nextest-docs> Summary [ 0.031s] 4 tests run: 4 passed , 0 skipped
85.98 s
gammaloop-nextest-docs>
85.98 s
gammaloop-nextest-docs> ========== nextest test summary ==========
85.98 s
gammaloop-nextest-docs> report: target/nextest/ci_gammaloop/junit.xml
85.98 s
gammaloop-nextest-docs> tests: 4, failures: 0, errors: 0
85.98 s
gammaloop-nextest-docs> No failing testcases found.
85.98 s
gammaloop-nextest-docs> =========================================
86.32 s
error: Cannot build '/nix/store/m0lsjjgxqj4xk3vaac50mb4m5ri4ngbr-gammaloop-nextest-docs.drv '.
86.32 s
Reason: builder failed with exit code 100 .
86.32 s
Output paths:
86.32 s
/nix/store/rpb1d5m51aljbsd8j5zjmilzcp8ndnad-gammaloop-nextest-docs
86.32 s
Last 185 log lines:
86.32 s
> Extracting 2 binaries to /build/source/target/nix-ci-tmp/nextest-archive-W1NPrq
86.32 s
> Extracted 5 files to /build/source/target/nix-ci-tmp/nextest-archive-W1NPrq in 0.06s
86.32 s
> ------------
86.32 s
> Nextest run ID 16a1c9c9-3391-4b55-aa97-9682059fddb1 with nextest profile: ci_gammaloop
86.32 s
> Starting 119 tests across 2 binaries
86.32 s
> FAIL [ 0.135s] ( 84/119) alphal00p-docs-builder tests :: portal_focuses_on_projects_and_keeps_dedicated_routes
86.32 s
> stdout ---
86.32 s
>
86.32 s
> running 1 test
86.32 s
> test tests::portal_focuses_on_projects_and_keeps_dedicated_routes ... FAILED
86.32 s
>
86.32 s
> failures:
86.32 s
>
86.32 s
> failures:
86.32 s
> tests::portal_focuses_on_projects_and_keeps_dedicated_routes
86.32 s
>
86.32 s
> test result: FAILED. 0 passed; 1 failed; 0 ignored; 0 measured; 118 filtered out; finished in 0.13s
86.32 s
>
86.32 s
> stderr ---
86.32 s
> warning: bundle export is experimental
86.32 s
> = hint: its behaviour may change at any time
86.32 s
> = hint: do not rely on this feature for production use cases
86.32 s
>
86.32 s
>
86.32 s
> thread 'tests::portal_focuses_on_projects_and_keeps_dedicated_routes' (342) panicked at crates/alphal00p-docs-builder/src/lib.rs:11904:9:
86.32 s
> assertion `left == right` failed
86.32 s
> left: 8
86.32 s
> right: 7
86.32 s
> stack backtrace:
86.32 s
> 0: __rustc::rust_begin_unwind
86.32 s
> 1: core::panicking::panic_fmt
86.32 s
> 2: core::panicking::assert_failed_inner
86.32 s
> 3: core::panicking::assert_failed::<usize, usize>
86.32 s
> 4: alphal00p_docs_builder::tests::portal_focuses_on_projects_and_keeps_dedicated_routes
86.32 s
> 5: <alphal00p_docs_builder::tests::portal_focuses_on_projects_and_keeps_dedicated_routes::{closure#0} as core::ops::function::FnOnce<()>>::call_once
86.32 s
> note: Some details are omitted, run with `RUST_BACKTRACE=full` for a verbose backtrace.
86.32 s
>
86.32 s
> ------------
86.32 s
> Summary [ 29.448s] 119 tests run: 118 passed , 1 failed , 0 skipped
86.32 s
> FAIL [ 0.135s] ( 84/119) alphal00p-docs-builder tests :: portal_focuses_on_projects_and_keeps_dedicated_routes
86.32 s
> stdout ---
86.32 s
>
86.32 s
> running 1 test
86.32 s
> test tests::portal_focuses_on_projects_and_keeps_dedicated_routes ... FAILED
86.32 s
>
86.32 s
> failures:
86.32 s
>
86.32 s
> failures:
86.32 s
> tests::portal_focuses_on_projects_and_keeps_dedicated_routes
86.32 s
>
86.32 s
> test result: FAILED. 0 passed; 1 failed; 0 ignored; 0 measured; 118 filtered out; finished in 0.13s
86.32 s
>
86.32 s
> stderr ---
86.32 s
> warning: bundle export is experimental
86.32 s
> = hint: its behaviour may change at any time
86.32 s
> = hint: do not rely on this feature for production use cases
86.32 s
>
86.32 s
>
86.32 s
> thread 'tests::portal_focuses_on_projects_and_keeps_dedicated_routes' (342) panicked at crates/alphal00p-docs-builder/src/lib.rs:11904:9:
86.32 s
> assertion `left == right` failed
86.32 s
> left: 8
86.32 s
> right: 7
86.32 s
> stack backtrace:
86.32 s
> 0: __rustc::rust_begin_unwind
86.32 s
> 1: core::panicking::panic_fmt
86.32 s
> 2: core::panicking::assert_failed_inner
86.32 s
> 3: core::panicking::assert_failed::<usize, usize>
86.32 s
> 4: alphal00p_docs_builder::tests::portal_focuses_on_projects_and_keeps_dedicated_routes
86.32 s
> 5: <alphal00p_docs_builder::tests::portal_focuses_on_projects_and_keeps_dedicated_routes::{closure#0} as core::ops::function::FnOnce<()>>::call_once
86.32 s
> note: Some details are omitted, run with `RUST_BACKTRACE=full` for a verbose backtrace.
86.32 s
>
86.32 s
> error : test run failed
86.32 s
>
86.32 s
> ========== nextest test summary ==========
86.32 s
> report: target/nextest/ci_gammaloop/junit.xml
86.32 s
> tests: 119, failures: 1, errors: 0
86.32 s
>
86.32 s
> 1. alphal00p-docs-builder::tests::portal_focuses_on_projects_and_keeps_dedicated_routes
86.32 s
> failure: test failure with exit code 101
86.33 s
> thread 'tests::portal_focuses_on_projects_and_keeps_dedicated_routes' (342) panicked at crates/alphal00p-docs-builder/src/lib.rs:11904:9:
86.33 s
> assertion `left == right` failed
86.33 s
> left: 8
86.33 s
> right: 7
86.33 s
> stack backtrace:
86.33 s
> 0: __rustc::rust_begin_unwind
86.33 s
> 1: core::panicking::panic_fmt
86.33 s
> 2: core::panicking::assert_failed_inner
86.33 s
> 3: core::panicking::assert_failed::<usize, usize>
86.33 s
> 4: alphal00p_docs_builder::tests::portal_focuses_on_projects_and_keeps_dedicated_routes
86.33 s
> 5: <alphal00p_docs_builder::tests::portal_focuses_on_projects_and_keeps_dedicated_routes::{closure#0} as core::ops::function::FnOnce<()>>::call_once
86.33 s
> note: Some details are omitted, run with `RUST_BACKTRACE=full` for a verbose backtrace.
86.33 s
> system-out
86.33 s
> running 1 test
86.33 s
> test tests::portal_focuses_on_projects_and_keeps_dedicated_routes ... FAILED
86.33 s
>
86.33 s
> failures:
86.33 s
>
86.33 s
> failures:
86.33 s
> tests::portal_focuses_on_projects_and_keeps_dedicated_routes
86.33 s
>
86.33 s
> test result: FAILED. 0 passed; 1 failed; 0 ignored; 0 measured; 118 filtered out; finished in 0.13s
86.33 s
> system-err
86.33 s
> warning: bundle export is experimental
86.33 s
> = hint: its behaviour may change at any time
86.33 s
> = hint: do not rely on this feature for production use cases
86.33 s
>
86.33 s
>
86.33 s
> thread 'tests::portal_focuses_on_projects_and_keeps_dedicated_routes' (342) panicked at crates/alphal00p-docs-builder/src/lib.rs:11904:9:
86.33 s
> assertion `left == right` failed
86.33 s
> left: 8
86.33 s
> right: 7
86.33 s
> stack backtrace:
86.33 s
> 0: __rustc::rust_begin_unwind
86.33 s
> 1: core::panicking::panic_fmt
86.33 s
> 2: core::panicking::assert_failed_inner
86.33 s
> 3: core::panicking::assert_failed::<usize, usize>
86.33 s
> 4: alphal00p_docs_builder::tests::portal_focuses_on_projects_and_keeps_dedicated_routes
86.33 s
> 5: <alphal00p_docs_builder::tests::portal_focuses_on_projects_and_keeps_dedicated_routes::{closure#0} as core::ops::function::FnOnce<()>>::call_once
86.33 s
> note: Some details are omitted, run with `RUST_BACKTRACE=full` for a verbose backtrace.
86.33 s
> =========================================
86.33 s
> Extracting 2 binaries to /build/source/target/nix-ci-tmp/nextest-archive-dN2c8z
86.33 s
> Extracted 5 files to /build/source/target/nix-ci-tmp/nextest-archive-dN2c8z in 0.07s
86.33 s
> ------------
86.33 s
> Nextest run ID bf3c7234-422e-4a28-bc41-2989ac54d2ba with nextest profile: ci_gammaloop
86.33 s
> Starting 21 tests across 2 binaries
86.33 s
> ------------
86.33 s
> Summary [ 0.053s] 21 tests run: 21 passed , 0 skipped
86.33 s
>
86.33 s
> ========== nextest test summary ==========
86.33 s
> report: target/nextest/ci_gammaloop/junit.xml
86.33 s
> tests: 21, failures: 0, errors: 0
86.33 s
> No failing testcases found.
86.33 s
> =========================================
86.33 s
> Extracting 3 binaries (including 2 non-test binaries), 1 build script output directory, and 2 linked paths to /build/source/target/nix-ci-tmp/nextest-archive-wE6SO9
86.33 s
> Extracted 22 files to /build/source/target/nix-ci-tmp/nextest-archive-wE6SO9 in 0.43s
86.33 s
> ------------
86.33 s
> Nextest run ID 6cc2614f-eebe-4cee-901b-1ab29036effa with nextest profile: ci_gammaloop
86.33 s
> Starting 89 tests across 1 binary
86.33 s
> ------------
86.33 s
> Summary [ 0.131s] 89 tests run: 89 passed , 0 skipped
86.33 s
>
86.33 s
> ========== nextest test summary ==========
86.33 s
> report: target/nextest/ci_gammaloop/junit.xml
86.33 s
> tests: 89, failures: 0, errors: 0
86.33 s
> No failing testcases found.
86.33 s
> =========================================
86.33 s
> Extracting 2 binaries to /build/source/target/nix-ci-tmp/nextest-archive-8Iq5N8
86.33 s
> Extracted 5 files to /build/source/target/nix-ci-tmp/nextest-archive-8Iq5N8 in 0.08s
86.33 s
> ------------
86.33 s
> Nextest run ID 40a926a7-2040-4bb8-b8ae-964fb42d7f3b with nextest profile: ci_gammaloop
86.33 s
> Starting 10 tests across 2 binaries
86.33 s
> ------------
86.33 s
> Summary [ 34.023s] 10 tests run: 10 passed , 0 skipped
86.33 s
>
86.33 s
> ========== nextest test summary ==========
86.33 s
> report: target/nextest/ci_gammaloop/junit.xml
86.33 s
> tests: 10, failures: 0, errors: 0
86.33 s
> No failing testcases found.
86.33 s
> =========================================
86.33 s
> Extracting 1 binary to /build/source/target/nix-ci-tmp/nextest-archive-MkaQOW
86.33 s
> Extracted 4 files to /build/source/target/nix-ci-tmp/nextest-archive-MkaQOW in 0.10s
86.33 s
> ------------
86.33 s
> Nextest run ID 096e9653-4fd3-4fa8-8243-df2b80b8f30b with nextest profile: ci_gammaloop
86.33 s
> Starting 0 tests across 1 binary
86.33 s
> ------------
86.33 s
> Summary [ 0.006s] 0 tests run: 0 passed , 0 skipped
86.33 s
>
86.33 s
> ========== nextest test summary ==========
86.33 s
> report: target/nextest/ci_gammaloop/junit.xml
86.33 s
> tests: 0, failures: 0, errors: 0
86.33 s
> No failing testcases found.
86.33 s
> =========================================
86.33 s
> Extracting 1 binary to /build/source/target/nix-ci-tmp/nextest-archive-nO0t9Z
86.33 s
> Extracted 4 files to /build/source/target/nix-ci-tmp/nextest-archive-nO0t9Z in 0.10s
86.33 s
> ------------
86.33 s
> Nextest run ID 7d439720-da30-49a0-9d20-80a68a2629bf with nextest profile: ci_gammaloop
86.33 s
> Starting 4 tests across 1 binary
86.33 s
> ------------
86.33 s
> Summary [ 0.031s] 4 tests run: 4 passed , 0 skipped
86.33 s
>
86.33 s
> ========== nextest test summary ==========
86.33 s
> report: target/nextest/ci_gammaloop/junit.xml
86.33 s
> tests: 4, failures: 0, errors: 0
86.33 s
> No failing testcases found.
86.33 s
> =========================================
86.33 s
For full logs, run:
86.33 s
nix log /nix/store/m0lsjjgxqj4xk3vaac50mb4m5ri4ngbr-gammaloop-nextest-docs.drv
86.64 s
[0 built (1 failed )]Run failed.