test packages.x86_64-linux.nix-ci-check-gammaloop-nextest-docs

Reproduce this run
Retry Run
  1. 0.00 s $ /nix/store/9ypz3flqsrl5xl495mm8h645gadjsxi1-coreutils-9.11/bin/timeout --kill-after=15s 7200s /nix/store/23zk8sgzamrbmj1fday15szf7f2279s8-nix-2.34.7/bin/nix --extra-experimental-features nix-command --extra-experimental-features flakes flake clone git+https://github.com/alphal00p/gammaloop --dest /tmp/nix-ci-worker/stable-pwd/repo/
  2. 0.10 s Cloning into '/tmp/nix-ci-worker/stable-pwd/repo'...
  3. 1.25 s remote: Enumerating objects: 81172, done.
  4. 1.48 s remote: Counting objects: 0% (1/10726) remote: Counting objects: 1% (108/10726) remote: Counting objects: 2% (215/10726) remote: Counting objects: 3% (322/10726) remote: Counting objects: 4% (430/10726) remote: Counting objects: 5% (537/10726) remote: Counting objects: 6% (644/10726) remote: Counting objects: 7% (751/10726) remote: Counting objects: 8% (859/10726) remote: Counting objects: 9% (966/10726) remote: Counting objects: 10% (1073/10726) remote: Counting objects: 11% (1180/10726) remote: Counting objects: 12% (1288/10726) remote: Counting objects: 13% (1395/10726) remote: Counting objects: 14% (1502/10726) remote: Counting objects: 15% (1609/10726) remote: Counting objects: 16% (1717/10726) remote: Counting objects: 17% (1824/10726) remote: Counting objects: 18% (1931/10726) remote: Counting objects: 19% (2038/10726) remote: Counting objects: 20% (2146/10726) remote: Counting objects: 21% (2253/10726) remote: Counting objects: 22% (2360/10726) remote: Counting objects: 23% (2467/10726) remote: Counting objects: 24% (2575/10726) remote: Counting objects: 25% (2682/10726) remote: Counting objects: 26% (2789/10726) remote: Counting objects: 27% (2897/10726) remote: Counting objects: 28% (3004/10726) remote: Counting objects: 29% (3111/10726) remote: Counting objects: 30% (3218/10726) remote: Counting objects: 31% (3326/10726) remote: Counting objects: 32% (3433/10726) remote: Counting objects: 33% (3540/10726) remote: Counting objects: 34% (3647/10726) remote: Counting objects: 35% (3755/10726) remote: Counting objects: 36% (3862/10726) remote: Counting objects: 37% (3969/10726) remote: Counting objects: 38% (4076/10726) remote: Counting objects: 39% (4184/10726) remote: Counting objects: 40% (4291/10726) remote: Counting objects: 41% (4398/10726) remote: Counting objects: 42% (4505/10726) remote: Counting objects: 43% (4613/10726) remote: Counting objects: 44% (4720/10726) remote: Counting objects: 45% (4827/10726) remote: Counting objects: 46% (4934/10726) remote: Counting objects: 47% (5042/10726) remote: Counting objects: 48% (5149/10726) remote: Counting objects: 49% (5256/10726) remote: Counting objects: 50% (5363/10726) remote: Counting objects: 51% (5471/10726) remote: Counting objects: 52% (5578/10726) remote: Counting objects: 53% (5685/10726) remote: Counting objects: 54% (5793/10726) remote: Counting objects: 55% (5900/10726) remote: Counting objects: 56% (6007/10726) remote: Counting objects: 57% (6114/10726) remote: Counting objects: 58% (6222/10726) remote: Counting objects: 59% (6329/10726) remote: Counting objects: 60% (6436/10726) remote: Counting objects: 61% (6543/10726) remote: Counting objects: 62% (6651/10726) remote: Counting objects: 63% (6758/10726) remote: Counting objects: 64% (6865/10726) remote: Counting objects: 65% (6972/10726) remote: Counting objects: 66% (7080/10726) remote: Counting objects: 67% (7187/10726) remote: Counting objects: 68% (7294/10726) remote: Counting objects: 69% (7401/10726) remote: Counting objects: 70% (7509/10726) remote: Counting objects: 71% (7616/10726) remote: Counting objects: 72% (7723/10726) remote: Counting objects: 73% (7830/10726) remote: Counting objects: 74% (7938/10726) remote: Counting objects: 75% (8045/10726) remote: Counting objects: 76% (8152/10726) remote: Counting objects: 77% (8260/10726) remote: Counting objects: 78% (8367/10726) remote: Counting objects: 79% (8474/10726) remote: Counting objects: 80% (8581/10726) remote: Counting objects: 81% (8689/10726) remote: Counting objects: 82% (8796/10726) remote: Counting objects: 83% (8903/10726) remote: Counting objects: 84% (9010/10726) remote: Counting objects: 85% (9118/10726) remote: Counting objects: 86% (9225/10726) remote: Counting objects: 87% (9332/10726) remote: Counting objects: 88% (9439/10726) remote: Counting objects: 89% (9547/10726) remote: Counting objects: 90% (9654/10726) remote: Counting objects: 91% (9761/10726) remote: Counting objects: 92% (9868/10726) remote: Counting objects: 93% (9976/10726) remote: Counting objects: 94% (10083/10726) remote: Counting objects: 95% (10190/10726) remote: Counting objects: 96% (10297/10726) remote: Counting objects: 97% (10405/10726) remote: Counting objects: 98% (10512/10726) remote: Counting objects: 99% (10619/10726) remote: Counting objects: 100% (10726/10726) remote: Counting objects: 100% (10726/10726), done.
  5. 4.15 s remote: Compressing objects: 0% (1/2498) remote: Compressing objects: 1% (25/2498) remote: Compressing objects: 2% (50/2498) remote: Compressing objects: 3% (75/2498) remote: Compressing objects: 4% (100/2498) remote: Compressing objects: 5% (125/2498) remote: Compressing objects: 6% (150/2498) remote: Compressing objects: 7% (175/2498) remote: Compressing objects: 8% (200/2498) remote: Compressing objects: 9% (225/2498) remote: Compressing objects: 10% (250/2498) remote: Compressing objects: 11% (275/2498) remote: Compressing objects: 12% (300/2498) remote: Compressing objects: 13% (325/2498) remote: Compressing objects: 14% (350/2498) remote: Compressing objects: 15% (375/2498) remote: Compressing objects: 16% (400/2498) remote: Compressing objects: 17% (425/2498) remote: Compressing objects: 18% (450/2498) remote: Compressing objects: 19% (475/2498) remote: Compressing objects: 19% (476/2498) remote: Compressing objects: 20% (500/2498) remote: Compressing objects: 21% (525/2498) remote: Compressing objects: 22% (550/2498) remote: Compressing objects: 23% (575/2498) remote: Compressing objects: 24% (600/2498) remote: Compressing objects: 24% (607/2498) remote: Compressing objects: 25% (625/2498) remote: Compressing objects: 26% (650/2498) remote: Compressing objects: 27% (675/2498) remote: Compressing objects: 28% (700/2498) remote: Compressing objects: 29% (725/2498) remote: Compressing objects: 30% (750/2498) remote: Compressing objects: 31% (775/2498) remote: Compressing objects: 32% (800/2498) remote: Compressing objects: 33% (825/2498) remote: Compressing objects: 34% (850/2498) remote: Compressing objects: 35% (875/2498) remote: Compressing objects: 36% (900/2498) remote: Compressing objects: 37% (925/2498) remote: Compressing objects: 38% (950/2498) remote: Compressing objects: 39% (975/2498) remote: Compressing objects: 40% (1000/2498) remote: Compressing objects: 41% (1025/2498) remote: Compressing objects: 42% (1050/2498) remote: Compressing objects: 43% (1075/2498) remote: Compressing objects: 44% (1100/2498) remote: Compressing objects: 45% (1125/2498) remote: Compressing objects: 46% (1150/2498) remote: Compressing objects: 47% (1175/2498) remote: Compressing objects: 48% (1200/2498) remote: Compressing objects: 49% (1225/2498) remote: Compressing objects: 50% (1249/2498) remote: Compressing objects: 51% (1274/2498) remote: Compressing objects: 52% (1299/2498) remote: Compressing objects: 53% (1324/2498) remote: Compressing objects: 54% (1349/2498) remote: Compressing objects: 55% (1374/2498) remote: Compressing objects: 56% (1399/2498) remote: Compressing objects: 57% (1424/2498) remote: Compressing objects: 58% (1449/2498) remote: Compressing objects: 59% (1474/2498) remote: Compressing objects: 60% (1499/2498) remote: Compressing objects: 61% (1524/2498) remote: Compressing objects: 62% (1549/2498) remote: Compressing objects: 63% (1574/2498) remote: Compressing objects: 64% (1599/2498) remote: Compressing objects: 65% (1624/2498) remote: Compressing objects: 66% (1649/2498) remote: Compressing objects: 67% (1674/2498) remote: Compressing objects: 68% (1699/2498) remote: Compressing objects: 69% (1724/2498) remote: Compressing objects: 70% (1749/2498) remote: Compressing objects: 71% (1774/2498) remote: Compressing objects: 72% (1799/2498) remote: Compressing objects: 73% (1824/2498) remote: Compressing objects: 74% (1849/2498) remote: Compressing objects: 75% (1874/2498) remote: Compressing objects: 76% (1899/2498) remote: Compressing objects: 77% (1924/2498) remote: Compressing objects: 78% (1949/2498) remote: Compressing objects: 79% (1974/2498) remote: Compressing objects: 80% (1999/2498) remote: Compressing objects: 81% (2024/2498) remote: Compressing objects: 82% (2049/2498) remote: Compressing objects: 83% (2074/2498) remote: Compressing objects: 84% (2099/2498) remote: Compressing objects: 85% (2124/2498) remote: Compressing objects: 86% (2149/2498) remote: Compressing objects: 87% (2174/2498) remote: Compressing objects: 88% (2199/2498) remote: Compressing objects: 89% (2224/2498) remote: Compressing objects: 90% (2249/2498) remote: Compressing objects: 91% (2274/2498) remote: Compressing objects: 92% (2299/2498) remote: Compressing objects: 93% (2324/2498) remote: Compressing objects: 94% (2349/2498) remote: Compressing objects: 95% (2374/2498) remote: Compressing objects: 96% (2399/2498) remote: Compressing objects: 97% (2424/2498) remote: Compressing objects: 98% (2449/2498) remote: Compressing objects: 99% (2474/2498) remote: Compressing objects: 100% (2498/2498) remote: Compressing objects: 100% (2498/2498), done.
  6. 7.95 s Receiving objects: 0% (1/81172) Receiving objects: 1% (812/81172) Receiving objects: 2% (1624/81172) Receiving objects: 3% (2436/81172) Receiving objects: 4% (3247/81172) Receiving objects: 5% (4059/81172) Receiving objects: 6% (4871/81172) Receiving objects: 7% (5683/81172) Receiving objects: 8% (6494/81172) Receiving objects: 9% (7306/81172), 15.16 MiB | 30.31 MiB/s Receiving objects: 10% (8118/81172), 15.16 MiB | 30.31 MiB/s Receiving objects: 11% (8929/81172), 15.16 MiB | 30.31 MiB/s Receiving objects: 12% (9741/81172), 15.16 MiB | 30.31 MiB/s Receiving objects: 13% (10553/81172), 15.16 MiB | 30.31 MiB/s Receiving objects: 14% (11365/81172), 15.16 MiB | 30.31 MiB/s Receiving objects: 15% (12176/81172), 15.16 MiB | 30.31 MiB/s Receiving objects: 16% (12988/81172), 15.16 MiB | 30.31 MiB/s Receiving objects: 17% (13800/81172), 15.16 MiB | 30.31 MiB/s Receiving objects: 18% (14611/81172), 15.16 MiB | 30.31 MiB/s Receiving objects: 19% (15423/81172), 15.16 MiB | 30.31 MiB/s Receiving objects: 20% (16235/81172), 15.16 MiB | 30.31 MiB/s Receiving objects: 21% (17047/81172), 15.16 MiB | 30.31 MiB/s Receiving objects: 22% (17858/81172), 15.16 MiB | 30.31 MiB/s Receiving objects: 23% (18670/81172), 15.16 MiB | 30.31 MiB/s Receiving objects: 24% (19482/81172), 15.16 MiB | 30.31 MiB/s Receiving objects: 25% (20293/81172), 15.16 MiB | 30.31 MiB/s Receiving objects: 26% (21105/81172), 15.16 MiB | 30.31 MiB/s Receiving objects: 27% (21917/81172), 15.16 MiB | 30.31 MiB/s Receiving objects: 28% (22729/81172), 15.16 MiB | 30.31 MiB/s Receiving objects: 29% (23540/81172), 15.16 MiB | 30.31 MiB/s Receiving objects: 30% (24352/81172), 15.16 MiB | 30.31 MiB/s Receiving objects: 31% (25164/81172), 15.16 MiB | 30.31 MiB/s Receiving objects: 32% (25976/81172), 15.16 MiB | 30.31 MiB/s Receiving objects: 33% (26787/81172), 15.16 MiB | 30.31 MiB/s Receiving objects: 34% (27599/81172), 15.16 MiB | 30.31 MiB/s Receiving objects: 35% (28411/81172), 15.16 MiB | 30.31 MiB/s Receiving objects: 36% (29222/81172), 15.16 MiB | 30.31 MiB/s Receiving objects: 37% (30034/81172), 15.16 MiB | 30.31 MiB/s Receiving objects: 38% (30846/81172), 15.16 MiB | 30.31 MiB/s Receiving objects: 39% (31658/81172), 15.16 MiB | 30.31 MiB/s Receiving objects: 40% (32469/81172), 15.16 MiB | 30.31 MiB/s Receiving objects: 41% (33281/81172), 15.16 MiB | 30.31 MiB/s Receiving objects: 42% (34093/81172), 15.16 MiB | 30.31 MiB/s Receiving objects: 42% (34305/81172), 33.18 MiB | 33.05 MiB/s Receiving objects: 43% (34904/81172), 33.18 MiB | 33.05 MiB/s Receiving objects: 44% (35716/81172), 33.18 MiB | 33.05 MiB/s Receiving objects: 45% (36528/81172), 33.18 MiB | 33.05 MiB/s Receiving objects: 46% (37340/81172), 33.18 MiB | 33.05 MiB/s Receiving objects: 47% (38151/81172), 33.18 MiB | 33.05 MiB/s Receiving objects: 48% (38963/81172), 33.18 MiB | 33.05 MiB/s Receiving objects: 49% (39775/81172), 33.18 MiB | 33.05 MiB/s Receiving objects: 50% (40586/81172), 33.18 MiB | 33.05 MiB/s Receiving objects: 51% (41398/81172), 33.18 MiB | 33.05 MiB/s Receiving objects: 52% (42210/81172), 33.18 MiB | 33.05 MiB/s Receiving objects: 53% (43022/81172), 51.19 MiB | 34.03 MiB/s Receiving objects: 54% (43833/81172), 51.19 MiB | 34.03 MiB/s Receiving objects: 55% (44645/81172), 51.19 MiB | 34.03 MiB/s Receiving objects: 56% (45457/81172), 51.19 MiB | 34.03 MiB/s Receiving objects: 57% (46269/81172), 51.19 MiB | 34.03 MiB/s Receiving objects: 58% (47080/81172), 51.19 MiB | 34.03 MiB/s Receiving objects: 59% (47892/81172), 51.19 MiB | 34.03 MiB/s Receiving objects: 60% (48704/81172), 51.19 MiB | 34.03 MiB/s Receiving objects: 60% (48853/81172), 51.19 MiB | 34.03 MiB/s Receiving objects: 61% (49515/81172), 66.83 MiB | 33.36 MiB/s Receiving objects: 62% (50327/81172), 66.83 MiB | 33.36 MiB/s Receiving objects: 63% (51139/81172), 66.83 MiB | 33.36 MiB/s Receiving objects: 64% (51951/81172), 66.83 MiB | 33.36 MiB/s Receiving objects: 65% (52762/81172), 66.83 MiB | 33.36 MiB/s Receiving objects: 66% (53574/81172), 66.83 MiB | 33.36 MiB/s Receiving objects: 67% (54386/81172), 66.83 MiB | 33.36 MiB/s Receiving objects: 68% (55197/81172), 66.83 MiB | 33.36 MiB/s Receiving objects: 69% (56009/81172), 66.83 MiB | 33.36 MiB/s Receiving objects: 70% (56821/81172), 66.83 MiB | 33.36 MiB/s Receiving objects: 71% (57633/81172), 66.83 MiB | 33.36 MiB/s Receiving objects: 72% (58444/81172), 85.05 MiB | 33.58 MiB/s Receiving objects: 73% (59256/81172), 85.05 MiB | 33.58 MiB/s Receiving objects: 74% (60068/81172), 85.05 MiB | 33.58 MiB/s Receiving objects: 75% (60879/81172), 85.05 MiB | 33.58 MiB/s Receiving objects: 76% (61691/81172), 85.05 MiB | 33.58 MiB/s Receiving objects: 77% (62503/81172), 85.05 MiB | 33.58 MiB/s Receiving objects: 78% (63315/81172), 85.05 MiB | 33.58 MiB/s Receiving objects: 78% (63642/81172), 102.86 MiB | 33.88 MiB/s Receiving objects: 79% (64126/81172), 102.86 MiB | 33.88 MiB/s Receiving objects: 80% (64938/81172), 102.86 MiB | 33.88 MiB/s Receiving objects: 81% (65750/81172), 102.86 MiB | 33.88 MiB/s Receiving objects: 82% (66562/81172), 102.86 MiB | 33.88 MiB/s Receiving objects: 83% (67373/81172), 102.86 MiB | 33.88 MiB/s Receiving objects: 84% (68185/81172), 102.86 MiB | 33.88 MiB/s Receiving objects: 85% (68997/81172), 102.86 MiB | 33.88 MiB/s Receiving objects: 86% (69808/81172), 102.86 MiB | 33.88 MiB/s Receiving objects: 87% (70620/81172), 102.86 MiB | 33.88 MiB/s Receiving objects: 88% (71432/81172), 102.86 MiB | 33.88 MiB/s Receiving objects: 89% (72244/81172), 102.86 MiB | 33.88 MiB/s Receiving objects: 90% (73055/81172), 102.86 MiB | 33.88 MiB/s Receiving objects: 91% (73867/81172), 102.86 MiB | 33.88 MiB/s Receiving objects: 92% (74679/81172), 102.86 MiB | 33.88 MiB/s Receiving objects: 93% (75490/81172), 102.86 MiB | 33.88 MiB/s Receiving objects: 94% (76302/81172), 102.86 MiB | 33.88 MiB/s Receiving objects: 95% (77114/81172), 118.52 MiB | 33.52 MiB/s Receiving objects: 96% (77926/81172), 118.52 MiB | 33.52 MiB/s Receiving objects: 97% (78737/81172), 118.52 MiB | 33.52 MiB/s Receiving objects: 98% (79549/81172), 118.52 MiB | 33.52 MiB/s Receiving objects: 99% (80361/81172), 118.52 MiB | 33.52 MiB/s remote: Total 81172 (delta 8505), reused 8743 (delta 7697), pack-reused 70446 (from 2)
  7. 7.95 s Receiving objects: 100% (81172/81172), 118.52 MiB | 33.52 MiB/s Receiving objects: 100% (81172/81172), 127.47 MiB | 33.57 MiB/s, done.
  8. 10.13 s Resolving deltas: 0% (0/55027) Resolving deltas: 1% (551/55027) Resolving deltas: 2% (1103/55027) Resolving deltas: 3% (1651/55027) Resolving deltas: 4% (2202/55027) Resolving deltas: 5% (2752/55027) Resolving deltas: 6% (3302/55027) Resolving deltas: 7% (3852/55027) Resolving deltas: 8% (4403/55027) Resolving deltas: 9% (4953/55027) Resolving deltas: 10% (5503/55027) Resolving deltas: 11% (6053/55027) Resolving deltas: 12% (6604/55027) Resolving deltas: 13% (7154/55027) Resolving deltas: 14% (7704/55027) Resolving deltas: 15% (8255/55027) Resolving deltas: 16% (8808/55027) Resolving deltas: 17% (9355/55027) Resolving deltas: 18% (9906/55027) Resolving deltas: 19% (10456/55027) Resolving deltas: 20% (11006/55027) Resolving deltas: 21% (11556/55027) Resolving deltas: 22% (12106/55027) Resolving deltas: 23% (12657/55027) Resolving deltas: 24% (13207/55027) Resolving deltas: 25% (13757/55027) Resolving deltas: 26% (14308/55027) Resolving deltas: 27% (14859/55027) Resolving deltas: 28% (15408/55027) Resolving deltas: 29% (15958/55027) Resolving deltas: 30% (16510/55027) Resolving deltas: 31% (17059/55027) Resolving deltas: 32% (17609/55027) Resolving deltas: 33% (18159/55027) Resolving deltas: 34% (18710/55027) Resolving deltas: 35% (19260/55027) Resolving deltas: 36% (19810/55027) Resolving deltas: 37% (20360/55027) Resolving deltas: 38% (20911/55027) Resolving deltas: 39% (21461/55027) Resolving deltas: 40% (22011/55027) Resolving deltas: 41% (22562/55027) Resolving deltas: 42% (23112/55027) Resolving deltas: 43% (23662/55027) Resolving deltas: 44% (24213/55027) Resolving deltas: 45% (24764/55027) Resolving deltas: 46% (25313/55027) Resolving deltas: 47% (25863/55027) Resolving deltas: 48% (26413/55027) Resolving deltas: 49% (26964/55027) Resolving deltas: 50% (27514/55027) Resolving deltas: 51% (28064/55027) Resolving deltas: 52% (28615/55027) Resolving deltas: 53% (29165/55027) Resolving deltas: 54% (29715/55027) Resolving deltas: 55% (30265/55027) Resolving deltas: 56% (30816/55027) Resolving deltas: 57% (31366/55027) Resolving deltas: 58% (31918/55027) Resolving deltas: 59% (32466/55027) Resolving deltas: 60% (33017/55027) Resolving deltas: 61% (33567/55027) Resolving deltas: 61% (34011/55027) Resolving deltas: 62% (34117/55027) Resolving deltas: 63% (34668/55027) Resolving deltas: 64% (35218/55027) Resolving deltas: 65% (35768/55027) Resolving deltas: 66% (36318/55027) Resolving deltas: 67% (36869/55027) Resolving deltas: 68% (37419/55027) Resolving deltas: 69% (37969/55027) Resolving deltas: 70% (38519/55027) Resolving deltas: 71% (39070/55027) Resolving deltas: 72% (39620/55027) Resolving deltas: 73% (40170/55027) Resolving deltas: 74% (40720/55027) Resolving deltas: 75% (41271/55027) Resolving deltas: 76% (41822/55027) Resolving deltas: 77% (42371/55027) Resolving deltas: 78% (42922/55027) Resolving deltas: 79% (43472/55027) Resolving deltas: 80% (44022/55027) Resolving deltas: 81% (44572/55027) Resolving deltas: 82% (45123/55027) Resolving deltas: 83% (45673/55027) Resolving deltas: 84% (46223/55027) Resolving deltas: 85% (46773/55027) Resolving deltas: 86% (47324/55027) Resolving deltas: 87% (47874/55027) Resolving deltas: 88% (48424/55027) Resolving deltas: 89% (48975/55027) Resolving deltas: 90% (49525/55027) Resolving deltas: 91% (50075/55027) Resolving deltas: 92% (50625/55027) Resolving deltas: 92% (51109/55027) Resolving deltas: 93% (51176/55027) Resolving deltas: 94% (51726/55027) Resolving deltas: 95% (52276/55027) Resolving deltas: 96% (52826/55027) Resolving deltas: 97% (53377/55027) Resolving deltas: 98% (53927/55027) Resolving deltas: 99% (54477/55027) Resolving deltas: 100% (55027/55027) Resolving deltas: 100% (55027/55027), done.
  9. 10.70 s Fetching commit 6acf3a1c65d1e8c66bc3fa8bd1c90d314fd16d9c for docs ...
  10. 10.70 s $ /nix/store/bcnisk3ydfgv26v2gw3zlky24g00yww2-git-2.54.0/bin/git fetch origin 6acf3a1c65d1e8c66bc3fa8bd1c90d314fd16d9c
  11. 11.23 s From https://github.com/alphal00p/gammaloop
  12. 11.23 s * branch 6acf3a1c65d1e8c66bc3fa8bd1c90d314fd16d9c -> FETCH_HEAD
  13. 11.30 s $ /nix/store/9ypz3flqsrl5xl495mm8h645gadjsxi1-coreutils-9.11/bin/timeout --kill-after=15s 7200s /nix/store/bcnisk3ydfgv26v2gw3zlky24g00yww2-git-2.54.0/bin/git -c advice.detachedHead=false checkout 6acf3a1c65d1e8c66bc3fa8bd1c90d314fd16d9c
  14. 11.74 s HEAD is now at 6acf3a1c6 fix GammaLoop links and collaboration portal
  15. 11.74 s $ /nix/store/9ypz3flqsrl5xl495mm8h645gadjsxi1-coreutils-9.11/bin/timeout --kill-after=15s 7200s /nix/store/23zk8sgzamrbmj1fday15szf7f2279s8-nix-2.34.7/bin/nix --extra-experimental-features nix-command --extra-experimental-features flakes --log-format internal-json run .#packages.x86_64-linux.nix-ci-check-gammaloop-nextest-docs --print-build-logs
  16. 12.23 s stdenv.isDarwin is deprecated, use stdenv.hostPlatform.isDarwin instead
  17. 21.49 s
  18. 22.39 s evaluating derivation 'gevaluation warning: stdenv.isDarwin is deprecated, use stdenv.hostPlatform.isDarwin instead
  19. 34.56 s copying '/nix/store/3idf evaluating derivation 'g copying '/nix/store/3idf evaluating derivation 'g copying '/nix/store/3idf evaluating derivation 'g copying '/nix/store/3idf evaluating derivation 'g copying '/nix/store/3idf evaluating derivation 'g copying '/nix/store/3idf evaluating derivation 'g copying '/nix/store/3idf evaluating derivation 'g copying '/nix/store/3idf evaluating derivation 'g copying '/nix/store/3idf evaluating derivation 'g querying gammaloop-nexte querying info about miss querying gammaloop-nexte [0.0 KiB DL] querying ma [8.5 KiB DL] querying pe [22.9 KiB DL] querying p [36.3 KiB DL] querying o [0/3 built, 0/33 copied [0/8 built, 16/0/58 copi [1/0/7 built, 16/16/54 cbuilder.pl> Running phase: patchPhase
  20. 34.57 s [1/0/7 built, 14/21/54 c [1/0/7 built, 13/22/54 cbuilder.pl> Running phase: updateAutotoolsGnuConfigScriptsPhase
  21. 34.58 s [1/0/7 built, 14/23/54 cbuilder.pl> Running phase: configurePhase
  22. 34.62 s [1/0/7 built, 10/28/54 c [1/0/7 built, 9/29/54 cobuilder.pl> no configure script, doing nothing
  23. 34.62 s builder.pl> Running phase: buildPhase
  24. 34.64 s [1/0/6 built, 8/30/54 cobuilder.pl> Running phase: checkPhase
  25. 34.65 s [1/0/6 built, 7/31/54 cobuilder.pl> Running phase: installPhase
  26. 34.66 s [1/0/6 built, 5/33/54 cobuilder.pl> no Makefile or custom installPhase, doing nothing
  27. 34.66 s builder.pl> Running phase: fixupPhase
  28. 34.69 s [1/0/6 built, 4/34/54 co [1/0/6 built, 4/35/54 cobuilder.pl> shrinking RPATHs of ELF executables and libraries in /nix/store/654vgnw02gp7qz9lnaa6mypnmbgp8473-builder.pl
  29. 34.70 s [1/0/6 built, 5/36/54 cobuilder.pl> checking for references to /build/ in /nix/store/654vgnw02gp7qz9lnaa6mypnmbgp8473-builder.pl...
  30. 34.71 s builder.pl> patching script interpreter paths in /nix/store/654vgnw02gp7qz9lnaa6mypnmbgp8473-builder.pl
  31. 34.80 s [1/0/6 built, 4/37/54 cobuilder.pl (post)> Uploading to the NixCI cache: /nix/store/654vgnw02gp7qz9lnaa6mypnmbgp8473-builder.pl
  32. 34.98 s builder.pl (post)> warning: 'warn-short-path-literals' is deprecated, use 'lint-short-path-literals = ignore' instead
  33. 35.07 s builder.pl (post)> copying 0 paths...
  34. 35.33 s builder.pl (post)> warning: 'warn-short-path-literals' is deprecated, use 'lint-short-path-literals = ignore' instead
  35. 35.42 s builder.pl (post)> copying 0 paths...
  36. 35.95 s [1/5 built, 4/40/54 copi [1/5 built, 3/41/54 copi [1/5 built, 6/44/54 copi [1/5 built, 4/48/54 copi [1/5 built, 2/51/54 copi [1/4 built, 1/52/54 copipython3> structuredAttrs is enabled
  37. 36.09 s [1/1/4 built, 1/53/54 copython3> created 227 symlinks in user environment
  38. 37.77 s [1/1/3 built, 54 copied python3 (post)> Uploading to the NixCI cache: /nix/store/v67wpyflacy0i2gvzasrxvw2gkz4mr12-python3-3.13.15-env
  39. 37.84 s python3 (post)> warning: 'warn-short-path-literals' is deprecated, use 'lint-short-path-literals = ignore' instead
  40. 37.91 s python3 (post)> copying 0 paths...
  41. 38.01 s python3 (post)> warning: 'warn-short-path-literals' is deprecated, use 'lint-short-path-literals = ignore' instead
  42. 38.27 s python3 (post)> copying 0 paths...
  43. 39.22 s [2/4 built, 54 copied (4 [1/2/3 built, 54 copied gammaloop-nextest-docs> Extracting 2 binaries to /build/source/target/nix-ci-tmp/nextest-archive-JCDCQu
  44. 39.31 s gammaloop-nextest-docs> Extracted 5 files to /build/source/target/nix-ci-tmp/nextest-archive-JCDCQu in 0.09s
  45. 39.33 s gammaloop-nextest-docs> ------------
  46. 39.33 s gammaloop-nextest-docs> Nextest run ID 3d6b7679-153f-477f-bcc5-7f3fe338ad0a with nextest profile: ci_gammaloop
  47. 39.33 s gammaloop-nextest-docs> Starting 119 tests across 2 binaries
  48. 39.61 s gammaloop-nextest-docs> FAIL [ 0.161s] ( 67/119) alphal00p-docs-builder tests::portal_focuses_on_projects_and_keeps_dedicated_routes
  49. 39.61 s gammaloop-nextest-docs> stdout ---
  50. 39.61 s gammaloop-nextest-docs>
  51. 39.61 s gammaloop-nextest-docs> running 1 test
  52. 39.61 s gammaloop-nextest-docs> test tests::portal_focuses_on_projects_and_keeps_dedicated_routes ... FAILED
  53. 39.61 s gammaloop-nextest-docs>
  54. 39.61 s gammaloop-nextest-docs> failures:
  55. 39.61 s gammaloop-nextest-docs>
  56. 39.61 s gammaloop-nextest-docs> failures:
  57. 39.61 s gammaloop-nextest-docs> tests::portal_focuses_on_projects_and_keeps_dedicated_routes
  58. 39.61 s gammaloop-nextest-docs>
  59. 39.61 s gammaloop-nextest-docs> test result: FAILED. 0 passed; 1 failed; 0 ignored; 0 measured; 118 filtered out; finished in 0.14s
  60. 39.61 s gammaloop-nextest-docs>
  61. 39.61 s gammaloop-nextest-docs> stderr ---
  62. 39.61 s gammaloop-nextest-docs> warning: bundle export is experimental
  63. 39.61 s gammaloop-nextest-docs> = hint: its behaviour may change at any time
  64. 39.61 s gammaloop-nextest-docs> = hint: do not rely on this feature for production use cases
  65. 39.61 s gammaloop-nextest-docs>
  66. 39.61 s gammaloop-nextest-docs>
  67. 39.61 s gammaloop-nextest-docs> thread 'tests::portal_focuses_on_projects_and_keeps_dedicated_routes' (355) panicked at crates/alphal00p-docs-builder/src/lib.rs:11904:9:
  68. 39.61 s gammaloop-nextest-docs> assertion `left == right` failed
  69. 39.61 s gammaloop-nextest-docs> left: 8
  70. 39.61 s gammaloop-nextest-docs> right: 7
  71. 39.61 s gammaloop-nextest-docs> stack backtrace:
  72. 39.61 s gammaloop-nextest-docs> 0: __rustc::rust_begin_unwind
  73. 39.61 s gammaloop-nextest-docs> 1: core::panicking::panic_fmt
  74. 39.61 s gammaloop-nextest-docs> 2: core::panicking::assert_failed_inner
  75. 39.61 s gammaloop-nextest-docs> 3: core::panicking::assert_failed::<usize, usize>
  76. 39.61 s gammaloop-nextest-docs> 4: alphal00p_docs_builder::tests::portal_focuses_on_projects_and_keeps_dedicated_routes
  77. 39.61 s gammaloop-nextest-docs> 5: <alphal00p_docs_builder::tests::portal_focuses_on_projects_and_keeps_dedicated_routes::{closure#0} as core::ops::function::FnOnce<()>>::call_once
  78. 39.61 s gammaloop-nextest-docs> note: Some details are omitted, run with `RUST_BACKTRACE=full` for a verbose backtrace.
  79. 39.61 s gammaloop-nextest-docs>
  80. 71.41 s gammaloop-nextest-docs> ------------
  81. 71.42 s gammaloop-nextest-docs> Summary [ 32.085s] 119 tests run: 118 passed, 1 failed, 0 skipped
  82. 71.42 s gammaloop-nextest-docs> FAIL [ 0.161s] ( 67/119) alphal00p-docs-builder tests::portal_focuses_on_projects_and_keeps_dedicated_routes
  83. 71.42 s gammaloop-nextest-docs> stdout ---
  84. 71.42 s gammaloop-nextest-docs>
  85. 71.42 s gammaloop-nextest-docs> running 1 test
  86. 71.42 s gammaloop-nextest-docs> test tests::portal_focuses_on_projects_and_keeps_dedicated_routes ... FAILED
  87. 71.42 s gammaloop-nextest-docs>
  88. 71.42 s gammaloop-nextest-docs> failures:
  89. 71.42 s gammaloop-nextest-docs>
  90. 71.42 s gammaloop-nextest-docs> failures:
  91. 71.42 s gammaloop-nextest-docs> tests::portal_focuses_on_projects_and_keeps_dedicated_routes
  92. 71.42 s gammaloop-nextest-docs>
  93. 71.42 s gammaloop-nextest-docs> test result: FAILED. 0 passed; 1 failed; 0 ignored; 0 measured; 118 filtered out; finished in 0.14s
  94. 71.42 s gammaloop-nextest-docs>
  95. 71.42 s gammaloop-nextest-docs> stderr ---
  96. 71.42 s gammaloop-nextest-docs> warning: bundle export is experimental
  97. 71.42 s gammaloop-nextest-docs> = hint: its behaviour may change at any time
  98. 71.42 s gammaloop-nextest-docs> = hint: do not rely on this feature for production use cases
  99. 71.42 s gammaloop-nextest-docs>
  100. 71.42 s gammaloop-nextest-docs>
  101. 71.42 s gammaloop-nextest-docs> thread 'tests::portal_focuses_on_projects_and_keeps_dedicated_routes' (355) panicked at crates/alphal00p-docs-builder/src/lib.rs:11904:9:
  102. 71.42 s gammaloop-nextest-docs> assertion `left == right` failed
  103. 71.42 s gammaloop-nextest-docs> left: 8
  104. 71.42 s gammaloop-nextest-docs> right: 7
  105. 71.42 s gammaloop-nextest-docs> stack backtrace:
  106. 71.42 s gammaloop-nextest-docs> 0: __rustc::rust_begin_unwind
  107. 71.42 s gammaloop-nextest-docs> 1: core::panicking::panic_fmt
  108. 71.42 s gammaloop-nextest-docs> 2: core::panicking::assert_failed_inner
  109. 71.42 s gammaloop-nextest-docs> 3: core::panicking::assert_failed::<usize, usize>
  110. 71.42 s gammaloop-nextest-docs> 4: alphal00p_docs_builder::tests::portal_focuses_on_projects_and_keeps_dedicated_routes
  111. 71.42 s gammaloop-nextest-docs> 5: <alphal00p_docs_builder::tests::portal_focuses_on_projects_and_keeps_dedicated_routes::{closure#0} as core::ops::function::FnOnce<()>>::call_once
  112. 71.42 s gammaloop-nextest-docs> note: Some details are omitted, run with `RUST_BACKTRACE=full` for a verbose backtrace.
  113. 71.42 s gammaloop-nextest-docs>
  114. 71.44 s gammaloop-nextest-docs> error: test run failed
  115. 71.48 s gammaloop-nextest-docs>
  116. 71.48 s gammaloop-nextest-docs> ========== nextest test summary ==========
  117. 71.48 s gammaloop-nextest-docs> report: target/nextest/ci_gammaloop/junit.xml
  118. 71.48 s gammaloop-nextest-docs> tests: 119, failures: 1, errors: 0
  119. 71.48 s gammaloop-nextest-docs>
  120. 71.48 s gammaloop-nextest-docs> 1. alphal00p-docs-builder::tests::portal_focuses_on_projects_and_keeps_dedicated_routes
  121. 71.48 s gammaloop-nextest-docs> failure: test failure with exit code 101
  122. 71.48 s gammaloop-nextest-docs> thread 'tests::portal_focuses_on_projects_and_keeps_dedicated_routes' (355) panicked at crates/alphal00p-docs-builder/src/lib.rs:11904:9:
  123. 71.48 s gammaloop-nextest-docs> assertion `left == right` failed
  124. 71.48 s gammaloop-nextest-docs> left: 8
  125. 71.48 s gammaloop-nextest-docs> right: 7
  126. 71.48 s gammaloop-nextest-docs> stack backtrace:
  127. 71.48 s gammaloop-nextest-docs> 0: __rustc::rust_begin_unwind
  128. 71.48 s gammaloop-nextest-docs> 1: core::panicking::panic_fmt
  129. 71.48 s gammaloop-nextest-docs> 2: core::panicking::assert_failed_inner
  130. 71.48 s gammaloop-nextest-docs> 3: core::panicking::assert_failed::<usize, usize>
  131. 71.48 s gammaloop-nextest-docs> 4: alphal00p_docs_builder::tests::portal_focuses_on_projects_and_keeps_dedicated_routes
  132. 71.48 s gammaloop-nextest-docs> 5: <alphal00p_docs_builder::tests::portal_focuses_on_projects_and_keeps_dedicated_routes::{closure#0} as core::ops::function::FnOnce<()>>::call_once
  133. 71.48 s gammaloop-nextest-docs> note: Some details are omitted, run with `RUST_BACKTRACE=full` for a verbose backtrace.
  134. 71.48 s gammaloop-nextest-docs> system-out
  135. 71.48 s gammaloop-nextest-docs> running 1 test
  136. 71.48 s gammaloop-nextest-docs> test tests::portal_focuses_on_projects_and_keeps_dedicated_routes ... FAILED
  137. 71.48 s gammaloop-nextest-docs>
  138. 71.48 s gammaloop-nextest-docs> failures:
  139. 71.48 s gammaloop-nextest-docs>
  140. 71.48 s gammaloop-nextest-docs> failures:
  141. 71.48 s gammaloop-nextest-docs> tests::portal_focuses_on_projects_and_keeps_dedicated_routes
  142. 71.48 s gammaloop-nextest-docs>
  143. 71.48 s gammaloop-nextest-docs> test result: FAILED. 0 passed; 1 failed; 0 ignored; 0 measured; 118 filtered out; finished in 0.14s
  144. 71.48 s gammaloop-nextest-docs> system-err
  145. 71.48 s gammaloop-nextest-docs> warning: bundle export is experimental
  146. 71.48 s gammaloop-nextest-docs> = hint: its behaviour may change at any time
  147. 71.48 s gammaloop-nextest-docs> = hint: do not rely on this feature for production use cases
  148. 71.48 s gammaloop-nextest-docs>
  149. 71.48 s gammaloop-nextest-docs>
  150. 71.48 s gammaloop-nextest-docs> thread 'tests::portal_focuses_on_projects_and_keeps_dedicated_routes' (355) panicked at crates/alphal00p-docs-builder/src/lib.rs:11904:9:
  151. 71.48 s gammaloop-nextest-docs> assertion `left == right` failed
  152. 71.48 s gammaloop-nextest-docs> left: 8
  153. 71.48 s gammaloop-nextest-docs> right: 7
  154. 71.48 s gammaloop-nextest-docs> stack backtrace:
  155. 71.48 s gammaloop-nextest-docs> 0: __rustc::rust_begin_unwind
  156. 71.48 s gammaloop-nextest-docs> 1: core::panicking::panic_fmt
  157. 71.48 s gammaloop-nextest-docs> 2: core::panicking::assert_failed_inner
  158. 71.48 s gammaloop-nextest-docs> 3: core::panicking::assert_failed::<usize, usize>
  159. 71.48 s gammaloop-nextest-docs> 4: alphal00p_docs_builder::tests::portal_focuses_on_projects_and_keeps_dedicated_routes
  160. 71.48 s gammaloop-nextest-docs> 5: <alphal00p_docs_builder::tests::portal_focuses_on_projects_and_keeps_dedicated_routes::{closure#0} as core::ops::function::FnOnce<()>>::call_once
  161. 71.48 s gammaloop-nextest-docs> note: Some details are omitted, run with `RUST_BACKTRACE=full` for a verbose backtrace.
  162. 71.48 s gammaloop-nextest-docs> =========================================
  163. 71.51 s gammaloop-nextest-docs> Extracting 2 binaries to /build/source/target/nix-ci-tmp/nextest-archive-ek24Gv
  164. 71.58 s gammaloop-nextest-docs> Extracted 5 files to /build/source/target/nix-ci-tmp/nextest-archive-ek24Gv in 0.08s
  165. 71.60 s gammaloop-nextest-docs> ------------
  166. 71.60 s gammaloop-nextest-docs> Nextest run ID c8ebfe47-9dfc-4a10-b4e3-c7dbc8c633e0 with nextest profile: ci_gammaloop
  167. 71.60 s gammaloop-nextest-docs> Starting 21 tests across 2 binaries
  168. 71.65 s gammaloop-nextest-docs> ------------
  169. 71.65 s gammaloop-nextest-docs> Summary [ 0.041s] 21 tests run: 21 passed, 0 skipped
  170. 71.71 s gammaloop-nextest-docs>
  171. 71.71 s gammaloop-nextest-docs> ========== nextest test summary ==========
  172. 71.71 s gammaloop-nextest-docs> report: target/nextest/ci_gammaloop/junit.xml
  173. 71.71 s gammaloop-nextest-docs> tests: 21, failures: 0, errors: 0
  174. 71.71 s gammaloop-nextest-docs> No failing testcases found.
  175. 71.71 s gammaloop-nextest-docs> =========================================
  176. 71.74 s gammaloop-nextest-docs> Extracting 3 binaries (including 2 non-test binaries), 1 build script output directory, and 2 linked paths to /build/source/target/nix-ci-tmp/nextest-archive-ugKmYz
  177. 72.11 s gammaloop-nextest-docs> Extracted 22 files to /build/source/target/nix-ci-tmp/nextest-archive-ugKmYz in 0.38s
  178. 72.13 s gammaloop-nextest-docs> ------------
  179. 72.13 s gammaloop-nextest-docs> Nextest run ID ee72584e-8118-4bad-a987-15d1f9cd0efc with nextest profile: ci_gammaloop
  180. 72.13 s gammaloop-nextest-docs> Starting 89 tests across 1 binary
  181. 72.27 s gammaloop-nextest-docs> ------------
  182. 72.27 s gammaloop-nextest-docs> Summary [ 0.142s] 89 tests run: 89 passed, 0 skipped
  183. 72.41 s gammaloop-nextest-docs>
  184. 72.41 s gammaloop-nextest-docs> ========== nextest test summary ==========
  185. 72.41 s gammaloop-nextest-docs> report: target/nextest/ci_gammaloop/junit.xml
  186. 72.41 s gammaloop-nextest-docs> tests: 89, failures: 0, errors: 0
  187. 72.41 s gammaloop-nextest-docs> No failing testcases found.
  188. 72.41 s gammaloop-nextest-docs> =========================================
  189. 72.44 s gammaloop-nextest-docs> Extracting 2 binaries to /build/source/target/nix-ci-tmp/nextest-archive-e1ap9w
  190. 72.53 s gammaloop-nextest-docs> Extracted 5 files to /build/source/target/nix-ci-tmp/nextest-archive-e1ap9w in 0.09s
  191. 72.55 s gammaloop-nextest-docs> ------------
  192. 72.55 s gammaloop-nextest-docs> Nextest run ID 24bf0a0c-3c92-4c3a-9c93-6421014ceb8c with nextest profile: ci_gammaloop
  193. 72.55 s gammaloop-nextest-docs> Starting 10 tests across 2 binaries
  194. 97.73 s gammaloop-nextest-docs> ------------
  195. 97.73 s gammaloop-nextest-docs> Summary [ 25.183s] 10 tests run: 10 passed, 0 skipped
  196. 97.84 s gammaloop-nextest-docs>
  197. 97.84 s gammaloop-nextest-docs> ========== nextest test summary ==========
  198. 97.84 s gammaloop-nextest-docs> report: target/nextest/ci_gammaloop/junit.xml
  199. 97.84 s gammaloop-nextest-docs> tests: 10, failures: 0, errors: 0
  200. 97.84 s gammaloop-nextest-docs> No failing testcases found.
  201. 97.84 s gammaloop-nextest-docs> =========================================
  202. 97.89 s gammaloop-nextest-docs> Extracting 1 binary to /build/source/target/nix-ci-tmp/nextest-archive-LmkGAi
  203. 97.97 s gammaloop-nextest-docs> Extracted 4 files to /build/source/target/nix-ci-tmp/nextest-archive-LmkGAi in 0.09s
  204. 98.01 s gammaloop-nextest-docs> ------------
  205. 98.01 s gammaloop-nextest-docs> Nextest run ID d9d34a1d-3726-47d8-9a22-0f76830decdc with nextest profile: ci_gammaloop
  206. 98.01 s gammaloop-nextest-docs> Starting 0 tests across 1 binary
  207. 98.01 s gammaloop-nextest-docs> ------------
  208. 98.01 s gammaloop-nextest-docs> Summary [ 0.000s] 0 tests run: 0 passed, 0 skipped
  209. 98.11 s gammaloop-nextest-docs>
  210. 98.11 s gammaloop-nextest-docs> ========== nextest test summary ==========
  211. 98.11 s gammaloop-nextest-docs> report: target/nextest/ci_gammaloop/junit.xml
  212. 98.11 s gammaloop-nextest-docs> tests: 0, failures: 0, errors: 0
  213. 98.11 s gammaloop-nextest-docs> No failing testcases found.
  214. 98.11 s gammaloop-nextest-docs> =========================================
  215. 98.17 s gammaloop-nextest-docs> Extracting 1 binary to /build/source/target/nix-ci-tmp/nextest-archive-zqz7gX
  216. 98.27 s gammaloop-nextest-docs> Extracted 4 files to /build/source/target/nix-ci-tmp/nextest-archive-zqz7gX in 0.11s
  217. 98.29 s gammaloop-nextest-docs> ------------
  218. 98.29 s gammaloop-nextest-docs> Nextest run ID 007895d5-89f4-42c0-a197-1e4acb385aeb with nextest profile: ci_gammaloop
  219. 98.29 s gammaloop-nextest-docs> Starting 4 tests across 1 binary
  220. 98.31 s gammaloop-nextest-docs> ------------
  221. 98.31 s gammaloop-nextest-docs> Summary [ 0.017s] 4 tests run: 4 passed, 0 skipped
  222. 98.39 s gammaloop-nextest-docs>
  223. 98.39 s gammaloop-nextest-docs> ========== nextest test summary ==========
  224. 98.39 s gammaloop-nextest-docs> report: target/nextest/ci_gammaloop/junit.xml
  225. 98.39 s gammaloop-nextest-docs> tests: 4, failures: 0, errors: 0
  226. 98.39 s gammaloop-nextest-docs> No failing testcases found.
  227. 98.39 s gammaloop-nextest-docs> =========================================
  228. 98.79 s error: Cannot build '/nix/store/m0lsjjgxqj4xk3vaac50mb4m5ri4ngbr-gammaloop-nextest-docs.drv'.
  229. 98.79 s Reason: builder failed with exit code 100.
  230. 98.79 s Output paths:
  231. 98.79 s /nix/store/rpb1d5m51aljbsd8j5zjmilzcp8ndnad-gammaloop-nextest-docs
  232. 98.79 s Last 185 log lines:
  233. 98.79 s > Extracting 2 binaries to /build/source/target/nix-ci-tmp/nextest-archive-JCDCQu
  234. 98.79 s > Extracted 5 files to /build/source/target/nix-ci-tmp/nextest-archive-JCDCQu in 0.09s
  235. 98.79 s > ------------
  236. 98.79 s > Nextest run ID 3d6b7679-153f-477f-bcc5-7f3fe338ad0a with nextest profile: ci_gammaloop
  237. 98.79 s > Starting 119 tests across 2 binaries
  238. 98.79 s > FAIL [ 0.161s] ( 67/119) alphal00p-docs-builder tests::portal_focuses_on_projects_and_keeps_dedicated_routes
  239. 98.79 s > stdout ---
  240. 98.79 s >
  241. 98.79 s > running 1 test
  242. 98.79 s > test tests::portal_focuses_on_projects_and_keeps_dedicated_routes ... FAILED
  243. 98.79 s >
  244. 98.79 s > failures:
  245. 98.79 s >
  246. 98.79 s > failures:
  247. 98.79 s > tests::portal_focuses_on_projects_and_keeps_dedicated_routes
  248. 98.79 s >
  249. 98.79 s > test result: FAILED. 0 passed; 1 failed; 0 ignored; 0 measured; 118 filtered out; finished in 0.14s
  250. 98.79 s >
  251. 98.79 s > stderr ---
  252. 98.79 s > warning: bundle export is experimental
  253. 98.79 s > = hint: its behaviour may change at any time
  254. 98.79 s > = hint: do not rely on this feature for production use cases
  255. 98.79 s >
  256. 98.79 s >
  257. 98.79 s > thread 'tests::portal_focuses_on_projects_and_keeps_dedicated_routes' (355) panicked at crates/alphal00p-docs-builder/src/lib.rs:11904:9:
  258. 98.79 s > assertion `left == right` failed
  259. 98.79 s > left: 8
  260. 98.79 s > right: 7
  261. 98.79 s > stack backtrace:
  262. 98.79 s > 0: __rustc::rust_begin_unwind
  263. 98.79 s > 1: core::panicking::panic_fmt
  264. 98.79 s > 2: core::panicking::assert_failed_inner
  265. 98.79 s > 3: core::panicking::assert_failed::<usize, usize>
  266. 98.79 s > 4: alphal00p_docs_builder::tests::portal_focuses_on_projects_and_keeps_dedicated_routes
  267. 98.79 s > 5: <alphal00p_docs_builder::tests::portal_focuses_on_projects_and_keeps_dedicated_routes::{closure#0} as core::ops::function::FnOnce<()>>::call_once
  268. 98.79 s > note: Some details are omitted, run with `RUST_BACKTRACE=full` for a verbose backtrace.
  269. 98.79 s >
  270. 98.79 s > ------------
  271. 98.79 s > Summary [ 32.085s] 119 tests run: 118 passed, 1 failed, 0 skipped
  272. 98.79 s > FAIL [ 0.161s] ( 67/119) alphal00p-docs-builder tests::portal_focuses_on_projects_and_keeps_dedicated_routes
  273. 98.79 s > stdout ---
  274. 98.79 s >
  275. 98.79 s > running 1 test
  276. 98.79 s > test tests::portal_focuses_on_projects_and_keeps_dedicated_routes ... FAILED
  277. 98.79 s >
  278. 98.79 s > failures:
  279. 98.79 s >
  280. 98.79 s > failures:
  281. 98.79 s > tests::portal_focuses_on_projects_and_keeps_dedicated_routes
  282. 98.79 s >
  283. 98.79 s > test result: FAILED. 0 passed; 1 failed; 0 ignored; 0 measured; 118 filtered out; finished in 0.14s
  284. 98.79 s >
  285. 98.79 s > stderr ---
  286. 98.79 s > warning: bundle export is experimental
  287. 98.79 s > = hint: its behaviour may change at any time
  288. 98.79 s > = hint: do not rely on this feature for production use cases
  289. 98.79 s >
  290. 98.79 s >
  291. 98.79 s > thread 'tests::portal_focuses_on_projects_and_keeps_dedicated_routes' (355) panicked at crates/alphal00p-docs-builder/src/lib.rs:11904:9:
  292. 98.79 s > assertion `left == right` failed
  293. 98.79 s > left: 8
  294. 98.79 s > right: 7
  295. 98.79 s > stack backtrace:
  296. 98.79 s > 0: __rustc::rust_begin_unwind
  297. 98.79 s > 1: core::panicking::panic_fmt
  298. 98.79 s > 2: core::panicking::assert_failed_inner
  299. 98.79 s > 3: core::panicking::assert_failed::<usize, usize>
  300. 98.79 s > 4: alphal00p_docs_builder::tests::portal_focuses_on_projects_and_keeps_dedicated_routes
  301. 98.79 s > 5: <alphal00p_docs_builder::tests::portal_focuses_on_projects_and_keeps_dedicated_routes::{closure#0} as core::ops::function::FnOnce<()>>::call_once
  302. 98.79 s > note: Some details are omitted, run with `RUST_BACKTRACE=full` for a verbose backtrace.
  303. 98.79 s >
  304. 98.79 s > error: test run failed
  305. 98.79 s >
  306. 98.79 s > ========== nextest test summary ==========
  307. 98.79 s > report: target/nextest/ci_gammaloop/junit.xml
  308. 98.79 s > tests: 119, failures: 1, errors: 0
  309. 98.79 s >
  310. 98.79 s > 1. alphal00p-docs-builder::tests::portal_focuses_on_projects_and_keeps_dedicated_routes
  311. 98.79 s > failure: test failure with exit code 101
  312. 98.79 s > thread 'tests::portal_focuses_on_projects_and_keeps_dedicated_routes' (355) panicked at crates/alphal00p-docs-builder/src/lib.rs:11904:9:
  313. 98.79 s > assertion `left == right` failed
  314. 98.79 s > left: 8
  315. 98.79 s > right: 7
  316. 98.79 s > stack backtrace:
  317. 98.79 s > 0: __rustc::rust_begin_unwind
  318. 98.79 s > 1: core::panicking::panic_fmt
  319. 98.79 s > 2: core::panicking::assert_failed_inner
  320. 98.79 s > 3: core::panicking::assert_failed::<usize, usize>
  321. 98.79 s > 4: alphal00p_docs_builder::tests::portal_focuses_on_projects_and_keeps_dedicated_routes
  322. 98.79 s > 5: <alphal00p_docs_builder::tests::portal_focuses_on_projects_and_keeps_dedicated_routes::{closure#0} as core::ops::function::FnOnce<()>>::call_once
  323. 98.79 s > note: Some details are omitted, run with `RUST_BACKTRACE=full` for a verbose backtrace.
  324. 98.79 s > system-out
  325. 98.79 s > running 1 test
  326. 98.79 s > test tests::portal_focuses_on_projects_and_keeps_dedicated_routes ... FAILED
  327. 98.79 s >
  328. 98.79 s > failures:
  329. 98.79 s >
  330. 98.79 s > failures:
  331. 98.80 s > tests::portal_focuses_on_projects_and_keeps_dedicated_routes
  332. 98.80 s >
  333. 98.80 s > test result: FAILED. 0 passed; 1 failed; 0 ignored; 0 measured; 118 filtered out; finished in 0.14s
  334. 98.80 s > system-err
  335. 98.80 s > warning: bundle export is experimental
  336. 98.80 s > = hint: its behaviour may change at any time
  337. 98.80 s > = hint: do not rely on this feature for production use cases
  338. 98.80 s >
  339. 98.80 s >
  340. 98.80 s > thread 'tests::portal_focuses_on_projects_and_keeps_dedicated_routes' (355) panicked at crates/alphal00p-docs-builder/src/lib.rs:11904:9:
  341. 98.80 s > assertion `left == right` failed
  342. 98.80 s > left: 8
  343. 98.80 s > right: 7
  344. 98.80 s > stack backtrace:
  345. 98.80 s > 0: __rustc::rust_begin_unwind
  346. 98.80 s > 1: core::panicking::panic_fmt
  347. 98.80 s > 2: core::panicking::assert_failed_inner
  348. 98.80 s > 3: core::panicking::assert_failed::<usize, usize>
  349. 98.80 s > 4: alphal00p_docs_builder::tests::portal_focuses_on_projects_and_keeps_dedicated_routes
  350. 98.80 s > 5: <alphal00p_docs_builder::tests::portal_focuses_on_projects_and_keeps_dedicated_routes::{closure#0} as core::ops::function::FnOnce<()>>::call_once
  351. 98.80 s > note: Some details are omitted, run with `RUST_BACKTRACE=full` for a verbose backtrace.
  352. 98.80 s > =========================================
  353. 98.80 s > Extracting 2 binaries to /build/source/target/nix-ci-tmp/nextest-archive-ek24Gv
  354. 98.80 s > Extracted 5 files to /build/source/target/nix-ci-tmp/nextest-archive-ek24Gv in 0.08s
  355. 98.80 s > ------------
  356. 98.80 s > Nextest run ID c8ebfe47-9dfc-4a10-b4e3-c7dbc8c633e0 with nextest profile: ci_gammaloop
  357. 98.80 s > Starting 21 tests across 2 binaries
  358. 98.80 s > ------------
  359. 98.80 s > Summary [ 0.041s] 21 tests run: 21 passed, 0 skipped
  360. 98.80 s >
  361. 98.80 s > ========== nextest test summary ==========
  362. 98.80 s > report: target/nextest/ci_gammaloop/junit.xml
  363. 98.80 s > tests: 21, failures: 0, errors: 0
  364. 98.80 s > No failing testcases found.
  365. 98.80 s > =========================================
  366. 98.80 s > Extracting 3 binaries (including 2 non-test binaries), 1 build script output directory, and 2 linked paths to /build/source/target/nix-ci-tmp/nextest-archive-ugKmYz
  367. 98.80 s > Extracted 22 files to /build/source/target/nix-ci-tmp/nextest-archive-ugKmYz in 0.38s
  368. 98.80 s > ------------
  369. 98.80 s > Nextest run ID ee72584e-8118-4bad-a987-15d1f9cd0efc with nextest profile: ci_gammaloop
  370. 98.80 s > Starting 89 tests across 1 binary
  371. 98.80 s > ------------
  372. 98.80 s > Summary [ 0.142s] 89 tests run: 89 passed, 0 skipped
  373. 98.80 s >
  374. 98.80 s > ========== nextest test summary ==========
  375. 98.80 s > report: target/nextest/ci_gammaloop/junit.xml
  376. 98.80 s > tests: 89, failures: 0, errors: 0
  377. 98.80 s > No failing testcases found.
  378. 98.80 s > =========================================
  379. 98.80 s > Extracting 2 binaries to /build/source/target/nix-ci-tmp/nextest-archive-e1ap9w
  380. 98.80 s > Extracted 5 files to /build/source/target/nix-ci-tmp/nextest-archive-e1ap9w in 0.09s
  381. 98.80 s > ------------
  382. 98.80 s > Nextest run ID 24bf0a0c-3c92-4c3a-9c93-6421014ceb8c with nextest profile: ci_gammaloop
  383. 98.80 s > Starting 10 tests across 2 binaries
  384. 98.80 s > ------------
  385. 98.80 s > Summary [ 25.183s] 10 tests run: 10 passed, 0 skipped
  386. 98.80 s >
  387. 98.80 s > ========== nextest test summary ==========
  388. 98.80 s > report: target/nextest/ci_gammaloop/junit.xml
  389. 98.80 s > tests: 10, failures: 0, errors: 0
  390. 98.80 s > No failing testcases found.
  391. 98.80 s > =========================================
  392. 98.80 s > Extracting 1 binary to /build/source/target/nix-ci-tmp/nextest-archive-LmkGAi
  393. 98.80 s > Extracted 4 files to /build/source/target/nix-ci-tmp/nextest-archive-LmkGAi in 0.09s
  394. 98.80 s > ------------
  395. 98.80 s > Nextest run ID d9d34a1d-3726-47d8-9a22-0f76830decdc with nextest profile: ci_gammaloop
  396. 98.80 s > Starting 0 tests across 1 binary
  397. 98.80 s > ------------
  398. 98.80 s > Summary [ 0.000s] 0 tests run: 0 passed, 0 skipped
  399. 98.80 s >
  400. 98.80 s > ========== nextest test summary ==========
  401. 98.80 s > report: target/nextest/ci_gammaloop/junit.xml
  402. 98.80 s > tests: 0, failures: 0, errors: 0
  403. 98.80 s > No failing testcases found.
  404. 98.80 s > =========================================
  405. 98.80 s > Extracting 1 binary to /build/source/target/nix-ci-tmp/nextest-archive-zqz7gX
  406. 98.80 s > Extracted 4 files to /build/source/target/nix-ci-tmp/nextest-archive-zqz7gX in 0.11s
  407. 98.80 s > ------------
  408. 98.80 s > Nextest run ID 007895d5-89f4-42c0-a197-1e4acb385aeb with nextest profile: ci_gammaloop
  409. 98.80 s > Starting 4 tests across 1 binary
  410. 98.80 s > ------------
  411. 98.80 s > Summary [ 0.017s] 4 tests run: 4 passed, 0 skipped
  412. 98.80 s >
  413. 98.80 s > ========== nextest test summary ==========
  414. 98.80 s > report: target/nextest/ci_gammaloop/junit.xml
  415. 98.80 s > tests: 4, failures: 0, errors: 0
  416. 98.80 s > No failing testcases found.
  417. 98.80 s > =========================================
  418. 98.80 s For full logs, run:
  419. 98.80 s nix log /nix/store/m0lsjjgxqj4xk3vaac50mb4m5ri4ngbr-gammaloop-nextest-docs.drv
  420. 99.14 s [2 built (1 failed), 54 Run failed.