0.00 s
$ /nix/store/9ypz3flqsrl5xl495mm8h645gadjsxi1-coreutils-9.11/bin/timeout --kill-after=15s 7200s /nix/store/23zk8sgzamrbmj1fday15szf7f2279s8-nix-2.34.7/bin/nix --extra-experimental-features nix-command --extra-experimental-features flakes flake clone git+https://github.com/alphal00p/gammaloop --dest /tmp/nix-ci-worker/stable-pwd/repo/
0.09 s
Cloning into '/tmp/nix-ci-worker/stable-pwd/repo'...
1.26 s
remote: Enumerating objects: 82036, done.
1.26 s
remote: Counting objects: 0% (1/8191)
remote: Counting objects: 1% (82/8191)
remote: Counting objects: 2% (164/8191)
remote: Counting objects: 3% (246/8191)
remote: Counting objects: 4% (328/8191)
remote: Counting objects: 5% (410/8191)
remote: Counting objects: 6% (492/8191)
remote: Counting objects: 7% (574/8191)
remote: Counting objects: 8% (656/8191)
remote: Counting objects: 9% (738/8191)
remote: Counting objects: 10% (820/8191)
remote: Counting objects: 11% (902/8191)
remote: Counting objects: 12% (983/8191)
remote: Counting objects: 13% (1065/8191)
remote: Counting objects: 14% (1147/8191)
remote: Counting objects: 15% (1229/8191)
remote: Counting objects: 16% (1311/8191)
remote: Counting objects: 17% (1393/8191)
remote: Counting objects: 18% (1475/8191)
remote: Counting objects: 19% (1557/8191)
remote: Counting objects: 20% (1639/8191)
remote: Counting objects: 21% (1721/8191)
remote: Counting objects: 22% (1803/8191)
remote: Counting objects: 23% (1884/8191)
remote: Counting objects: 24% (1966/8191)
remote: Counting objects: 25% (2048/8191)
remote: Counting objects: 26% (2130/8191)
remote: Counting objects: 27% (2212/8191)
remote: Counting objects: 28% (2294/8191)
remote: Counting objects: 29% (2376/8191)
remote: Counting objects: 30% (2458/8191)
remote: Counting objects: 31% (2540/8191)
remote: Counting objects: 32% (2622/8191)
remote: Counting objects: 33% (2704/8191)
remote: Counting objects: 34% (2785/8191)
remote: Counting objects: 35% (2867/8191)
remote: Counting objects: 36% (2949/8191)
remote: Counting objects: 37% (3031/8191)
remote: Counting objects: 38% (3113/8191)
remote: Counting objects: 39% (3195/8191)
remote: Counting objects: 40% (3277/8191)
remote: Counting objects: 41% (3359/8191)
remote: Counting objects: 42% (3441/8191)
remote: Counting objects: 43% (3523/8191)
remote: Counting objects: 44% (3605/8191)
remote: Counting objects: 45% (3686/8191)
remote: Counting objects: 46% (3768/8191)
remote: Counting objects: 47% (3850/8191)
remote: Counting objects: 48% (3932/8191)
remote: Counting objects: 49% (4014/8191)
remote: Counting objects: 50% (4096/8191)
remote: Counting objects: 51% (4178/8191)
remote: Counting objects: 52% (4260/8191)
remote: Counting objects: 53% (4342/8191)
remote: Counting objects: 54% (4424/8191)
remote: Counting objects: 55% (4506/8191)
remote: Counting objects: 56% (4587/8191)
remote: Counting objects: 57% (4669/8191)
remote: Counting objects: 58% (4751/8191)
remote: Counting objects: 59% (4833/8191)
remote: Counting objects: 60% (4915/8191)
remote: Counting objects: 61% (4997/8191)
remote: Counting objects: 62% (5079/8191)
remote: Counting objects: 63% (5161/8191)
remote: Counting objects: 64% (5243/8191)
remote: Counting objects: 65% (5325/8191)
remote: Counting objects: 66% (5407/8191)
remote: Counting objects: 67% (5488/8191)
remote: Counting objects: 68% (5570/8191)
remote: Counting objects: 69% (5652/8191)
remote: Counting objects: 70% (5734/8191)
remote: Counting objects: 71% (5816/8191)
remote: Counting objects: 72% (5898/8191)
remote: Counting objects: 73% (5980/8191)
remote: Counting objects: 74% (6062/8191)
remote: Counting objects: 75% (6144/8191)
remote: Counting objects: 76% (6226/8191)
remote: Counting objects: 77% (6308/8191)
remote: Counting objects: 78% (6389/8191)
remote: Counting objects: 79% (6471/8191)
remote: Counting objects: 80% (6553/8191)
remote: Counting objects: 81% (6635/8191)
remote: Counting objects: 82% (6717/8191)
remote: Counting objects: 83% (6799/8191)
remote: Counting objects: 84% (6881/8191)
remote: Counting objects: 85% (6963/8191)
remote: Counting objects: 86% (7045/8191)
remote: Counting objects: 87% (7127/8191)
remote: Counting objects: 88% (7209/8191)
remote: Counting objects: 89% (7290/8191)
remote: Counting objects: 90% (7372/8191)
remote: Counting objects: 91% (7454/8191)
remote: Counting objects: 92% (7536/8191)
remote: Counting objects: 93% (7618/8191)
remote: Counting objects: 94% (7700/8191)
remote: Counting objects: 95% (7782/8191)
remote: Counting objects: 96% (7864/8191)
remote: Counting objects: 97% (7946/8191)
remote: Counting objects: 98% (8028/8191)
remote: Counting objects: 99% (8110/8191)
remote: Counting objects: 100% (8191/8191)
remote: Counting objects: 100% (8191/8191), done.
3.05 s
remote: Compressing objects: 0% (1/1576)
remote: Compressing objects: 1% (16/1576)
remote: Compressing objects: 2% (32/1576)
remote: Compressing objects: 3% (48/1576)
remote: Compressing objects: 4% (64/1576)
remote: Compressing objects: 5% (79/1576)
remote: Compressing objects: 6% (95/1576)
remote: Compressing objects: 7% (111/1576)
remote: Compressing objects: 8% (127/1576)
remote: Compressing objects: 9% (142/1576)
remote: Compressing objects: 9% (149/1576)
remote: Compressing objects: 10% (158/1576)
remote: Compressing objects: 11% (174/1576)
remote: Compressing objects: 12% (190/1576)
remote: Compressing objects: 13% (205/1576)
remote: Compressing objects: 14% (221/1576)
remote: Compressing objects: 15% (237/1576)
remote: Compressing objects: 16% (253/1576)
remote: Compressing objects: 17% (268/1576)
remote: Compressing objects: 18% (284/1576)
remote: Compressing objects: 19% (300/1576)
remote: Compressing objects: 20% (316/1576)
remote: Compressing objects: 21% (331/1576)
remote: Compressing objects: 22% (347/1576)
remote: Compressing objects: 23% (363/1576)
remote: Compressing objects: 24% (379/1576)
remote: Compressing objects: 25% (394/1576)
remote: Compressing objects: 26% (410/1576)
remote: Compressing objects: 27% (426/1576)
remote: Compressing objects: 28% (442/1576)
remote: Compressing objects: 29% (458/1576)
remote: Compressing objects: 30% (473/1576)
remote: Compressing objects: 31% (489/1576)
remote: Compressing objects: 32% (505/1576)
remote: Compressing objects: 33% (521/1576)
remote: Compressing objects: 34% (536/1576)
remote: Compressing objects: 35% (552/1576)
remote: Compressing objects: 36% (568/1576)
remote: Compressing objects: 37% (584/1576)
remote: Compressing objects: 38% (599/1576)
remote: Compressing objects: 39% (615/1576)
remote: Compressing objects: 40% (631/1576)
remote: Compressing objects: 41% (647/1576)
remote: Compressing objects: 42% (662/1576)
remote: Compressing objects: 43% (678/1576)
remote: Compressing objects: 44% (694/1576)
remote: Compressing objects: 45% (710/1576)
remote: Compressing objects: 46% (725/1576)
remote: Compressing objects: 47% (741/1576)
remote: Compressing objects: 48% (757/1576)
remote: Compressing objects: 49% (773/1576)
remote: Compressing objects: 50% (788/1576)
remote: Compressing objects: 51% (804/1576)
remote: Compressing objects: 52% (820/1576)
remote: Compressing objects: 53% (836/1576)
remote: Compressing objects: 54% (852/1576)
remote: Compressing objects: 55% (867/1576)
remote: Compressing objects: 56% (883/1576)
remote: Compressing objects: 57% (899/1576)
remote: Compressing objects: 58% (915/1576)
remote: Compressing objects: 59% (930/1576)
remote: Compressing objects: 60% (946/1576)
remote: Compressing objects: 61% (962/1576)
remote: Compressing objects: 62% (978/1576)
remote: Compressing objects: 63% (993/1576)
remote: Compressing objects: 64% (1009/1576)
remote: Compressing objects: 65% (1025/1576)
remote: Compressing objects: 66% (1041/1576)
remote: Compressing objects: 67% (1056/1576)
remote: Compressing objects: 68% (1072/1576)
remote: Compressing objects: 69% (1088/1576)
remote: Compressing objects: 70% (1104/1576)
remote: Compressing objects: 71% (1119/1576)
remote: Compressing objects: 72% (1135/1576)
remote: Compressing objects: 73% (1151/1576)
remote: Compressing objects: 74% (1167/1576)
remote: Compressing objects: 75% (1182/1576)
remote: Compressing objects: 76% (1198/1576)
remote: Compressing objects: 77% (1214/1576)
remote: Compressing objects: 78% (1230/1576)
remote: Compressing objects: 79% (1246/1576)
remote: Compressing objects: 80% (1261/1576)
remote: Compressing objects: 81% (1277/1576)
remote: Compressing objects: 82% (1293/1576)
remote: Compressing objects: 83% (1309/1576)
remote: Compressing objects: 84% (1324/1576)
remote: Compressing objects: 85% (1340/1576)
remote: Compressing objects: 86% (1356/1576)
remote: Compressing objects: 87% (1372/1576)
remote: Compressing objects: 88% (1387/1576)
remote: Compressing objects: 89% (1403/1576)
remote: Compressing objects: 90% (1419/1576)
remote: Compressing objects: 91% (1435/1576)
remote: Compressing objects: 92% (1450/1576)
remote: Compressing objects: 93% (1466/1576)
remote: Compressing objects: 94% (1482/1576)
remote: Compressing objects: 95% (1498/1576)
remote: Compressing objects: 96% (1513/1576)
remote: Compressing objects: 97% (1529/1576)
remote: Compressing objects: 98% (1545/1576)
remote: Compressing objects: 99% (1561/1576)
remote: Compressing objects: 100% (1576/1576)
remote: Compressing objects: 100% (1576/1576), done.
6.97 s
Receiving objects: 0% (1/82036)
Receiving objects: 1% (821/82036)
Receiving objects: 2% (1641/82036)
Receiving objects: 3% (2462/82036)
Receiving objects: 4% (3282/82036)
Receiving objects: 5% (4102/82036)
Receiving objects: 6% (4923/82036)
Receiving objects: 7% (5743/82036)
Receiving objects: 8% (6563/82036)
Receiving objects: 9% (7384/82036), 14.52 MiB | 29.02 MiB/s
Receiving objects: 10% (8204/82036), 14.52 MiB | 29.02 MiB/s
Receiving objects: 11% (9024/82036), 14.52 MiB | 29.02 MiB/s
Receiving objects: 12% (9845/82036), 14.52 MiB | 29.02 MiB/s
Receiving objects: 13% (10665/82036), 14.52 MiB | 29.02 MiB/s
Receiving objects: 14% (11486/82036), 14.52 MiB | 29.02 MiB/s
Receiving objects: 15% (12306/82036), 14.52 MiB | 29.02 MiB/s
Receiving objects: 16% (13126/82036), 14.52 MiB | 29.02 MiB/s
Receiving objects: 17% (13947/82036), 14.52 MiB | 29.02 MiB/s
Receiving objects: 18% (14767/82036), 14.52 MiB | 29.02 MiB/s
Receiving objects: 19% (15587/82036), 14.52 MiB | 29.02 MiB/s
Receiving objects: 20% (16408/82036), 14.52 MiB | 29.02 MiB/s
Receiving objects: 21% (17228/82036), 14.52 MiB | 29.02 MiB/s
Receiving objects: 22% (18048/82036), 14.52 MiB | 29.02 MiB/s
Receiving objects: 23% (18869/82036), 14.52 MiB | 29.02 MiB/s
Receiving objects: 24% (19689/82036), 14.52 MiB | 29.02 MiB/s
Receiving objects: 25% (20509/82036), 14.52 MiB | 29.02 MiB/s
Receiving objects: 26% (21330/82036), 14.52 MiB | 29.02 MiB/s
Receiving objects: 27% (22150/82036), 14.52 MiB | 29.02 MiB/s
Receiving objects: 28% (22971/82036), 14.52 MiB | 29.02 MiB/s
Receiving objects: 29% (23791/82036), 14.52 MiB | 29.02 MiB/s
Receiving objects: 30% (24611/82036), 14.52 MiB | 29.02 MiB/s
Receiving objects: 31% (25432/82036), 14.52 MiB | 29.02 MiB/s
Receiving objects: 32% (26252/82036), 14.52 MiB | 29.02 MiB/s
Receiving objects: 33% (27072/82036), 14.52 MiB | 29.02 MiB/s
Receiving objects: 34% (27893/82036), 14.52 MiB | 29.02 MiB/s
Receiving objects: 35% (28713/82036), 14.52 MiB | 29.02 MiB/s
Receiving objects: 36% (29533/82036), 14.52 MiB | 29.02 MiB/s
Receiving objects: 37% (30354/82036), 14.52 MiB | 29.02 MiB/s
Receiving objects: 38% (31174/82036), 14.52 MiB | 29.02 MiB/s
Receiving objects: 39% (31995/82036), 14.52 MiB | 29.02 MiB/s
Receiving objects: 40% (32815/82036), 14.52 MiB | 29.02 MiB/s
Receiving objects: 41% (33635/82036), 14.52 MiB | 29.02 MiB/s
Receiving objects: 41% (34369/82036), 32.97 MiB | 32.49 MiB/s
Receiving objects: 42% (34456/82036), 32.97 MiB | 32.49 MiB/s
Receiving objects: 43% (35276/82036), 32.97 MiB | 32.49 MiB/s
Receiving objects: 44% (36096/82036), 32.97 MiB | 32.49 MiB/s
Receiving objects: 45% (36917/82036), 32.97 MiB | 32.49 MiB/s
Receiving objects: 46% (37737/82036), 32.97 MiB | 32.49 MiB/s
Receiving objects: 47% (38557/82036), 32.97 MiB | 32.49 MiB/s
Receiving objects: 48% (39378/82036), 32.97 MiB | 32.49 MiB/s
Receiving objects: 49% (40198/82036), 32.97 MiB | 32.49 MiB/s
Receiving objects: 50% (41018/82036), 32.97 MiB | 32.49 MiB/s
Receiving objects: 51% (41839/82036), 32.97 MiB | 32.49 MiB/s
Receiving objects: 52% (42659/82036), 32.97 MiB | 32.49 MiB/s
Receiving objects: 53% (43480/82036), 50.65 MiB | 33.44 MiB/s
Receiving objects: 54% (44300/82036), 50.65 MiB | 33.44 MiB/s
Receiving objects: 55% (45120/82036), 50.65 MiB | 33.44 MiB/s
Receiving objects: 56% (45941/82036), 50.65 MiB | 33.44 MiB/s
Receiving objects: 57% (46761/82036), 50.65 MiB | 33.44 MiB/s
Receiving objects: 58% (47581/82036), 50.65 MiB | 33.44 MiB/s
Receiving objects: 59% (48402/82036), 50.65 MiB | 33.44 MiB/s
Receiving objects: 59% (48866/82036), 66.41 MiB | 32.63 MiB/s
Receiving objects: 60% (49222/82036), 66.41 MiB | 32.63 MiB/s
Receiving objects: 61% (50042/82036), 66.41 MiB | 32.63 MiB/s
Receiving objects: 62% (50863/82036), 66.41 MiB | 32.63 MiB/s
Receiving objects: 63% (51683/82036), 66.41 MiB | 32.63 MiB/s
Receiving objects: 64% (52504/82036), 66.41 MiB | 32.63 MiB/s
Receiving objects: 65% (53324/82036), 66.41 MiB | 32.63 MiB/s
Receiving objects: 66% (54144/82036), 66.41 MiB | 32.63 MiB/s
Receiving objects: 67% (54965/82036), 66.41 MiB | 32.63 MiB/s
Receiving objects: 68% (55785/82036), 66.41 MiB | 32.63 MiB/s
Receiving objects: 69% (56605/82036), 66.41 MiB | 32.63 MiB/s
Receiving objects: 70% (57426/82036), 83.19 MiB | 32.81 MiB/s
Receiving objects: 71% (58246/82036), 83.19 MiB | 32.81 MiB/s
Receiving objects: 72% (59066/82036), 83.19 MiB | 32.81 MiB/s
Receiving objects: 73% (59887/82036), 83.19 MiB | 32.81 MiB/s
Receiving objects: 74% (60707/82036), 83.19 MiB | 32.81 MiB/s
Receiving objects: 75% (61527/82036), 83.19 MiB | 32.81 MiB/s
Receiving objects: 76% (62348/82036), 83.19 MiB | 32.81 MiB/s
Receiving objects: 76% (62717/82036), 99.68 MiB | 32.62 MiB/s
Receiving objects: 77% (63168/82036), 99.68 MiB | 32.62 MiB/s
Receiving objects: 78% (63989/82036), 99.68 MiB | 32.62 MiB/s
Receiving objects: 79% (64809/82036), 99.68 MiB | 32.62 MiB/s
Receiving objects: 80% (65629/82036), 99.68 MiB | 32.62 MiB/s
Receiving objects: 81% (66450/82036), 99.68 MiB | 32.62 MiB/s
Receiving objects: 82% (67270/82036), 99.68 MiB | 32.62 MiB/s
Receiving objects: 83% (68090/82036), 99.68 MiB | 32.62 MiB/s
Receiving objects: 84% (68911/82036), 99.68 MiB | 32.62 MiB/s
Receiving objects: 85% (69731/82036), 99.68 MiB | 32.62 MiB/s
Receiving objects: 86% (70551/82036), 99.68 MiB | 32.62 MiB/s
Receiving objects: 87% (71372/82036), 116.06 MiB | 32.64 MiB/s
Receiving objects: 88% (72192/82036), 116.06 MiB | 32.64 MiB/s
Receiving objects: 89% (73013/82036), 116.06 MiB | 32.64 MiB/s
Receiving objects: 90% (73833/82036), 116.06 MiB | 32.64 MiB/s
Receiving objects: 91% (74653/82036), 116.06 MiB | 32.64 MiB/s
Receiving objects: 92% (75474/82036), 116.06 MiB | 32.64 MiB/s
Receiving objects: 93% (76294/82036), 116.06 MiB | 32.64 MiB/s
Receiving objects: 94% (77114/82036), 116.06 MiB | 32.64 MiB/s
Receiving objects: 95% (77935/82036), 116.06 MiB | 32.64 MiB/s
Receiving objects: 96% (78755/82036), 116.06 MiB | 32.64 MiB/s
Receiving objects: 97% (79575/82036), 116.06 MiB | 32.64 MiB/s
Receiving objects: 98% (80396/82036), 116.06 MiB | 32.64 MiB/s
Receiving objects: 99% (81216/82036), 116.06 MiB | 32.64 MiB/s
remote: Total 82036 (delta 7183), reused 6623 (delta 6615), pack-reused 73845 (from 3)
6.97 s
Receiving objects: 100% (82036/82036), 116.06 MiB | 32.64 MiB/s
Receiving objects: 100% (82036/82036), 128.03 MiB | 32.70 MiB/s, done.
9.13 s
Resolving deltas: 0% (0/55499)
Resolving deltas: 1% (555/55499)
Resolving deltas: 2% (1110/55499)
Resolving deltas: 3% (1665/55499)
Resolving deltas: 4% (2221/55499)
Resolving deltas: 5% (2775/55499)
Resolving deltas: 6% (3330/55499)
Resolving deltas: 7% (3885/55499)
Resolving deltas: 8% (4440/55499)
Resolving deltas: 9% (4997/55499)
Resolving deltas: 10% (5550/55499)
Resolving deltas: 11% (6105/55499)
Resolving deltas: 12% (6660/55499)
Resolving deltas: 13% (7215/55499)
Resolving deltas: 14% (7770/55499)
Resolving deltas: 15% (8325/55499)
Resolving deltas: 16% (8880/55499)
Resolving deltas: 17% (9435/55499)
Resolving deltas: 18% (9991/55499)
Resolving deltas: 19% (10545/55499)
Resolving deltas: 20% (11100/55499)
Resolving deltas: 21% (11655/55499)
Resolving deltas: 22% (12210/55499)
Resolving deltas: 23% (12765/55499)
Resolving deltas: 24% (13320/55499)
Resolving deltas: 25% (13875/55499)
Resolving deltas: 26% (14430/55499)
Resolving deltas: 27% (14985/55499)
Resolving deltas: 28% (15540/55499)
Resolving deltas: 29% (16095/55499)
Resolving deltas: 30% (16650/55499)
Resolving deltas: 31% (17205/55499)
Resolving deltas: 32% (17760/55499)
Resolving deltas: 33% (18315/55499)
Resolving deltas: 34% (18870/55499)
Resolving deltas: 35% (19425/55499)
Resolving deltas: 36% (19980/55499)
Resolving deltas: 37% (20536/55499)
Resolving deltas: 38% (21090/55499)
Resolving deltas: 39% (21645/55499)
Resolving deltas: 40% (22200/55499)
Resolving deltas: 41% (22755/55499)
Resolving deltas: 42% (23310/55499)
Resolving deltas: 43% (23865/55499)
Resolving deltas: 44% (24420/55499)
Resolving deltas: 45% (24975/55499)
Resolving deltas: 46% (25530/55499)
Resolving deltas: 47% (26085/55499)
Resolving deltas: 48% (26640/55499)
Resolving deltas: 49% (27196/55499)
Resolving deltas: 50% (27750/55499)
Resolving deltas: 51% (28306/55499)
Resolving deltas: 52% (28860/55499)
Resolving deltas: 53% (29415/55499)
Resolving deltas: 54% (29970/55499)
Resolving deltas: 55% (30525/55499)
Resolving deltas: 56% (31080/55499)
Resolving deltas: 57% (31635/55499)
Resolving deltas: 58% (32190/55499)
Resolving deltas: 59% (32745/55499)
Resolving deltas: 59% (32878/55499)
Resolving deltas: 60% (33300/55499)
Resolving deltas: 61% (33855/55499)
Resolving deltas: 62% (34411/55499)
Resolving deltas: 63% (34965/55499)
Resolving deltas: 64% (35520/55499)
Resolving deltas: 65% (36075/55499)
Resolving deltas: 66% (36630/55499)
Resolving deltas: 67% (37185/55499)
Resolving deltas: 68% (37740/55499)
Resolving deltas: 69% (38295/55499)
Resolving deltas: 70% (38850/55499)
Resolving deltas: 71% (39405/55499)
Resolving deltas: 72% (39960/55499)
Resolving deltas: 73% (40516/55499)
Resolving deltas: 74% (41070/55499)
Resolving deltas: 75% (41625/55499)
Resolving deltas: 76% (42180/55499)
Resolving deltas: 77% (42735/55499)
Resolving deltas: 78% (43290/55499)
Resolving deltas: 79% (43846/55499)
Resolving deltas: 80% (44402/55499)
Resolving deltas: 81% (44955/55499)
Resolving deltas: 82% (45510/55499)
Resolving deltas: 83% (46065/55499)
Resolving deltas: 84% (46620/55499)
Resolving deltas: 85% (47175/55499)
Resolving deltas: 86% (47730/55499)
Resolving deltas: 87% (48285/55499)
Resolving deltas: 88% (48840/55499)
Resolving deltas: 89% (49395/55499)
Resolving deltas: 89% (49713/55499)
Resolving deltas: 90% (49950/55499)
Resolving deltas: 91% (50505/55499)
Resolving deltas: 92% (51060/55499)
Resolving deltas: 93% (51616/55499)
Resolving deltas: 94% (52170/55499)
Resolving deltas: 95% (52725/55499)
Resolving deltas: 96% (53280/55499)
Resolving deltas: 97% (53835/55499)
Resolving deltas: 98% (54390/55499)
Resolving deltas: 99% (54945/55499)
Resolving deltas: 100% (55499/55499)
Resolving deltas: 100% (55499/55499), done.
9.56 s
Fetching commit 6f75e57e4dfbb9f3146dd0702063ab30728c6469 for docs ...
9.57 s
$ /nix/store/bcnisk3ydfgv26v2gw3zlky24g00yww2-git-2.54.0/bin/git fetch origin 6f75e57e4dfbb9f3146dd0702063ab30728c6469
10.02 s
From https://github.com/alphal00p/gammaloop
10.02 s
* branch 6f75e57e4dfbb9f3146dd0702063ab30728c6469 -> FETCH_HEAD
10.04 s
$ /nix/store/9ypz3flqsrl5xl495mm8h645gadjsxi1-coreutils-9.11/bin/timeout --kill-after=15s 7200s /nix/store/bcnisk3ydfgv26v2gw3zlky24g00yww2-git-2.54.0/bin/git -c advice.detachedHead=false checkout 6f75e57e4dfbb9f3146dd0702063ab30728c6469
10.27 s
HEAD is now at 6f75e57e4 restore direct About affiliation card structure
10.27 s
$ /nix/store/9ypz3flqsrl5xl495mm8h645gadjsxi1-coreutils-9.11/bin/timeout --kill-after=15s 7200s /nix/store/23zk8sgzamrbmj1fday15szf7f2279s8-nix-2.34.7/bin/nix --extra-experimental-features nix-command --extra-experimental-features flakes --log-format internal-json run .#packages.x86_64-linux.nix-ci-check-gammaloop-nextest-docs --print-build-logs
10.44 s
10.74 s
Downloading cached gammaloop-crate-test-dependencies-2eb5b33ee44c6126-deps from https://cache.nix-ci.com
11.04 s
Downloaded cached gammaloop-crate-test-dependencies-2eb5b33ee44c6126-deps (20.8 MiB) in 305ms
11.04 s
Progress: 0 of 4 built, 1 of 7 downloaded from cache
11.05 s
Downloading cached gammaloop-crate-test-dependencies-c2a9e942000317c9-inputs from https://cache.nix-ci.com
40.61 s
Downloaded cached gammaloop-crate-test-dependencies-c2a9e942000317c9-inputs (3.8 GiB) in 29.5s
40.61 s
Progress: 0 of 4 built, 2 of 7 downloaded from cache
40.61 s
Downloading cached gammaloop-crate-test-dependencies-c2a9e942000317c9-deps from https://cache.nix-ci.com
40.84 s
Downloaded cached gammaloop-crate-test-dependencies-c2a9e942000317c9-deps (10.2 MiB) in 230ms
40.84 s
Progress: 0 of 4 built, 3 of 7 downloaded from cache
40.84 s
Downloading cached gammaloop-crate-test-dependencies-ccb1c8a19b0027d8-inputs from https://cache.nix-ci.com
71.90 s
Downloaded cached gammaloop-crate-test-dependencies-ccb1c8a19b0027d8-inputs (3.8 GiB) in 31.0s
71.90 s
Progress: 0 of 4 built, 4 of 7 downloaded from cache
71.91 s
Downloading cached gammaloop-crate-test-dependencies-ccb1c8a19b0027d8-deps from https://cache.nix-ci.com
72.34 s
Downloaded cached gammaloop-crate-test-dependencies-ccb1c8a19b0027d8-deps (29.7 MiB) in 437ms
72.34 s
Progress: 0 of 4 built, 5 of 7 downloaded from cache
72.35 s
Downloading cached gammaloop-crate-test-binaries-alphal00p-docs-examples-ccb1c8a19b0027d8-inputs from https://cache.nix-ci.com
104.67 s
Downloaded cached gammaloop-crate-test-binaries-alphal00p-docs-examples-ccb1c8a19b0027d8-inputs (3.9 GiB) in 32.3s
104.67 s
Progress: 0 of 4 built, 6 of 7 downloaded from cache
104.67 s
Downloading cached gammaloop-crate-test-binaries-alphal00p-docs-examples-ccb1c8a19b0027d8-deps from https://cache.nix-ci.com
104.75 s
Downloaded cached gammaloop-crate-test-binaries-alphal00p-docs-examples-ccb1c8a19b0027d8-deps (7 MiB) in 85ms
104.75 s
Progress: 0 of 4 built, 7 of 7 downloaded from cache
105.36 s
Building /nix/store/363npsxghg9grvdnb2fchqy5bx5xcamk-gammaloop-nextest-binaries-docs-alphal00p-docs-examples-0.1.0.drv
105.53 s
[gammaloop-nextest-binaries-docs-alphal00p-docs-examples] Phase: unpackPhase
105.54 s
[gammaloop-nextest-binaries-docs-alphal00p-docs-examples] unpacking source archive /nix/store/pca3d4zg70xxkq4p1m49i7hfs73kd150-source
107.02 s
[gammaloop-nextest-binaries-docs-alphal00p-docs-examples] source root is source
107.04 s
[gammaloop-nextest-binaries-docs-alphal00p-docs-examples] Phase: patchPhase
107.50 s
[gammaloop-nextest-binaries-docs-alphal00p-docs-examples] copying cargo artifacts from /nix/store/8wy10h0k22hx4i946sbz141k68dygfxj-gammaloop-crate-test-binaries-alphal00p-docs-examples-ccb1c8a19b0027d8-inputs/target to target
107.50 s
[gammaloop-nextest-binaries-docs-alphal00p-docs-examples] will deep copy artifacts (instead of symlinking) as requested
110.96 s
[gammaloop-nextest-binaries-docs-alphal00p-docs-examples] Executing configureCargoCommonVars
110.96 s
[gammaloop-nextest-binaries-docs-alphal00p-docs-examples] decompressing cargo artifacts from /nix/store/xzy187j2i47lhxjfjkhlzq0rhzryxl5n-gammaloop-crate-test-binaries-alphal00p-docs-examples-ccb1c8a19b0027d8-deps-0.1.0/target.tar.zst to target
111.05 s
[gammaloop-nextest-binaries-docs-alphal00p-docs-examples] Phase: updateAutotoolsGnuConfigScriptsPhase
111.53 s
[gammaloop-nextest-binaries-docs-alphal00p-docs-examples] Phase: configurePhase
111.54 s
[gammaloop-nextest-binaries-docs-alphal00p-docs-examples] will append /build/source/.cargo-home/config.toml with contents of /nix/store/29aa708jkn8wd8vjwja1a5gh8k8wpi2b-vendor-cargo-deps/config.toml
111.55 s
[gammaloop-nextest-binaries-docs-alphal00p-docs-examples] default configurePhase, nothing to do
111.56 s
[gammaloop-nextest-binaries-docs-alphal00p-docs-examples] Phase: buildPhase
111.60 s
[gammaloop-nextest-binaries-docs-alphal00p-docs-examples] +++ command cargo --version
111.61 s
[gammaloop-nextest-binaries-docs-alphal00p-docs-examples] cargo 1.98.0 (797e8a9bc 2026-08-05)
111.72 s
[gammaloop-nextest-binaries-docs-alphal00p-docs-examples] +++ command cargo nextest --version
112.09 s
[gammaloop-nextest-binaries-docs-alphal00p-docs-examples] cargo-nextest 0.9.143
112.09 s
[gammaloop-nextest-binaries-docs-alphal00p-docs-examples] release: 0.9.143
112.09 s
[gammaloop-nextest-binaries-docs-alphal00p-docs-examples] host: x86_64-unknown-linux-gnu
112.09 s
[gammaloop-nextest-binaries-docs-alphal00p-docs-examples] +++ command cargo nextest archive --cargo-profile ci-optim --offline -p alphal00p-docs-examples -E 'package(alphal00p-docs-examples)' --profile ci_gammaloop --archive-file /nix/store/y0c3n4i9ck8cyjzhbvavjswp2gq2k857-gammaloop-nextest-binaries-docs-alphal00p-docs-examples-0.1.0/gammaloop-nextest-docs-alphal00p-docs-examples.tar.zst
113.84 s
[gammaloop-nextest-binaries-docs-alphal00p-docs-examples] Finished `ci-optim` profile [optimized] target(s) in 0.47s
114.02 s
[gammaloop-nextest-binaries-docs-alphal00p-docs-examples] warning : the following packages contain code that will be rejected by a future version of Rust: proc-macro-error2 v2.0.1
114.02 s
[gammaloop-nextest-binaries-docs-alphal00p-docs-examples] note : to see what the problems were, use the option `--future-incompat-report`, or run `cargo report future-incompatibilities --id 1`
114.08 s
[gammaloop-nextest-binaries-docs-alphal00p-docs-examples] Archiving 3 binaries (including 2 non-test binaries), 1 build script output directory, 2 linked paths, and 1 standard library to /nix/store/y0c3n4i9ck8cyjzhbvavjswp2gq2k857-gammaloop-nextest-binaries-docs-alphal00p-docs-examples-0.1.0/gammaloop-nextest-docs-alphal00p-docs-examples.tar.zst
114.49 s
[gammaloop-nextest-binaries-docs-alphal00p-docs-examples] Archived 22 files to /nix/store/y0c3n4i9ck8cyjzhbvavjswp2gq2k857-gammaloop-nextest-binaries-docs-alphal00p-docs-examples-0.1.0/gammaloop-nextest-docs-alphal00p-docs-examples.tar.zst in 0.40s
114.50 s
[gammaloop-nextest-binaries-docs-alphal00p-docs-examples] Phase: installPhase
114.52 s
[gammaloop-nextest-binaries-docs-alphal00p-docs-examples] Phase: fixupPhase
114.59 s
[gammaloop-nextest-binaries-docs-alphal00p-docs-examples] shrinking RPATHs of ELF executables and libraries in /nix/store/y0c3n4i9ck8cyjzhbvavjswp2gq2k857-gammaloop-nextest-binaries-docs-alphal00p-docs-examples-0.1.0
114.59 s
[gammaloop-nextest-binaries-docs-alphal00p-docs-examples] checking for references to /build/ in /nix/store/y0c3n4i9ck8cyjzhbvavjswp2gq2k857-gammaloop-nextest-binaries-docs-alphal00p-docs-examples-0.1.0...
114.60 s
[gammaloop-nextest-binaries-docs-alphal00p-docs-examples] patching script interpreter paths in /nix/store/y0c3n4i9ck8cyjzhbvavjswp2gq2k857-gammaloop-nextest-binaries-docs-alphal00p-docs-examples-0.1.0
115.22 s
[gammaloop-nextest-binaries-docs-alphal00p-docs-examples:post-build] Uploading to the NixCI cache: /nix/store/y0c3n4i9ck8cyjzhbvavjswp2gq2k857-gammaloop-nextest-binaries-docs-alphal00p-docs-examples-0.1.0
115.81 s
[gammaloop-nextest-binaries-docs-alphal00p-docs-examples:post-build] warning: 'warn-short-path-literals' is deprecated, use 'lint-short-path-literals = ignore' instead
115.85 s
[gammaloop-nextest-binaries-docs-alphal00p-docs-examples:post-build] copying 1 paths...
115.85 s
[gammaloop-nextest-binaries-docs-alphal00p-docs-examples:post-build] copying path '/nix/store/y0c3n4i9ck8cyjzhbvavjswp2gq2k857-gammaloop-nextest-binaries-docs-alphal00p-docs-examples-0.1.0' to 'https://cache.nix-ci.com'...
130.38 s
[gammaloop-nextest-binaries-docs-alphal00p-docs-examples:post-build] warning: 'warn-short-path-literals' is deprecated, use 'lint-short-path-literals = ignore' instead
130.74 s
[gammaloop-nextest-binaries-docs-alphal00p-docs-examples:post-build] copying 7 paths...
130.74 s
[gammaloop-nextest-binaries-docs-alphal00p-docs-examples:post-build] copying path '/nix/store/363npsxghg9grvdnb2fchqy5bx5xcamk-gammaloop-nextest-binaries-docs-alphal00p-docs-examples-0.1.0.drv' to 'https://cache.nix-ci.com'...
130.75 s
[gammaloop-nextest-binaries-docs-alphal00p-docs-examples:post-build] copying path '/nix/store/5rhjamryapi6mh7rgc242mwkixr8fqs6-gammaloop-ci-test-binary-dependencies-f0fcd1c00f14168e-Cargo.toml.drv' to 'https://cache.nix-ci.com'...
130.75 s
[gammaloop-nextest-binaries-docs-alphal00p-docs-examples:post-build] copying path '/nix/store/6ad3g8cwjlwi81r4hkfp61gic75dxn05-gammaloop-crate-test-dependencies-f0fcd1c00f14168e-inputs.drv' to 'https://cache.nix-ci.com'...
130.75 s
[gammaloop-nextest-binaries-docs-alphal00p-docs-examples:post-build] copying path '/nix/store/j4ymyny66zznw0wnhs54wxxrr2b7nrzv-source' to 'https://cache.nix-ci.com'...
130.76 s
[gammaloop-nextest-binaries-docs-alphal00p-docs-examples:post-build] copying path '/nix/store/f9wcqvi8rzpqd31kizmmmdxib5j2nq0p-gammaloop-ci-test-dependencies-f0fcd1c00f14168e-Cargo.toml.drv' to 'https://cache.nix-ci.com'...
130.87 s
[gammaloop-nextest-binaries-docs-alphal00p-docs-examples:post-build] copying path '/nix/store/pvxj0smn8iwxx94pqgnzpcjay6pczbdq-gammaloop-crate-test-dependencies-f0fcd1c00f14168e-deps-0.1.0.drv' to 'https://cache.nix-ci.com'...
130.91 s
[gammaloop-nextest-binaries-docs-alphal00p-docs-examples:post-build] copying path '/nix/store/ds684p0jgnk7vcgh6kiijg7vm0aa8bbh-gammaloop-crate-test-dependencies-2eb5b33ee44c6126-inputs.drv' to 'https://cache.nix-ci.com'...
131.24 s
Uploaded gammaloop-nextest-binaries-docs-alphal00p-docs-examples in 16.1s
131.25 s
Progress: 1 of 4 built, 7 of 7 downloaded from cache
131.25 s
Built gammaloop-nextest-binaries-docs-alphal00p-docs-examples in 25.8s
131.34 s
Building /nix/store/gq5dq0akllm47pqlbz5f3x7clqbz290w-gammaloop-nextest-binaries-docs.drv
131.55 s
[gammaloop-nextest-binaries-docs:post-build] Uploading to the NixCI cache: /nix/store/w6nbv0j4vwdgnmqxwgm18ffhilm99kxi-gammaloop-nextest-binaries-docs
132.20 s
[gammaloop-nextest-binaries-docs:post-build] warning: 'warn-short-path-literals' is deprecated, use 'lint-short-path-literals = ignore' instead
132.48 s
[gammaloop-nextest-binaries-docs:post-build] copying 1 paths...
132.48 s
[gammaloop-nextest-binaries-docs:post-build] copying path '/nix/store/w6nbv0j4vwdgnmqxwgm18ffhilm99kxi-gammaloop-nextest-binaries-docs' to 'https://cache.nix-ci.com'...
133.48 s
[gammaloop-nextest-binaries-docs:post-build] warning: 'warn-short-path-literals' is deprecated, use 'lint-short-path-literals = ignore' instead
133.95 s
[gammaloop-nextest-binaries-docs:post-build] copying 1 paths...
133.95 s
[gammaloop-nextest-binaries-docs:post-build] copying path '/nix/store/gq5dq0akllm47pqlbz5f3x7clqbz290w-gammaloop-nextest-binaries-docs.drv' to 'https://cache.nix-ci.com'...
134.35 s
Uploaded gammaloop-nextest-binaries-docs in 2.9s
134.36 s
Progress: 2 of 4 built, 7 of 7 downloaded from cache
134.36 s
Built gammaloop-nextest-binaries-docs in 3.0s
134.47 s
Building /nix/store/9v540gjbnsi0njf78s6dnybmrcc6vcqb-nix-ci-check-gammaloop-nextest-docs.drv
134.64 s
[nix-ci-check-gammaloop-nextest-docs:post-build] Uploading to the NixCI cache: /nix/store/hyglqrkz4m07ni6m41zsxf2m4zq8rd4k-nix-ci-check-gammaloop-nextest-docs
135.28 s
[nix-ci-check-gammaloop-nextest-docs:post-build] warning: 'warn-short-path-literals' is deprecated, use 'lint-short-path-literals = ignore' instead
135.36 s
[nix-ci-check-gammaloop-nextest-docs:post-build] copying 1 paths...
135.36 s
[nix-ci-check-gammaloop-nextest-docs:post-build] copying path '/nix/store/hyglqrkz4m07ni6m41zsxf2m4zq8rd4k-nix-ci-check-gammaloop-nextest-docs' to 'https://cache.nix-ci.com'...
137.67 s
[nix-ci-check-gammaloop-nextest-docs:post-build] warning: 'warn-short-path-literals' is deprecated, use 'lint-short-path-literals = ignore' instead
139.07 s
[nix-ci-check-gammaloop-nextest-docs:post-build] copying 1 paths...
139.07 s
[nix-ci-check-gammaloop-nextest-docs:post-build] copying path '/nix/store/9v540gjbnsi0njf78s6dnybmrcc6vcqb-nix-ci-check-gammaloop-nextest-docs.drv' to 'https://cache.nix-ci.com'...
139.49 s
Uploaded nix-ci-check-gammaloop-nextest-docs in 4.8s
139.49 s
Progress: 3 of 4 built, 7 of 7 downloaded from cache
139.49 s
Built nix-ci-check-gammaloop-nextest-docs in 5.0s
139.49 s
Progress: 4 of 4 built, 7 of 7 downloaded from cache
140.03 s
evaluating derivation 'gevaluation warning: stdenv.isDarwin is deprecated, use stdenv.hostPlatform.isDarwin instead
149.19 s
copying '/nix/store/f6vy
evaluating derivation 'g
copying '/nix/store/f6vy
evaluating derivation 'g
copying '/nix/store/f6vy
evaluating derivation 'g
copying '/nix/store/f6vy
evaluating derivation 'g
copying '/nix/store/f6vy
evaluating derivation 'g
copying '/nix/store/f6vy
evaluating derivation 'g
copying '/nix/store/f6vy
evaluating derivation 'g
copying '/nix/store/f6vy
evaluating derivation 'g
copying '/nix/store/f6vy
evaluating derivation 'g
copying '/nix/store/f6vy
evaluating derivation 'g
querying gammaloop-nexte
[2.9 KiB DL] querying ma
[21.7 KiB DL] querying p
[43.9 KiB DL] querying l
[0 /4 built, 0 /33 copied
[0 /17 built, 16 /0 /70 cop
[1 /0 /17 built, 16 /0 /65 cbuilder.pl> Running phase: patchPhase
149.20 s
[2 /0 /17 built, 16 /65 copbuilder.pl> Running phase: updateAutotoolsGnuConfigScriptsPhase
149.24 s
[2 /0 /16 built, 16 /16 /65 builder.pl> Running phase: patchPhase
149.82 s
builder.pl> Running phase: configurePhase
149.82 s
[2 /0 /16 built, 15 /18 /65 builder.pl> Running phase: updateAutotoolsGnuConfigScriptsPhase
149.95 s
[2 /0 /16 built, 16 /18 /65 builder.pl> no configure script, doing nothing
149.95 s
[2 /0 /16 built, 10 /25 /65 builder.pl> Running phase: buildPhase
149.95 s
builder.pl> Running phase: configurePhase
149.98 s
builder.pl> Running phase: checkPhase
149.98 s
[2 /0 /16 built, 15 /26 /65 builder.pl> no configure script, doing nothing
149.98 s
builder.pl> Running phase: installPhase
149.98 s
[2 /0 /16 built, 14 /28 /65 builder.pl> Running phase: buildPhase
149.98 s
builder.pl> Running phase: checkPhase
150.01 s
[2 /0 /16 built, 16 /29 /65 builder.pl> no Makefile or custom installPhase, doing nothing
150.01 s
builder.pl> Running phase: fixupPhase
150.01 s
builder.pl> Running phase: installPhase
150.01 s
builder.pl> no Makefile or custom installPhase, doing nothing
150.01 s
[2 /0 /16 built, 15 /30 /65 builder.pl> Running phase: fixupPhase
150.05 s
[2 /0 /16 built, 16 /31 /65 builder.pl> shrinking RPATHs of ELF executables and libraries in /nix/store/654vgnw02gp7qz9lnaa6mypnmbgp8473-builder.pl
150.05 s
[2 /0 /15 built, 15 /33 /65 builder.pl> checking for references to /build/ in /nix/store/654vgnw02gp7qz9lnaa6mypnmbgp8473-builder.pl...
150.06 s
builder.pl> shrinking RPATHs of ELF executables and libraries in /nix/store/n17p4y03iknmyjpnfk30rj7i0klr448n-builder.pl
150.06 s
[2 /0 /15 built, 13 /35 /65 builder.pl> checking for references to /build/ in /nix/store/n17p4y03iknmyjpnfk30rj7i0klr448n-builder.pl...
150.06 s
[2 /0 /14 built, 15 /35 /65 builder.pl> patching script interpreter paths in /nix/store/654vgnw02gp7qz9lnaa6mypnmbgp8473-builder.pl
150.09 s
builder.pl> patching script interpreter paths in /nix/store/n17p4y03iknmyjpnfk30rj7i0klr448n-builder.pl
150.22 s
builder.pl (post)> Uploading to the NixCI cache: /nix/store/654vgnw02gp7qz9lnaa6mypnmbgp8473-builder.pl
150.82 s
builder.pl (post)> warning: 'warn-short-path-literals' is deprecated, use 'lint-short-path-literals = ignore' instead
150.92 s
builder.pl (post)> copying 0 paths...
151.54 s
builder.pl (post)> warning: 'warn-short-path-literals' is deprecated, use 'lint-short-path-literals = ignore' instead
151.66 s
builder.pl (post)> copying 0 paths...
151.89 s
[1 /1 /14 built, 50 /65 copbuilder.pl (post)> Uploading to the NixCI cache: /nix/store/n17p4y03iknmyjpnfk30rj7i0klr448n-builder.pl
152.39 s
builder.pl (post)> warning: 'warn-short-path-literals' is deprecated, use 'lint-short-path-literals = ignore' instead
152.50 s
builder.pl (post)> copying 0 paths...
153.23 s
builder.pl (post)> warning: 'warn-short-path-literals' is deprecated, use 'lint-short-path-literals = ignore' instead
153.35 s
builder.pl (post)> copying 0 paths...
153.72 s
[2 /9 built, 5 /50 /65 copi
[2 /7 built, 2 /54 /65 copitypst> structuredAttrs is enabled
153.80 s
[1 /2 /7 built, 2 /55 /65 cotypst> created 4 symlinks in user environment
154.22 s
[1 /2 /7 built, 5 /56 /65 co
[1 /2 /7 built, 3 /61 /65 co
[1 /2 /7 built, 2 /63 /65 co
[1 /2 /6 built, 1 /64 /65 co
[2 /2 /6 built, 1 /64 /65 cotypst (post)> Uploading to the NixCI cache: /nix/store/8vl9izw3pfyd994wimgwsxh9rz3062ml-typst-0.15.0-env
154.58 s
typst (post)> warning: 'warn-short-path-literals' is deprecated, use 'lint-short-path-literals = ignore' instead
154.65 s
typst (post)> copying 0 paths...
155.06 s
typst (post)> warning: 'warn-short-path-literals' is deprecated, use 'lint-short-path-literals = ignore' instead
155.21 s
typst (post)> copying 0 paths...
155.35 s
python3> structuredAttrs is enabled
155.35 s
[1 /3 /6 built, 65 copied python3> created 227 symlinks in user environment
156.36 s
[1 /3 /5 built, 65 copied python3 (post)> Uploading to the NixCI cache: /nix/store/v67wpyflacy0i2gvzasrxvw2gkz4mr12-python3-3.13.15-env
156.78 s
python3 (post)> warning: 'warn-short-path-literals' is deprecated, use 'lint-short-path-literals = ignore' instead
156.91 s
python3 (post)> copying 0 paths...
157.58 s
python3 (post)> warning: 'warn-short-path-literals' is deprecated, use 'lint-short-path-literals = ignore' instead
157.84 s
python3 (post)> copying 0 paths...
159.30 s
[4 /6 built, 65 copied (6
[1 /4 /5 built, 65 copied gammaloop-nextest-docs> Extracting 2 binaries to /build/source/target/nix-ci-tmp/nextest-archive-bgwoh8
159.35 s
gammaloop-nextest-docs> Extracted 5 files to /build/source/target/nix-ci-tmp/nextest-archive-bgwoh8 in 0.06s
159.43 s
gammaloop-nextest-docs> ------------
159.43 s
gammaloop-nextest-docs> Nextest run ID 6a31f422-c056-42f0-8a05-f79c3317ba13 with nextest profile: ci_gammaloop
159.43 s
gammaloop-nextest-docs> Starting 119 tests across 2 binaries
159.66 s
gammaloop-nextest-docs> FAIL [ 0.110s] ( 64/119) alphal00p-docs-builder tests :: portal_focuses_on_projects_and_keeps_dedicated_routes
159.66 s
gammaloop-nextest-docs> stdout ---
159.66 s
gammaloop-nextest-docs>
159.66 s
gammaloop-nextest-docs> running 1 test
159.66 s
gammaloop-nextest-docs> test tests::portal_focuses_on_projects_and_keeps_dedicated_routes ... FAILED
159.66 s
gammaloop-nextest-docs>
159.66 s
gammaloop-nextest-docs> failures:
159.66 s
gammaloop-nextest-docs>
159.66 s
gammaloop-nextest-docs> failures:
159.66 s
gammaloop-nextest-docs> tests::portal_focuses_on_projects_and_keeps_dedicated_routes
159.66 s
gammaloop-nextest-docs>
159.66 s
gammaloop-nextest-docs> test result: FAILED. 0 passed; 1 failed; 0 ignored; 0 measured; 118 filtered out; finished in 0.10s
159.66 s
gammaloop-nextest-docs>
159.66 s
gammaloop-nextest-docs> stderr ---
159.66 s
gammaloop-nextest-docs> warning: bundle export is experimental
159.66 s
gammaloop-nextest-docs> = hint: its behaviour may change at any time
159.66 s
gammaloop-nextest-docs> = hint: do not rely on this feature for production use cases
159.66 s
gammaloop-nextest-docs>
159.66 s
gammaloop-nextest-docs>
159.66 s
gammaloop-nextest-docs> thread 'tests::portal_focuses_on_projects_and_keeps_dedicated_routes' (363) panicked at crates/alphal00p-docs-builder/src/lib.rs:11904:9:
159.66 s
gammaloop-nextest-docs> assertion `left == right` failed
159.66 s
gammaloop-nextest-docs> left: 8
159.66 s
gammaloop-nextest-docs> right: 7
159.66 s
gammaloop-nextest-docs> stack backtrace:
159.66 s
gammaloop-nextest-docs> 0: __rustc::rust_begin_unwind
159.66 s
gammaloop-nextest-docs> 1: core::panicking::panic_fmt
159.66 s
gammaloop-nextest-docs> 2: core::panicking::assert_failed_inner
159.66 s
gammaloop-nextest-docs> 3: core::panicking::assert_failed::<usize, usize>
159.66 s
gammaloop-nextest-docs> 4: alphal00p_docs_builder::tests::portal_focuses_on_projects_and_keeps_dedicated_routes
159.66 s
gammaloop-nextest-docs> 5: <alphal00p_docs_builder::tests::portal_focuses_on_projects_and_keeps_dedicated_routes::{closure#0} as core::ops::function::FnOnce<()>>::call_once
159.66 s
gammaloop-nextest-docs> note: Some details are omitted, run with `RUST_BACKTRACE=full` for a verbose backtrace.
159.66 s
gammaloop-nextest-docs>
184.77 s
gammaloop-nextest-docs> ------------
184.77 s
gammaloop-nextest-docs> Summary [ 25.342s] 119 tests run: 118 passed , 1 failed , 0 skipped
184.77 s
gammaloop-nextest-docs> FAIL [ 0.110s] ( 64/119) alphal00p-docs-builder tests :: portal_focuses_on_projects_and_keeps_dedicated_routes
184.77 s
gammaloop-nextest-docs> stdout ---
184.77 s
gammaloop-nextest-docs>
184.77 s
gammaloop-nextest-docs> running 1 test
184.77 s
gammaloop-nextest-docs> test tests::portal_focuses_on_projects_and_keeps_dedicated_routes ... FAILED
184.77 s
gammaloop-nextest-docs>
184.77 s
gammaloop-nextest-docs> failures:
184.77 s
gammaloop-nextest-docs>
184.77 s
gammaloop-nextest-docs> failures:
184.77 s
gammaloop-nextest-docs> tests::portal_focuses_on_projects_and_keeps_dedicated_routes
184.77 s
gammaloop-nextest-docs>
184.77 s
gammaloop-nextest-docs> test result: FAILED. 0 passed; 1 failed; 0 ignored; 0 measured; 118 filtered out; finished in 0.10s
184.77 s
gammaloop-nextest-docs>
184.77 s
gammaloop-nextest-docs> stderr ---
184.77 s
gammaloop-nextest-docs> warning: bundle export is experimental
184.77 s
gammaloop-nextest-docs> = hint: its behaviour may change at any time
184.77 s
gammaloop-nextest-docs> = hint: do not rely on this feature for production use cases
184.77 s
gammaloop-nextest-docs>
184.77 s
gammaloop-nextest-docs>
184.77 s
gammaloop-nextest-docs> thread 'tests::portal_focuses_on_projects_and_keeps_dedicated_routes' (363) panicked at crates/alphal00p-docs-builder/src/lib.rs:11904:9:
184.77 s
gammaloop-nextest-docs> assertion `left == right` failed
184.77 s
gammaloop-nextest-docs> left: 8
184.77 s
gammaloop-nextest-docs> right: 7
184.77 s
gammaloop-nextest-docs> stack backtrace:
184.77 s
gammaloop-nextest-docs> 0: __rustc::rust_begin_unwind
184.77 s
gammaloop-nextest-docs> 1: core::panicking::panic_fmt
184.77 s
gammaloop-nextest-docs> 2: core::panicking::assert_failed_inner
184.77 s
gammaloop-nextest-docs> 3: core::panicking::assert_failed::<usize, usize>
184.77 s
gammaloop-nextest-docs> 4: alphal00p_docs_builder::tests::portal_focuses_on_projects_and_keeps_dedicated_routes
184.77 s
gammaloop-nextest-docs> 5: <alphal00p_docs_builder::tests::portal_focuses_on_projects_and_keeps_dedicated_routes::{closure#0} as core::ops::function::FnOnce<()>>::call_once
184.77 s
gammaloop-nextest-docs> note: Some details are omitted, run with `RUST_BACKTRACE=full` for a verbose backtrace.
184.77 s
gammaloop-nextest-docs>
184.78 s
gammaloop-nextest-docs> error : test run failed
184.84 s
gammaloop-nextest-docs>
184.84 s
gammaloop-nextest-docs> ========== nextest test summary ==========
184.84 s
gammaloop-nextest-docs> report: target/nextest/ci_gammaloop/junit.xml
184.84 s
gammaloop-nextest-docs> tests: 119, failures: 1, errors: 0
184.84 s
gammaloop-nextest-docs>
184.84 s
gammaloop-nextest-docs> 1. alphal00p-docs-builder::tests::portal_focuses_on_projects_and_keeps_dedicated_routes
184.84 s
gammaloop-nextest-docs> failure: test failure with exit code 101
184.84 s
gammaloop-nextest-docs> thread 'tests::portal_focuses_on_projects_and_keeps_dedicated_routes' (363) panicked at crates/alphal00p-docs-builder/src/lib.rs:11904:9:
184.84 s
gammaloop-nextest-docs> assertion `left == right` failed
184.84 s
gammaloop-nextest-docs> left: 8
184.84 s
gammaloop-nextest-docs> right: 7
184.84 s
gammaloop-nextest-docs> stack backtrace:
184.84 s
gammaloop-nextest-docs> 0: __rustc::rust_begin_unwind
184.84 s
gammaloop-nextest-docs> 1: core::panicking::panic_fmt
184.84 s
gammaloop-nextest-docs> 2: core::panicking::assert_failed_inner
184.84 s
gammaloop-nextest-docs> 3: core::panicking::assert_failed::<usize, usize>
184.84 s
gammaloop-nextest-docs> 4: alphal00p_docs_builder::tests::portal_focuses_on_projects_and_keeps_dedicated_routes
184.84 s
gammaloop-nextest-docs> 5: <alphal00p_docs_builder::tests::portal_focuses_on_projects_and_keeps_dedicated_routes::{closure#0} as core::ops::function::FnOnce<()>>::call_once
184.84 s
gammaloop-nextest-docs> note: Some details are omitted, run with `RUST_BACKTRACE=full` for a verbose backtrace.
184.84 s
gammaloop-nextest-docs> system-out
184.84 s
gammaloop-nextest-docs> running 1 test
184.84 s
gammaloop-nextest-docs> test tests::portal_focuses_on_projects_and_keeps_dedicated_routes ... FAILED
184.84 s
gammaloop-nextest-docs>
184.84 s
gammaloop-nextest-docs> failures:
184.84 s
gammaloop-nextest-docs>
184.84 s
gammaloop-nextest-docs> failures:
184.84 s
gammaloop-nextest-docs> tests::portal_focuses_on_projects_and_keeps_dedicated_routes
184.84 s
gammaloop-nextest-docs>
184.84 s
gammaloop-nextest-docs> test result: FAILED. 0 passed; 1 failed; 0 ignored; 0 measured; 118 filtered out; finished in 0.10s
184.84 s
gammaloop-nextest-docs> system-err
184.84 s
gammaloop-nextest-docs> warning: bundle export is experimental
184.84 s
gammaloop-nextest-docs> = hint: its behaviour may change at any time
184.84 s
gammaloop-nextest-docs> = hint: do not rely on this feature for production use cases
184.84 s
gammaloop-nextest-docs>
184.84 s
gammaloop-nextest-docs>
184.84 s
gammaloop-nextest-docs> thread 'tests::portal_focuses_on_projects_and_keeps_dedicated_routes' (363) panicked at crates/alphal00p-docs-builder/src/lib.rs:11904:9:
184.84 s
gammaloop-nextest-docs> assertion `left == right` failed
184.84 s
gammaloop-nextest-docs> left: 8
184.84 s
gammaloop-nextest-docs> right: 7
184.84 s
gammaloop-nextest-docs> stack backtrace:
184.84 s
gammaloop-nextest-docs> 0: __rustc::rust_begin_unwind
184.84 s
gammaloop-nextest-docs> 1: core::panicking::panic_fmt
184.84 s
gammaloop-nextest-docs> 2: core::panicking::assert_failed_inner
184.84 s
gammaloop-nextest-docs> 3: core::panicking::assert_failed::<usize, usize>
184.84 s
gammaloop-nextest-docs> 4: alphal00p_docs_builder::tests::portal_focuses_on_projects_and_keeps_dedicated_routes
184.84 s
gammaloop-nextest-docs> 5: <alphal00p_docs_builder::tests::portal_focuses_on_projects_and_keeps_dedicated_routes::{closure#0} as core::ops::function::FnOnce<()>>::call_once
184.84 s
gammaloop-nextest-docs> note: Some details are omitted, run with `RUST_BACKTRACE=full` for a verbose backtrace.
184.84 s
gammaloop-nextest-docs> =========================================
184.87 s
gammaloop-nextest-docs> Extracting 2 binaries to /build/source/target/nix-ci-tmp/nextest-archive-4ulnS3
184.93 s
gammaloop-nextest-docs> Extracted 5 files to /build/source/target/nix-ci-tmp/nextest-archive-4ulnS3 in 0.06s
184.95 s
gammaloop-nextest-docs> ------------
184.95 s
gammaloop-nextest-docs> Nextest run ID c67ca83d-156d-4898-a6ae-a4649cf817b6 with nextest profile: ci_gammaloop
184.95 s
gammaloop-nextest-docs> Starting 21 tests across 2 binaries
185.00 s
gammaloop-nextest-docs> ------------
185.00 s
gammaloop-nextest-docs> Summary [ 0.047s] 21 tests run: 21 passed , 0 skipped
185.05 s
gammaloop-nextest-docs>
185.05 s
gammaloop-nextest-docs> ========== nextest test summary ==========
185.05 s
gammaloop-nextest-docs> report: target/nextest/ci_gammaloop/junit.xml
185.05 s
gammaloop-nextest-docs> tests: 21, failures: 0, errors: 0
185.05 s
gammaloop-nextest-docs> No failing testcases found.
185.05 s
gammaloop-nextest-docs> =========================================
185.07 s
gammaloop-nextest-docs> Extracting 3 binaries (including 2 non-test binaries), 1 build script output directory, and 2 linked paths to /build/source/target/nix-ci-tmp/nextest-archive-eKYNWW
185.39 s
gammaloop-nextest-docs> Extracted 22 files to /build/source/target/nix-ci-tmp/nextest-archive-eKYNWW in 0.32s
185.41 s
gammaloop-nextest-docs> ------------
185.41 s
gammaloop-nextest-docs> Nextest run ID c0c47009-47d2-4524-a232-bf5835545d30 with nextest profile: ci_gammaloop
185.41 s
gammaloop-nextest-docs> Starting 89 tests across 1 binary
185.53 s
gammaloop-nextest-docs> ------------
185.53 s
gammaloop-nextest-docs> Summary [ 0.122s] 89 tests run: 89 passed , 0 skipped
185.64 s
gammaloop-nextest-docs>
185.64 s
gammaloop-nextest-docs> ========== nextest test summary ==========
185.64 s
gammaloop-nextest-docs> report: target/nextest/ci_gammaloop/junit.xml
185.64 s
gammaloop-nextest-docs> tests: 89, failures: 0, errors: 0
185.64 s
gammaloop-nextest-docs> No failing testcases found.
185.64 s
gammaloop-nextest-docs> =========================================
185.66 s
gammaloop-nextest-docs> Extracting 2 binaries to /build/source/target/nix-ci-tmp/nextest-archive-hxvmpZ
185.73 s
gammaloop-nextest-docs> Extracted 5 files to /build/source/target/nix-ci-tmp/nextest-archive-hxvmpZ in 0.07s
185.77 s
gammaloop-nextest-docs> ------------
185.77 s
gammaloop-nextest-docs> Nextest run ID af30faf4-dd56-48a8-af79-d88b66a0eb8e with nextest profile: ci_gammaloop
185.77 s
gammaloop-nextest-docs> Starting 10 tests across 2 binaries
202.97 s
gammaloop-nextest-docs> ------------
202.97 s
gammaloop-nextest-docs> Summary [ 17.194s] 10 tests run: 10 passed , 0 skipped
203.03 s
gammaloop-nextest-docs>
203.03 s
gammaloop-nextest-docs> ========== nextest test summary ==========
203.03 s
gammaloop-nextest-docs> report: target/nextest/ci_gammaloop/junit.xml
203.03 s
gammaloop-nextest-docs> tests: 10, failures: 0, errors: 0
203.03 s
gammaloop-nextest-docs> No failing testcases found.
203.03 s
gammaloop-nextest-docs> =========================================
203.06 s
gammaloop-nextest-docs> Extracting 1 binary to /build/source/target/nix-ci-tmp/nextest-archive-4lropg
203.12 s
gammaloop-nextest-docs> Extracted 4 files to /build/source/target/nix-ci-tmp/nextest-archive-4lropg in 0.07s
203.16 s
gammaloop-nextest-docs> ------------
203.16 s
gammaloop-nextest-docs> Nextest run ID 0bc9c971-a257-4817-b3de-3c9830bab642 with nextest profile: ci_gammaloop
203.16 s
gammaloop-nextest-docs> Starting 0 tests across 1 binary
203.16 s
gammaloop-nextest-docs> ------------
203.16 s
gammaloop-nextest-docs> Summary [ 0.000s] 0 tests run: 0 passed , 0 skipped
203.26 s
gammaloop-nextest-docs>
203.26 s
gammaloop-nextest-docs> ========== nextest test summary ==========
203.26 s
gammaloop-nextest-docs> report: target/nextest/ci_gammaloop/junit.xml
203.26 s
gammaloop-nextest-docs> tests: 0, failures: 0, errors: 0
203.26 s
gammaloop-nextest-docs> No failing testcases found.
203.26 s
gammaloop-nextest-docs> =========================================
203.32 s
gammaloop-nextest-docs> Extracting 1 binary to /build/source/target/nix-ci-tmp/nextest-archive-sVSyZ3
203.41 s
gammaloop-nextest-docs> Extracted 4 files to /build/source/target/nix-ci-tmp/nextest-archive-sVSyZ3 in 0.09s
203.44 s
gammaloop-nextest-docs> ------------
203.44 s
gammaloop-nextest-docs> Nextest run ID 5f6e8145-fdea-483f-a8ea-f840d2547b31 with nextest profile: ci_gammaloop
203.44 s
gammaloop-nextest-docs> Starting 4 tests across 1 binary
203.48 s
gammaloop-nextest-docs> ------------
203.48 s
gammaloop-nextest-docs> Summary [ 0.041s] 4 tests run: 4 passed , 0 skipped
203.59 s
gammaloop-nextest-docs>
203.59 s
gammaloop-nextest-docs> ========== nextest test summary ==========
203.59 s
gammaloop-nextest-docs> report: target/nextest/ci_gammaloop/junit.xml
203.59 s
gammaloop-nextest-docs> tests: 4, failures: 0, errors: 0
203.59 s
gammaloop-nextest-docs> No failing testcases found.
203.59 s
gammaloop-nextest-docs> =========================================
203.84 s
error: Cannot build '/nix/store/0wdyv3cn1lz9layxva3h3gba546k18rq-gammaloop-nextest-docs.drv '.
203.84 s
Reason: builder failed with exit code 100 .
203.84 s
Output paths:
203.84 s
/nix/store/bdfxaldm7wl6aqjjrjsqv176215jxv0p-gammaloop-nextest-docs
203.84 s
Last 185 log lines:
203.84 s
> Extracting 2 binaries to /build/source/target/nix-ci-tmp/nextest-archive-bgwoh8
203.84 s
> Extracted 5 files to /build/source/target/nix-ci-tmp/nextest-archive-bgwoh8 in 0.06s
203.84 s
> ------------
203.84 s
> Nextest run ID 6a31f422-c056-42f0-8a05-f79c3317ba13 with nextest profile: ci_gammaloop
203.84 s
> Starting 119 tests across 2 binaries
203.84 s
> FAIL [ 0.110s] ( 64/119) alphal00p-docs-builder tests :: portal_focuses_on_projects_and_keeps_dedicated_routes
203.84 s
> stdout ---
203.84 s
>
203.84 s
> running 1 test
203.84 s
> test tests::portal_focuses_on_projects_and_keeps_dedicated_routes ... FAILED
203.84 s
>
203.84 s
> failures:
203.84 s
>
203.84 s
> failures:
203.84 s
> tests::portal_focuses_on_projects_and_keeps_dedicated_routes
203.84 s
>
203.84 s
> test result: FAILED. 0 passed; 1 failed; 0 ignored; 0 measured; 118 filtered out; finished in 0.10s
203.84 s
>
203.84 s
> stderr ---
203.84 s
> warning: bundle export is experimental
203.84 s
> = hint: its behaviour may change at any time
203.84 s
> = hint: do not rely on this feature for production use cases
203.84 s
>
203.84 s
>
203.84 s
> thread 'tests::portal_focuses_on_projects_and_keeps_dedicated_routes' (363) panicked at crates/alphal00p-docs-builder/src/lib.rs:11904:9:
203.84 s
> assertion `left == right` failed
203.84 s
> left: 8
203.84 s
> right: 7
203.84 s
> stack backtrace:
203.84 s
> 0: __rustc::rust_begin_unwind
203.84 s
> 1: core::panicking::panic_fmt
203.84 s
> 2: core::panicking::assert_failed_inner
203.84 s
> 3: core::panicking::assert_failed::<usize, usize>
203.84 s
> 4: alphal00p_docs_builder::tests::portal_focuses_on_projects_and_keeps_dedicated_routes
203.84 s
> 5: <alphal00p_docs_builder::tests::portal_focuses_on_projects_and_keeps_dedicated_routes::{closure#0} as core::ops::function::FnOnce<()>>::call_once
203.84 s
> note: Some details are omitted, run with `RUST_BACKTRACE=full` for a verbose backtrace.
203.84 s
>
203.84 s
> ------------
203.84 s
> Summary [ 25.342s] 119 tests run: 118 passed , 1 failed , 0 skipped
203.84 s
> FAIL [ 0.110s] ( 64/119) alphal00p-docs-builder tests :: portal_focuses_on_projects_and_keeps_dedicated_routes
203.84 s
> stdout ---
203.84 s
>
203.84 s
> running 1 test
203.84 s
> test tests::portal_focuses_on_projects_and_keeps_dedicated_routes ... FAILED
203.84 s
>
203.84 s
> failures:
203.84 s
>
203.84 s
> failures:
203.84 s
> tests::portal_focuses_on_projects_and_keeps_dedicated_routes
203.84 s
>
203.84 s
> test result: FAILED. 0 passed; 1 failed; 0 ignored; 0 measured; 118 filtered out; finished in 0.10s
203.84 s
>
203.84 s
> stderr ---
203.84 s
> warning: bundle export is experimental
203.84 s
> = hint: its behaviour may change at any time
203.84 s
> = hint: do not rely on this feature for production use cases
203.84 s
>
203.84 s
>
203.84 s
> thread 'tests::portal_focuses_on_projects_and_keeps_dedicated_routes' (363) panicked at crates/alphal00p-docs-builder/src/lib.rs:11904:9:
203.84 s
> assertion `left == right` failed
203.84 s
> left: 8
203.84 s
> right: 7
203.84 s
> stack backtrace:
203.84 s
> 0: __rustc::rust_begin_unwind
203.84 s
> 1: core::panicking::panic_fmt
203.84 s
> 2: core::panicking::assert_failed_inner
203.84 s
> 3: core::panicking::assert_failed::<usize, usize>
203.84 s
> 4: alphal00p_docs_builder::tests::portal_focuses_on_projects_and_keeps_dedicated_routes
203.84 s
> 5: <alphal00p_docs_builder::tests::portal_focuses_on_projects_and_keeps_dedicated_routes::{closure#0} as core::ops::function::FnOnce<()>>::call_once
203.84 s
> note: Some details are omitted, run with `RUST_BACKTRACE=full` for a verbose backtrace.
203.84 s
>
203.84 s
> error : test run failed
203.84 s
>
203.84 s
> ========== nextest test summary ==========
203.84 s
> report: target/nextest/ci_gammaloop/junit.xml
203.84 s
> tests: 119, failures: 1, errors: 0
203.84 s
>
203.84 s
> 1. alphal00p-docs-builder::tests::portal_focuses_on_projects_and_keeps_dedicated_routes
203.84 s
> failure: test failure with exit code 101
203.84 s
> thread 'tests::portal_focuses_on_projects_and_keeps_dedicated_routes' (363) panicked at crates/alphal00p-docs-builder/src/lib.rs:11904:9:
203.84 s
> assertion `left == right` failed
203.84 s
> left: 8
203.84 s
> right: 7
203.84 s
> stack backtrace:
203.84 s
> 0: __rustc::rust_begin_unwind
203.84 s
> 1: core::panicking::panic_fmt
203.84 s
> 2: core::panicking::assert_failed_inner
203.84 s
> 3: core::panicking::assert_failed::<usize, usize>
203.84 s
> 4: alphal00p_docs_builder::tests::portal_focuses_on_projects_and_keeps_dedicated_routes
203.84 s
> 5: <alphal00p_docs_builder::tests::portal_focuses_on_projects_and_keeps_dedicated_routes::{closure#0} as core::ops::function::FnOnce<()>>::call_once
203.84 s
> note: Some details are omitted, run with `RUST_BACKTRACE=full` for a verbose backtrace.
203.84 s
> system-out
203.84 s
> running 1 test
203.84 s
> test tests::portal_focuses_on_projects_and_keeps_dedicated_routes ... FAILED
203.84 s
>
203.84 s
> failures:
203.84 s
>
203.84 s
> failures:
203.84 s
> tests::portal_focuses_on_projects_and_keeps_dedicated_routes
203.84 s
>
203.84 s
> test result: FAILED. 0 passed; 1 failed; 0 ignored; 0 measured; 118 filtered out; finished in 0.10s
203.84 s
> system-err
203.84 s
> warning: bundle export is experimental
203.84 s
> = hint: its behaviour may change at any time
203.84 s
> = hint: do not rely on this feature for production use cases
203.84 s
>
203.84 s
>
203.84 s
> thread 'tests::portal_focuses_on_projects_and_keeps_dedicated_routes' (363) panicked at crates/alphal00p-docs-builder/src/lib.rs:11904:9:
203.84 s
> assertion `left == right` failed
203.84 s
> left: 8
203.84 s
> right: 7
203.84 s
> stack backtrace:
203.84 s
> 0: __rustc::rust_begin_unwind
203.84 s
> 1: core::panicking::panic_fmt
203.84 s
> 2: core::panicking::assert_failed_inner
203.84 s
> 3: core::panicking::assert_failed::<usize, usize>
203.84 s
> 4: alphal00p_docs_builder::tests::portal_focuses_on_projects_and_keeps_dedicated_routes
203.84 s
> 5: <alphal00p_docs_builder::tests::portal_focuses_on_projects_and_keeps_dedicated_routes::{closure#0} as core::ops::function::FnOnce<()>>::call_once
203.84 s
> note: Some details are omitted, run with `RUST_BACKTRACE=full` for a verbose backtrace.
203.84 s
> =========================================
203.84 s
> Extracting 2 binaries to /build/source/target/nix-ci-tmp/nextest-archive-4ulnS3
203.84 s
> Extracted 5 files to /build/source/target/nix-ci-tmp/nextest-archive-4ulnS3 in 0.06s
203.84 s
> ------------
203.84 s
> Nextest run ID c67ca83d-156d-4898-a6ae-a4649cf817b6 with nextest profile: ci_gammaloop
203.84 s
> Starting 21 tests across 2 binaries
203.84 s
> ------------
203.84 s
> Summary [ 0.047s] 21 tests run: 21 passed , 0 skipped
203.84 s
>
203.84 s
> ========== nextest test summary ==========
203.84 s
> report: target/nextest/ci_gammaloop/junit.xml
203.84 s
> tests: 21, failures: 0, errors: 0
203.84 s
> No failing testcases found.
203.84 s
> =========================================
203.84 s
> Extracting 3 binaries (including 2 non-test binaries), 1 build script output directory, and 2 linked paths to /build/source/target/nix-ci-tmp/nextest-archive-eKYNWW
203.84 s
> Extracted 22 files to /build/source/target/nix-ci-tmp/nextest-archive-eKYNWW in 0.32s
203.84 s
> ------------
203.84 s
> Nextest run ID c0c47009-47d2-4524-a232-bf5835545d30 with nextest profile: ci_gammaloop
203.84 s
> Starting 89 tests across 1 binary
203.84 s
> ------------
203.84 s
> Summary [ 0.122s] 89 tests run: 89 passed , 0 skipped
203.84 s
>
203.84 s
> ========== nextest test summary ==========
203.84 s
> report: target/nextest/ci_gammaloop/junit.xml
203.84 s
> tests: 89, failures: 0, errors: 0
203.84 s
> No failing testcases found.
203.84 s
> =========================================
203.84 s
> Extracting 2 binaries to /build/source/target/nix-ci-tmp/nextest-archive-hxvmpZ
203.84 s
> Extracted 5 files to /build/source/target/nix-ci-tmp/nextest-archive-hxvmpZ in 0.07s
203.84 s
> ------------
203.84 s
> Nextest run ID af30faf4-dd56-48a8-af79-d88b66a0eb8e with nextest profile: ci_gammaloop
203.84 s
> Starting 10 tests across 2 binaries
203.84 s
> ------------
203.84 s
> Summary [ 17.194s] 10 tests run: 10 passed , 0 skipped
203.84 s
>
203.84 s
> ========== nextest test summary ==========
203.84 s
> report: target/nextest/ci_gammaloop/junit.xml
203.84 s
> tests: 10, failures: 0, errors: 0
203.84 s
> No failing testcases found.
203.84 s
> =========================================
203.84 s
> Extracting 1 binary to /build/source/target/nix-ci-tmp/nextest-archive-4lropg
203.84 s
> Extracted 4 files to /build/source/target/nix-ci-tmp/nextest-archive-4lropg in 0.07s
203.84 s
> ------------
203.84 s
> Nextest run ID 0bc9c971-a257-4817-b3de-3c9830bab642 with nextest profile: ci_gammaloop
203.84 s
> Starting 0 tests across 1 binary
203.84 s
> ------------
203.84 s
> Summary [ 0.000s] 0 tests run: 0 passed , 0 skipped
203.84 s
>
203.84 s
> ========== nextest test summary ==========
203.84 s
> report: target/nextest/ci_gammaloop/junit.xml
203.84 s
> tests: 0, failures: 0, errors: 0
203.84 s
> No failing testcases found.
203.84 s
> =========================================
203.84 s
> Extracting 1 binary to /build/source/target/nix-ci-tmp/nextest-archive-sVSyZ3
203.84 s
> Extracted 4 files to /build/source/target/nix-ci-tmp/nextest-archive-sVSyZ3 in 0.09s
203.84 s
> ------------
203.84 s
> Nextest run ID 5f6e8145-fdea-483f-a8ea-f840d2547b31 with nextest profile: ci_gammaloop
203.84 s
> Starting 4 tests across 1 binary
203.84 s
> ------------
203.84 s
> Summary [ 0.041s] 4 tests run: 4 passed , 0 skipped
203.84 s
>
203.84 s
> ========== nextest test summary ==========
203.84 s
> report: target/nextest/ci_gammaloop/junit.xml
203.84 s
> tests: 4, failures: 0, errors: 0
203.84 s
> No failing testcases found.
203.84 s
> =========================================
203.84 s
For full logs, run:
203.84 s
nix log /nix/store/0wdyv3cn1lz9layxva3h3gba546k18rq-gammaloop-nextest-docs.drv
204.02 s
[4 built (1 failed ), 65 Run failed.