0.00 s
$ /nix/store/9ypz3flqsrl5xl495mm8h645gadjsxi1-coreutils-9.11/bin/timeout --kill-after=15s 7200s /nix/store/23zk8sgzamrbmj1fday15szf7f2279s8-nix-2.34.7/bin/nix --extra-experimental-features nix-command --extra-experimental-features flakes flake clone git+https://github.com/alphal00p/gammaloop --dest /tmp/nix-ci-worker/stable-pwd/repo/
0.10 s
Cloning into '/tmp/nix-ci-worker/stable-pwd/repo'...
2.02 s
remote: Enumerating objects: 77432
remote: Enumerating objects: 87950, done.
2.68 s
remote: Counting objects: 0% (1/10518)
remote: Counting objects: 1% (106/10518)
remote: Counting objects: 2% (211/10518)
remote: Counting objects: 3% (316/10518)
remote: Counting objects: 4% (421/10518)
remote: Counting objects: 5% (526/10518)
remote: Counting objects: 6% (632/10518)
remote: Counting objects: 7% (737/10518)
remote: Counting objects: 8% (842/10518)
remote: Counting objects: 9% (947/10518)
remote: Counting objects: 10% (1052/10518)
remote: Counting objects: 11% (1157/10518)
remote: Counting objects: 12% (1263/10518)
remote: Counting objects: 13% (1368/10518)
remote: Counting objects: 14% (1473/10518)
remote: Counting objects: 15% (1578/10518)
remote: Counting objects: 16% (1683/10518)
remote: Counting objects: 17% (1789/10518)
remote: Counting objects: 18% (1894/10518)
remote: Counting objects: 19% (1999/10518)
remote: Counting objects: 20% (2104/10518)
remote: Counting objects: 21% (2209/10518)
remote: Counting objects: 22% (2314/10518)
remote: Counting objects: 23% (2420/10518)
remote: Counting objects: 24% (2525/10518)
remote: Counting objects: 25% (2630/10518)
remote: Counting objects: 26% (2735/10518)
remote: Counting objects: 27% (2840/10518)
remote: Counting objects: 28% (2946/10518)
remote: Counting objects: 29% (3051/10518)
remote: Counting objects: 30% (3156/10518)
remote: Counting objects: 31% (3261/10518)
remote: Counting objects: 32% (3366/10518)
remote: Counting objects: 33% (3471/10518)
remote: Counting objects: 34% (3577/10518)
remote: Counting objects: 35% (3682/10518)
remote: Counting objects: 36% (3787/10518)
remote: Counting objects: 37% (3892/10518)
remote: Counting objects: 38% (3997/10518)
remote: Counting objects: 39% (4103/10518)
remote: Counting objects: 40% (4208/10518)
remote: Counting objects: 41% (4313/10518)
remote: Counting objects: 42% (4418/10518)
remote: Counting objects: 43% (4523/10518)
remote: Counting objects: 44% (4628/10518)
remote: Counting objects: 45% (4734/10518)
remote: Counting objects: 46% (4839/10518)
remote: Counting objects: 47% (4944/10518)
remote: Counting objects: 48% (5049/10518)
remote: Counting objects: 49% (5154/10518)
remote: Counting objects: 50% (5259/10518)
remote: Counting objects: 51% (5365/10518)
remote: Counting objects: 52% (5470/10518)
remote: Counting objects: 53% (5575/10518)
remote: Counting objects: 54% (5680/10518)
remote: Counting objects: 55% (5785/10518)
remote: Counting objects: 56% (5891/10518)
remote: Counting objects: 57% (5996/10518)
remote: Counting objects: 58% (6101/10518)
remote: Counting objects: 59% (6206/10518)
remote: Counting objects: 60% (6311/10518)
remote: Counting objects: 61% (6416/10518)
remote: Counting objects: 62% (6522/10518)
remote: Counting objects: 63% (6627/10518)
remote: Counting objects: 64% (6732/10518)
remote: Counting objects: 65% (6837/10518)
remote: Counting objects: 66% (6942/10518)
remote: Counting objects: 67% (7048/10518)
remote: Counting objects: 68% (7153/10518)
remote: Counting objects: 69% (7258/10518)
remote: Counting objects: 70% (7363/10518)
remote: Counting objects: 71% (7468/10518)
remote: Counting objects: 72% (7573/10518)
remote: Counting objects: 73% (7679/10518)
remote: Counting objects: 74% (7784/10518)
remote: Counting objects: 75% (7889/10518)
remote: Counting objects: 76% (7994/10518)
remote: Counting objects: 77% (8099/10518)
remote: Counting objects: 78% (8205/10518)
remote: Counting objects: 79% (8310/10518)
remote: Counting objects: 80% (8415/10518)
remote: Counting objects: 81% (8520/10518)
remote: Counting objects: 82% (8625/10518)
remote: Counting objects: 83% (8730/10518)
remote: Counting objects: 84% (8836/10518)
remote: Counting objects: 85% (8941/10518)
remote: Counting objects: 86% (9046/10518)
remote: Counting objects: 87% (9151/10518)
remote: Counting objects: 88% (9256/10518)
remote: Counting objects: 89% (9362/10518)
remote: Counting objects: 90% (9467/10518)
remote: Counting objects: 91% (9572/10518)
remote: Counting objects: 92% (9677/10518)
remote: Counting objects: 93% (9782/10518)
remote: Counting objects: 94% (9887/10518)
remote: Counting objects: 95% (9993/10518)
remote: Counting objects: 96% (10098/10518)
remote: Counting objects: 97% (10203/10518)
remote: Counting objects: 98% (10308/10518)
remote: Counting objects: 99% (10413/10518)
remote: Counting objects: 100% (10518/10518)
remote: Counting objects: 100% (10518/10518), done.
5.35 s
remote: Compressing objects: 0% (1/2956)
remote: Compressing objects: 1% (30/2956)
remote: Compressing objects: 2% (60/2956)
remote: Compressing objects: 3% (89/2956)
remote: Compressing objects: 4% (119/2956)
remote: Compressing objects: 5% (148/2956)
remote: Compressing objects: 6% (178/2956)
remote: Compressing objects: 7% (207/2956)
remote: Compressing objects: 8% (237/2956)
remote: Compressing objects: 9% (267/2956)
remote: Compressing objects: 10% (296/2956)
remote: Compressing objects: 11% (326/2956)
remote: Compressing objects: 12% (355/2956)
remote: Compressing objects: 13% (385/2956)
remote: Compressing objects: 14% (414/2956)
remote: Compressing objects: 14% (432/2956)
remote: Compressing objects: 15% (444/2956)
remote: Compressing objects: 16% (473/2956)
remote: Compressing objects: 17% (503/2956)
remote: Compressing objects: 18% (533/2956)
remote: Compressing objects: 19% (562/2956)
remote: Compressing objects: 20% (592/2956)
remote: Compressing objects: 21% (621/2956)
remote: Compressing objects: 22% (651/2956)
remote: Compressing objects: 23% (680/2956)
remote: Compressing objects: 24% (710/2956)
remote: Compressing objects: 25% (739/2956)
remote: Compressing objects: 25% (757/2956)
remote: Compressing objects: 26% (769/2956)
remote: Compressing objects: 27% (799/2956)
remote: Compressing objects: 28% (828/2956)
remote: Compressing objects: 29% (858/2956)
remote: Compressing objects: 30% (887/2956)
remote: Compressing objects: 31% (917/2956)
remote: Compressing objects: 32% (946/2956)
remote: Compressing objects: 33% (976/2956)
remote: Compressing objects: 34% (1006/2956)
remote: Compressing objects: 35% (1035/2956)
remote: Compressing objects: 36% (1065/2956)
remote: Compressing objects: 36% (1081/2956)
remote: Compressing objects: 37% (1094/2956)
remote: Compressing objects: 38% (1124/2956)
remote: Compressing objects: 39% (1153/2956)
remote: Compressing objects: 40% (1183/2956)
remote: Compressing objects: 41% (1212/2956)
remote: Compressing objects: 42% (1242/2956)
remote: Compressing objects: 43% (1272/2956)
remote: Compressing objects: 44% (1301/2956)
remote: Compressing objects: 45% (1331/2956)
remote: Compressing objects: 46% (1360/2956)
remote: Compressing objects: 47% (1390/2956)
remote: Compressing objects: 48% (1419/2956)
remote: Compressing objects: 49% (1449/2956)
remote: Compressing objects: 50% (1478/2956)
remote: Compressing objects: 51% (1508/2956)
remote: Compressing objects: 52% (1538/2956)
remote: Compressing objects: 53% (1567/2956)
remote: Compressing objects: 54% (1597/2956)
remote: Compressing objects: 55% (1626/2956)
remote: Compressing objects: 56% (1656/2956)
remote: Compressing objects: 57% (1685/2956)
remote: Compressing objects: 58% (1715/2956)
remote: Compressing objects: 59% (1745/2956)
remote: Compressing objects: 60% (1774/2956)
remote: Compressing objects: 61% (1804/2956)
remote: Compressing objects: 62% (1833/2956)
remote: Compressing objects: 63% (1863/2956)
remote: Compressing objects: 64% (1892/2956)
remote: Compressing objects: 65% (1922/2956)
remote: Compressing objects: 66% (1951/2956)
remote: Compressing objects: 67% (1981/2956)
remote: Compressing objects: 68% (2011/2956)
remote: Compressing objects: 69% (2040/2956)
remote: Compressing objects: 70% (2070/2956)
remote: Compressing objects: 71% (2099/2956)
remote: Compressing objects: 72% (2129/2956)
remote: Compressing objects: 73% (2158/2956)
remote: Compressing objects: 74% (2188/2956)
remote: Compressing objects: 75% (2217/2956)
remote: Compressing objects: 76% (2247/2956)
remote: Compressing objects: 77% (2277/2956)
remote: Compressing objects: 78% (2306/2956)
remote: Compressing objects: 79% (2336/2956)
remote: Compressing objects: 80% (2365/2956)
remote: Compressing objects: 81% (2395/2956)
remote: Compressing objects: 82% (2424/2956)
remote: Compressing objects: 83% (2454/2956)
remote: Compressing objects: 84% (2484/2956)
remote: Compressing objects: 85% (2513/2956)
remote: Compressing objects: 86% (2543/2956)
remote: Compressing objects: 87% (2572/2956)
remote: Compressing objects: 88% (2602/2956)
remote: Compressing objects: 89% (2631/2956)
remote: Compressing objects: 90% (2661/2956)
remote: Compressing objects: 91% (2690/2956)
remote: Compressing objects: 92% (2720/2956)
remote: Compressing objects: 93% (2750/2956)
remote: Compressing objects: 94% (2779/2956)
remote: Compressing objects: 95% (2809/2956)
remote: Compressing objects: 96% (2838/2956)
remote: Compressing objects: 97% (2868/2956)
remote: Compressing objects: 98% (2897/2956)
remote: Compressing objects: 99% (2927/2956)
remote: Compressing objects: 100% (2956/2956)
remote: Compressing objects: 100% (2956/2956), done.
11.14 s
Receiving objects: 0% (1/87950)
Receiving objects: 1% (880/87950)
Receiving objects: 2% (1759/87950)
Receiving objects: 3% (2639/87950)
Receiving objects: 4% (3518/87950)
Receiving objects: 5% (4398/87950)
Receiving objects: 6% (5277/87950)
Receiving objects: 7% (6157/87950)
Receiving objects: 8% (7036/87950)
Receiving objects: 9% (7916/87950), 13.48 MiB | 27.00 MiB/s
Receiving objects: 10% (8795/87950), 13.48 MiB | 27.00 MiB/s
Receiving objects: 11% (9675/87950), 13.48 MiB | 27.00 MiB/s
Receiving objects: 12% (10554/87950), 13.48 MiB | 27.00 MiB/s
Receiving objects: 13% (11434/87950), 13.48 MiB | 27.00 MiB/s
Receiving objects: 14% (12313/87950), 13.48 MiB | 27.00 MiB/s
Receiving objects: 15% (13193/87950), 13.48 MiB | 27.00 MiB/s
Receiving objects: 16% (14072/87950), 13.48 MiB | 27.00 MiB/s
Receiving objects: 17% (14952/87950), 13.48 MiB | 27.00 MiB/s
Receiving objects: 18% (15831/87950), 13.48 MiB | 27.00 MiB/s
Receiving objects: 19% (16711/87950), 13.48 MiB | 27.00 MiB/s
Receiving objects: 20% (17590/87950), 13.48 MiB | 27.00 MiB/s
Receiving objects: 21% (18470/87950), 13.48 MiB | 27.00 MiB/s
Receiving objects: 22% (19349/87950), 13.48 MiB | 27.00 MiB/s
Receiving objects: 23% (20229/87950), 13.48 MiB | 27.00 MiB/s
Receiving objects: 24% (21108/87950), 13.48 MiB | 27.00 MiB/s
Receiving objects: 25% (21988/87950), 13.48 MiB | 27.00 MiB/s
Receiving objects: 26% (22867/87950), 13.48 MiB | 27.00 MiB/s
Receiving objects: 27% (23747/87950), 13.48 MiB | 27.00 MiB/s
Receiving objects: 28% (24626/87950), 13.48 MiB | 27.00 MiB/s
Receiving objects: 29% (25506/87950), 13.48 MiB | 27.00 MiB/s
Receiving objects: 30% (26385/87950), 13.48 MiB | 27.00 MiB/s
Receiving objects: 31% (27265/87950), 13.48 MiB | 27.00 MiB/s
Receiving objects: 32% (28144/87950), 13.48 MiB | 27.00 MiB/s
Receiving objects: 33% (29024/87950), 13.48 MiB | 27.00 MiB/s
Receiving objects: 34% (29903/87950), 13.48 MiB | 27.00 MiB/s
Receiving objects: 35% (30783/87950), 13.48 MiB | 27.00 MiB/s
Receiving objects: 35% (31462/87950), 29.43 MiB | 29.17 MiB/s
Receiving objects: 36% (31662/87950), 29.43 MiB | 29.17 MiB/s
Receiving objects: 37% (32542/87950), 29.43 MiB | 29.17 MiB/s
Receiving objects: 38% (33421/87950), 29.43 MiB | 29.17 MiB/s
Receiving objects: 39% (34301/87950), 29.43 MiB | 29.17 MiB/s
Receiving objects: 40% (35180/87950), 29.43 MiB | 29.17 MiB/s
Receiving objects: 41% (36060/87950), 29.43 MiB | 29.17 MiB/s
Receiving objects: 42% (36939/87950), 29.43 MiB | 29.17 MiB/s
Receiving objects: 43% (37819/87950), 29.43 MiB | 29.17 MiB/s
Receiving objects: 44% (38698/87950), 29.43 MiB | 29.17 MiB/s
Receiving objects: 45% (39578/87950), 29.43 MiB | 29.17 MiB/s
Receiving objects: 46% (40457/87950), 46.58 MiB | 30.87 MiB/s
Receiving objects: 47% (41337/87950), 46.58 MiB | 30.87 MiB/s
Receiving objects: 48% (42216/87950), 46.58 MiB | 30.87 MiB/s
Receiving objects: 49% (43096/87950), 46.58 MiB | 30.87 MiB/s
Receiving objects: 50% (43975/87950), 46.58 MiB | 30.87 MiB/s
Receiving objects: 51% (44855/87950), 46.58 MiB | 30.87 MiB/s
Receiving objects: 52% (45734/87950), 46.58 MiB | 30.87 MiB/s
Receiving objects: 53% (46614/87950), 46.58 MiB | 30.87 MiB/s
Receiving objects: 54% (47493/87950), 46.58 MiB | 30.87 MiB/s
Receiving objects: 55% (48373/87950), 46.58 MiB | 30.87 MiB/s
Receiving objects: 55% (48423/87950), 60.98 MiB | 30.15 MiB/s
Receiving objects: 56% (49252/87950), 60.98 MiB | 30.15 MiB/s
Receiving objects: 57% (50132/87950), 60.98 MiB | 30.15 MiB/s
Receiving objects: 58% (51011/87950), 60.98 MiB | 30.15 MiB/s
Receiving objects: 59% (51891/87950), 60.98 MiB | 30.15 MiB/s
Receiving objects: 60% (52770/87950), 60.98 MiB | 30.15 MiB/s
Receiving objects: 61% (53650/87950), 60.98 MiB | 30.15 MiB/s
Receiving objects: 62% (54529/87950), 77.49 MiB | 30.72 MiB/s
Receiving objects: 63% (55409/87950), 77.49 MiB | 30.72 MiB/s
Receiving objects: 64% (56288/87950), 77.49 MiB | 30.72 MiB/s
Receiving objects: 65% (57168/87950), 77.49 MiB | 30.72 MiB/s
Receiving objects: 65% (57370/87950), 91.31 MiB | 30.05 MiB/s
Receiving objects: 66% (58047/87950), 91.31 MiB | 30.05 MiB/s
Receiving objects: 67% (58927/87950), 91.31 MiB | 30.05 MiB/s
Receiving objects: 68% (59806/87950), 109.20 MiB | 30.86 MiB/s
Receiving objects: 69% (60686/87950), 109.20 MiB | 30.86 MiB/s
Receiving objects: 70% (61565/87950), 109.20 MiB | 30.86 MiB/s
Receiving objects: 71% (62445/87950), 109.20 MiB | 30.86 MiB/s
Receiving objects: 72% (63324/87950), 109.20 MiB | 30.86 MiB/s
Receiving objects: 72% (64181/87950), 124.84 MiB | 30.82 MiB/s
Receiving objects: 73% (64204/87950), 124.84 MiB | 30.82 MiB/s
Receiving objects: 74% (65083/87950), 124.84 MiB | 30.82 MiB/s
Receiving objects: 75% (65963/87950), 124.84 MiB | 30.82 MiB/s
Receiving objects: 76% (66842/87950), 124.84 MiB | 30.82 MiB/s
Receiving objects: 77% (67722/87950), 124.84 MiB | 30.82 MiB/s
Receiving objects: 78% (68601/87950), 124.84 MiB | 30.82 MiB/s
Receiving objects: 79% (69481/87950), 124.84 MiB | 30.82 MiB/s
Receiving objects: 80% (70360/87950), 124.84 MiB | 30.82 MiB/s
Receiving objects: 81% (71240/87950), 124.84 MiB | 30.82 MiB/s
Receiving objects: 82% (72119/87950), 124.84 MiB | 30.82 MiB/s
Receiving objects: 83% (72999/87950), 124.84 MiB | 30.82 MiB/s
Receiving objects: 84% (73878/87950), 124.84 MiB | 30.82 MiB/s
Receiving objects: 85% (74758/87950), 141.94 MiB | 31.19 MiB/s
Receiving objects: 86% (75637/87950), 141.94 MiB | 31.19 MiB/s
Receiving objects: 87% (76517/87950), 141.94 MiB | 31.19 MiB/s
Receiving objects: 88% (77396/87950), 141.94 MiB | 31.19 MiB/s
Receiving objects: 89% (78276/87950), 141.94 MiB | 31.19 MiB/s
Receiving objects: 90% (79155/87950), 141.94 MiB | 31.19 MiB/s
Receiving objects: 91% (80035/87950), 141.94 MiB | 31.19 MiB/s
Receiving objects: 92% (80914/87950), 141.94 MiB | 31.19 MiB/s
Receiving objects: 93% (81794/87950), 141.94 MiB | 31.19 MiB/s
Receiving objects: 94% (82673/87950), 141.94 MiB | 31.19 MiB/s
Receiving objects: 95% (83553/87950), 141.94 MiB | 31.19 MiB/s
Receiving objects: 96% (84432/87950), 141.94 MiB | 31.19 MiB/s
Receiving objects: 97% (85312/87950), 141.94 MiB | 31.19 MiB/s
Receiving objects: 97% (85883/87950), 141.94 MiB | 31.19 MiB/s
Receiving objects: 98% (86191/87950), 156.16 MiB | 31.23 MiB/s
Receiving objects: 99% (87071/87950), 170.40 MiB | 30.92 MiB/s
remote: Total 87950 (delta 8582), reused 8331 (delta 7536), pack-reused 77432 (from 3)
11.15 s
Receiving objects: 100% (87950/87950), 170.40 MiB | 30.92 MiB/s
Receiving objects: 100% (87950/87950), 176.58 MiB | 30.48 MiB/s, done.
12.23 s
Resolving deltas: 0% (0/59477)
Resolving deltas: 1% (595/59477)
Resolving deltas: 2% (1190/59477)
Resolving deltas: 3% (1786/59477)
Resolving deltas: 4% (2380/59477)
Resolving deltas: 5% (2974/59477)
Resolving deltas: 6% (3570/59477)
Resolving deltas: 7% (4164/59477)
Resolving deltas: 8% (4761/59477)
Resolving deltas: 9% (5353/59477)
Resolving deltas: 10% (5948/59477)
Resolving deltas: 11% (6543/59477)
Resolving deltas: 12% (7138/59477)
Resolving deltas: 13% (7733/59477)
Resolving deltas: 14% (8328/59477)
Resolving deltas: 15% (8922/59477)
Resolving deltas: 16% (9517/59477)
Resolving deltas: 17% (10112/59477)
Resolving deltas: 18% (10706/59477)
Resolving deltas: 19% (11301/59477)
Resolving deltas: 20% (11897/59477)
Resolving deltas: 21% (12492/59477)
Resolving deltas: 22% (13085/59477)
Resolving deltas: 23% (13680/59477)
Resolving deltas: 24% (14276/59477)
Resolving deltas: 25% (14870/59477)
Resolving deltas: 26% (15465/59477)
Resolving deltas: 27% (16059/59477)
Resolving deltas: 28% (16654/59477)
Resolving deltas: 29% (17249/59477)
Resolving deltas: 30% (17844/59477)
Resolving deltas: 31% (18439/59477)
Resolving deltas: 32% (19033/59477)
Resolving deltas: 33% (19628/59477)
Resolving deltas: 34% (20223/59477)
Resolving deltas: 35% (20817/59477)
Resolving deltas: 36% (21412/59477)
Resolving deltas: 37% (22007/59477)
Resolving deltas: 38% (22602/59477)
Resolving deltas: 39% (23197/59477)
Resolving deltas: 40% (23791/59477)
Resolving deltas: 41% (24386/59477)
Resolving deltas: 42% (24981/59477)
Resolving deltas: 43% (25576/59477)
Resolving deltas: 44% (26172/59477)
Resolving deltas: 45% (26766/59477)
Resolving deltas: 46% (27361/59477)
Resolving deltas: 47% (27956/59477)
Resolving deltas: 48% (28549/59477)
Resolving deltas: 49% (29145/59477)
Resolving deltas: 50% (29740/59477)
Resolving deltas: 51% (30334/59477)
Resolving deltas: 52% (30929/59477)
Resolving deltas: 53% (31523/59477)
Resolving deltas: 54% (32119/59477)
Resolving deltas: 55% (32713/59477)
Resolving deltas: 56% (33308/59477)
Resolving deltas: 57% (33902/59477)
Resolving deltas: 58% (34501/59477)
Resolving deltas: 59% (35093/59477)
Resolving deltas: 60% (35687/59477)
Resolving deltas: 61% (36281/59477)
Resolving deltas: 62% (36876/59477)
Resolving deltas: 63% (37471/59477)
Resolving deltas: 64% (38066/59477)
Resolving deltas: 65% (38661/59477)
Resolving deltas: 66% (39255/59477)
Resolving deltas: 67% (39851/59477)
Resolving deltas: 68% (40445/59477)
Resolving deltas: 69% (41042/59477)
Resolving deltas: 70% (41635/59477)
Resolving deltas: 71% (42232/59477)
Resolving deltas: 72% (42824/59477)
Resolving deltas: 73% (43419/59477)
Resolving deltas: 74% (44013/59477)
Resolving deltas: 75% (44608/59477)
Resolving deltas: 76% (45203/59477)
Resolving deltas: 77% (45798/59477)
Resolving deltas: 78% (46393/59477)
Resolving deltas: 79% (46987/59477)
Resolving deltas: 80% (47582/59477)
Resolving deltas: 81% (48177/59477)
Resolving deltas: 82% (48772/59477)
Resolving deltas: 83% (49366/59477)
Resolving deltas: 84% (49961/59477)
Resolving deltas: 85% (50557/59477)
Resolving deltas: 86% (51151/59477)
Resolving deltas: 87% (51745/59477)
Resolving deltas: 88% (52340/59477)
Resolving deltas: 89% (52935/59477)
Resolving deltas: 90% (53530/59477)
Resolving deltas: 91% (54125/59477)
Resolving deltas: 92% (54719/59477)
Resolving deltas: 92% (55022/59477)
Resolving deltas: 93% (55315/59477)
Resolving deltas: 94% (55911/59477)
Resolving deltas: 95% (56504/59477)
Resolving deltas: 96% (57098/59477)
Resolving deltas: 97% (57693/59477)
Resolving deltas: 98% (58288/59477)
Resolving deltas: 99% (58883/59477)
Resolving deltas: 100% (59477/59477)
Resolving deltas: 100% (59477/59477), done.
12.67 s
Fetching commit 891dec7c25b5d9026c099da021ec7ae3b757dee9 for docs ...
12.67 s
$ /nix/store/bcnisk3ydfgv26v2gw3zlky24g00yww2-git-2.54.0/bin/git fetch origin 891dec7c25b5d9026c099da021ec7ae3b757dee9
13.20 s
From https://github.com/alphal00p/gammaloop
13.20 s
* branch 891dec7c25b5d9026c099da021ec7ae3b757dee9 -> FETCH_HEAD
13.21 s
$ /nix/store/9ypz3flqsrl5xl495mm8h645gadjsxi1-coreutils-9.11/bin/timeout --kill-after=15s 7200s /nix/store/bcnisk3ydfgv26v2gw3zlky24g00yww2-git-2.54.0/bin/git -c advice.detachedHead=false checkout 891dec7c25b5d9026c099da021ec7ae3b757dee9
13.43 s
HEAD is now at 891dec7c2 change photos
13.44 s
$ /nix/store/9ypz3flqsrl5xl495mm8h645gadjsxi1-coreutils-9.11/bin/timeout --kill-after=15s 7200s /nix/store/23zk8sgzamrbmj1fday15szf7f2279s8-nix-2.34.7/bin/nix --extra-experimental-features nix-command --extra-experimental-features flakes --log-format internal-json run .#packages.x86_64-linux.nix-ci-check-gammaloop-nextest-docs --print-build-logs
18.43 s
18.46 s
Downloading cached gammaloop-nextest-binaries-docs-alphal00p-docs-builder from https://cache.nix-ci.com
18.46 s
Downloading cached gammaloop-nextest-binaries-docs-alphal00p-docs-catalogs from https://cache.nix-ci.com
18.46 s
Downloading cached gammaloop-nextest-binaries-docs-alphal00p-docs-examples from https://cache.nix-ci.com
18.46 s
Downloading cached gammaloop-nextest-binaries-docs-alphal00p-docs-macros from https://cache.nix-ci.com
18.46 s
Downloading cached gammaloop-nextest-binaries-docs-alphal00p-docs-python-exporter from https://cache.nix-ci.com
18.46 s
Downloading cached gammaloop-nextest-binaries-docs-alphal00p-docs-schema from https://cache.nix-ci.com
18.46 s
Downloading cached nix from https://cache.nix-ci.com
18.50 s
Downloaded cached nix (8848 B) in 40ms
18.50 s
Progress: 0 of 1 built, 1 of 9 downloaded from cache (6 downloading)
18.55 s
Downloaded cached gammaloop-nextest-binaries-docs-alphal00p-docs-python-exporter (2.2 MiB) in 84ms
18.55 s
Progress: 0 of 1 built, 2 of 9 downloaded from cache (5 downloading)
18.56 s
Downloaded cached gammaloop-nextest-binaries-docs-alphal00p-docs-schema (2.4 MiB) in 95ms
18.56 s
Progress: 0 of 1 built, 3 of 9 downloaded from cache (4 downloading)
18.56 s
Downloaded cached gammaloop-nextest-binaries-docs-alphal00p-docs-catalogs (2.8 MiB) in 100ms
18.56 s
Progress: 0 of 1 built, 4 of 9 downloaded from cache (3 downloading)
18.58 s
Downloaded cached gammaloop-nextest-binaries-docs-alphal00p-docs-macros (3.7 MiB) in 121ms
18.58 s
Progress: 0 of 1 built, 5 of 9 downloaded from cache (2 downloading)
18.59 s
Downloaded cached gammaloop-nextest-binaries-docs-alphal00p-docs-builder (4.9 MiB) in 132ms
18.60 s
Progress: 0 of 1 built, 6 of 9 downloaded from cache (1 downloading)
18.76 s
Downloaded cached gammaloop-nextest-binaries-docs-alphal00p-docs-examples (34.2 MiB) in 301ms
18.76 s
Progress: 0 of 1 built, 7 of 9 downloaded from cache
18.76 s
Downloading cached gammaloop-nextest-binaries-docs from https://cache.nix-ci.com
18.77 s
Downloaded cached gammaloop-nextest-binaries-docs (2472 B) in 5ms
18.77 s
Progress: 0 of 1 built, 8 of 9 downloaded from cache
18.77 s
Downloading cached nix-ci-check-gammaloop-nextest-docs from https://cache.nix-ci.com
18.77 s
Downloaded cached nix-ci-check-gammaloop-nextest-docs (1016 B) in 4ms
18.77 s
Progress: 0 of 1 built, 9 of 9 downloaded from cache
25.61 s
evaluating derivation 'g
copying '/nix/store/bgss
evaluating derivation 'g
copying '/nix/store/bgss
evaluating derivation 'g
copying '/nix/store/bgss
evaluating derivation 'g
copying '/nix/store/bgss
evaluating derivation 'g
copying '/nix/store/bgss
evaluating derivation 'g
copying '/nix/store/bgss
evaluating derivation 'g
querying gammaloop-nexte
[4.4 KiB DL] querying py
[0 /9 built, 5 /1 /7 copied
[0 /5 built, 2 /5 /7 copiedtypst> structuredAttrs is enabled
25.69 s
[1 /0 /5 built, 2 /5 /7 copitypst> created 4 symlinks in user environment
25.79 s
typst (post)> Uploading to the NixCI cache: /nix/store/8vl9izw3pfyd994wimgwsxh9rz3062ml-typst-0.15.0-env
25.83 s
[1 /0 /4 built, 1 /6 /7 copitypst (post)> warning: 'warn-short-path-literals' is deprecated, use 'lint-short-path-literals = ignore' instead
25.86 s
typst (post)> copying 0 paths...
25.92 s
typst (post)> warning: 'warn-short-path-literals' is deprecated, use 'lint-short-path-literals = ignore' instead
25.99 s
typst (post)> copying 0 paths...
26.04 s
[1 /1 /3 built, 7 copied (python3> structuredAttrs is enabled
26.11 s
python3> created 227 symlinks in user environment
27.02 s
python3 (post)> Uploading to the NixCI cache: /nix/store/v67wpyflacy0i2gvzasrxvw2gkz4mr12-python3-3.13.15-env
27.05 s
python3 (post)> warning: 'warn-short-path-literals' is deprecated, use 'lint-short-path-literals = ignore' instead
27.19 s
python3 (post)> copying 0 paths...
27.24 s
python3 (post)> warning: 'warn-short-path-literals' is deprecated, use 'lint-short-path-literals = ignore' instead
27.69 s
python3 (post)> copying 26 paths...
27.69 s
python3 (post)> copying path '/nix/store/7201l112c22r7wb4y3nqqmjlz1z2kmpx-python3.13-syrupy-5.5.3.drv' to 'https://cache.nix-ci.com'...
27.69 s
python3 (post)> copying path '/nix/store/4kjqmzvzpgajp75b996rfr7x33sb6dpq-python3.13-attrs-26.1.0.drv' to 'https://cache.nix-ci.com'...
27.69 s
python3 (post)> copying path '/nix/store/0wr8fylakjf64q1kfrygdsbncqdizqw2-python3.13-hatch-vcs-0.5.0.drv' to 'https://cache.nix-ci.com'...
27.69 s
python3 (post)> copying path '/nix/store/hwbkzqqccrb3d6z7vii101r6ja10ihg0-python3.13-importlib-metadata-9.0.0.drv' to 'https://cache.nix-ci.com'...
27.69 s
python3 (post)> copying path '/nix/store/9z6zy8c0pqb554yj8l8qw9k6kcsj2v5i-python3.13-cmake-4.3.4.drv' to 'https://cache.nix-ci.com'...
27.69 s
python3 (post)> copying path '/nix/store/3v58ap6imamhb8i75lyxhnvcwqb63lgv-python3.13-pyproject-metadata-0.12.1.drv' to 'https://cache.nix-ci.com'...
27.69 s
python3 (post)> copying path '/nix/store/90fm6l23d7cg2gfkm664cgy9205i92bx-python3.13-cffi-2.1.0.drv' to 'https://cache.nix-ci.com'...
27.69 s
python3 (post)> copying path '/nix/store/axfkw3qwbwpjpq6p7amlmargzw51bivn-python3.13-greenlet-3.5.3.drv' to 'https://cache.nix-ci.com'...
27.69 s
python3 (post)> copying path '/nix/store/16c2dv94pb1glnydda0c344b7b25f32m-python3.13-typing-extensions-4.16.0.drv' to 'https://cache.nix-ci.com'...
27.69 s
python3 (post)> copying path '/nix/store/gsdqsf2d8kkvfcn5hbmnbd4navy1wz6j-python3.13-pytest-asyncio-1.4.0.drv' to 'https://cache.nix-ci.com'...
27.69 s
python3 (post)> copying path '/nix/store/pgpp91cxgrv8n9hf42aswas4dhmdx9wv-meson-1.10.2.drv' to 'https://cache.nix-ci.com'...
27.69 s
python3 (post)> copying path '/nix/store/kv6jmp7jrr56m4cx4drkx0sdnh7g1spc-python3.13-sortedcontainers-2.4.0.drv' to 'https://cache.nix-ci.com'...
27.69 s
python3 (post)> copying path '/nix/store/krm18ilzkd2ax5b3fdngbdzdh2i8j5qk-python3.13-zope-event-6.2.drv' to 'https://cache.nix-ci.com'...
27.69 s
python3 (post)> copying path '/nix/store/rrjbmd88py5s6019bn48i312g2rhcm4q-python3.13-pexpect-4.9.0.drv' to 'https://cache.nix-ci.com'...
27.69 s
python3 (post)> copying path '/nix/store/m4hzzz77nrv1h0qgisqmra1h3mz08sij-python3.13-zope-interface-8.2.drv' to 'https://cache.nix-ci.com'...
27.69 s
python3 (post)> copying path '/nix/store/ndxzn6i1z20b5hi77q4wdd4ngy1f802z-python3.13-cython-3.2.5.drv' to 'https://cache.nix-ci.com'...
27.90 s
python3 (post)> copying path '/nix/store/4kkl6f3mal7lmza0vsfpc6fsw90kcibz-python3.13-pytest-mock-3.15.1.drv' to 'https://cache.nix-ci.com'...
27.95 s
python3 (post)> copying path '/nix/store/qfw64c64v4lay32b0avshd59lqrdn5i8-python3.13-gevent-26.5.0.drv' to 'https://cache.nix-ci.com'...
27.95 s
python3 (post)> copying path '/nix/store/dz18w3d794v2n04x493msrsivnj3zbk7-python3.13-pytest-timeout-2.4.0.drv' to 'https://cache.nix-ci.com'...
28.04 s
python3 (post)> copying path '/nix/store/c40w09w08xwi78r0drf7ga5jdwdw4zy7-python3.13-meson-python-0.20.0.drv' to 'https://cache.nix-ci.com'...
28.08 s
python3 (post)> copying path '/nix/store/837r0v3628kv3h43jyhrm1jyyfmm7bk3-python3.13-filelock-3.29.7.drv' to 'https://cache.nix-ci.com'...
28.09 s
python3 (post)> copying path '/nix/store/as2r08gkcfp81hba3565icbzn59cs8m9-python3.13-execnet-2.1.2.drv' to 'https://cache.nix-ci.com'...
28.21 s
python3 (post)> copying path '/nix/store/iwifcw0034z3lqnfmiqhb7nmd9ai1r2w-python3.13-pytest-xdist-3.8.0.drv' to 'https://cache.nix-ci.com'...
28.34 s
python3 (post)> copying path '/nix/store/lqvv4by2xnr0v1b6dhw4sd5asnizl209-python3.13-hypothesis-6.156.1.drv' to 'https://cache.nix-ci.com'...
28.47 s
python3 (post)> copying path '/nix/store/73gc1q7ml5xz4bbwps0bqcggc1x9i3yl-python3.13-numpy-2.5.1.drv' to 'https://cache.nix-ci.com'...
28.59 s
python3 (post)> copying path '/nix/store/4s28bf6d866bmm7j8wby33073hph0r4k-python3-3.13.15-env.drv' to 'https://cache.nix-ci.com'...
29.20 s
[2 /4 built, 7 copied (81
[1 /2 /3 built, 7 copied (gammaloop-nextest-docs> Extracting 2 binaries to /build/source
29.25 s
gammaloop-nextest-docs> Extracted 5 files to /build/source in 0.06s
29.26 s
gammaloop-nextest-docs> ------------
29.26 s
gammaloop-nextest-docs> Nextest run ID 01a960f8-c7fc-4ace-810e-78eaa52465c1 with nextest profile: ci_gammaloop
29.26 s
gammaloop-nextest-docs> Starting 129 tests across 2 binaries
60.19 s
gammaloop-nextest-docs> FAIL [ 30.926s] (128/129) alphal00p-docs-builder provenance_tests :: each_build_captures_one_revision_before_rendering
60.19 s
gammaloop-nextest-docs> stdout ---
60.19 s
gammaloop-nextest-docs>
60.19 s
gammaloop-nextest-docs> running 1 test
60.19 s
gammaloop-nextest-docs>
60.19 s
gammaloop-nextest-docs> running 1 test
60.19 s
gammaloop-nextest-docs> test provenance_tests::each_build_captures_one_revision_before_rendering ... FAILED
60.19 s
gammaloop-nextest-docs>
60.19 s
gammaloop-nextest-docs> failures:
60.19 s
gammaloop-nextest-docs>
60.19 s
gammaloop-nextest-docs> failures:
60.19 s
gammaloop-nextest-docs> provenance_tests::each_build_captures_one_revision_before_rendering
60.19 s
gammaloop-nextest-docs>
60.19 s
gammaloop-nextest-docs> test result: FAILED. 0 passed; 1 failed; 0 ignored; 0 measured; 128 filtered out; finished in 30.86s
60.19 s
gammaloop-nextest-docs>
60.19 s
gammaloop-nextest-docs> test provenance_tests::each_build_captures_one_revision_before_rendering ... FAILED
60.19 s
gammaloop-nextest-docs>
60.19 s
gammaloop-nextest-docs> failures:
60.19 s
gammaloop-nextest-docs>
60.19 s
gammaloop-nextest-docs> failures:
60.19 s
gammaloop-nextest-docs> provenance_tests::each_build_captures_one_revision_before_rendering
60.19 s
gammaloop-nextest-docs>
60.19 s
gammaloop-nextest-docs> test result: FAILED. 0 passed; 1 failed; 0 ignored; 0 measured; 128 filtered out; finished in 30.92s
60.19 s
gammaloop-nextest-docs>
60.19 s
gammaloop-nextest-docs> stderr ---
60.19 s
gammaloop-nextest-docs> warning: bundle export is experimental
60.19 s
gammaloop-nextest-docs> = hint: its behaviour may change at any time
60.19 s
gammaloop-nextest-docs> = hint: do not rely on this feature for production use cases
60.19 s
gammaloop-nextest-docs>
60.19 s
gammaloop-nextest-docs> warning: unknown font family: roboto
60.19 s
gammaloop-nextest-docs> ┌─ crates/linnest/typst/docs/manual.typ:11:28
60.19 s
gammaloop-nextest-docs> │
60.19 s
gammaloop-nextest-docs> 11 │ #set text(size: 10pt, font: "Roboto")
60.19 s
gammaloop-nextest-docs> │ ^^^^^^^^
60.19 s
gammaloop-nextest-docs>
60.19 s
gammaloop-nextest-docs> warning: unknown font family: roboto
60.19 s
gammaloop-nextest-docs> ┌─ crates/linnest/typst/docs/manual.typ:14:29
60.19 s
gammaloop-nextest-docs> │
60.19 s
gammaloop-nextest-docs> 14 │ #set text(size: 3em, font: "Roboto")
60.19 s
gammaloop-nextest-docs> │ ^^^^^^^^
60.19 s
gammaloop-nextest-docs>
60.19 s
gammaloop-nextest-docs> warning: unknown font family: roboto
60.19 s
gammaloop-nextest-docs> ┌─ crates/linnest/typst/docs/manual.typ:16:31
60.19 s
gammaloop-nextest-docs> │
60.19 s
gammaloop-nextest-docs> 16 │ #set text(size: 0.3em, font: "Roboto")
60.19 s
gammaloop-nextest-docs> │ ^^^^^^^^
60.19 s
gammaloop-nextest-docs>
60.19 s
gammaloop-nextest-docs> warning: overline was ignored during MathML export
60.19 s
gammaloop-nextest-docs> ┌─ crates/linnest/typst/docs/manual.typ:949:55
60.19 s
gammaloop-nextest-docs> │
60.19 s
gammaloop-nextest-docs> 949 │ + sum_("dangling" e) c_("dangling-centroid") / (d(e, overline(v)) + epsilon)
60.19 s
gammaloop-nextest-docs> │ ^^^^^^^^^^^
60.19 s
gammaloop-nextest-docs>
60.19 s
gammaloop-nextest-docs> warning: overline was ignored during MathML export
60.19 s
gammaloop-nextest-docs> ┌─ crates/linnest/typst/docs/manual.typ:953:8
60.19 s
gammaloop-nextest-docs> │
60.19 s
gammaloop-nextest-docs> 953 │ Here $overline(v)$ is the mean node position. The centroid term pushes every
60.19 s
gammaloop-nextest-docs> │ ^^^^^^^^^^^
60.19 s
gammaloop-nextest-docs>
60.19 s
gammaloop-nextest-docs>
60.19 s
gammaloop-nextest-docs> thread 'provenance_tests::each_build_captures_one_revision_before_rendering' (243) panicked at crates/alphal00p-docs-builder/src/provenance_tests.rs:297:14:
60.19 s
gammaloop-nextest-docs> called `Result::unwrap()` on an `Err` value: generated site has broken links:
60.19 s
gammaloop-nextest-docs> products/linnet/latest/reference/interfaces/index.html -> https://github.com/alphal00p/gammaloop/blob/1111111111111111111111111111111111111111/crates/linnet-py/examples/physics_render_settings.py (missing repository source file crates/linnet-py/examples/physics_render_settings.py)
60.19 s
gammaloop-nextest-docs> products/linnet/latest/reference/interfaces/index.html -> https://github.com/alphal00p/gammaloop/blob/1111111111111111111111111111111111111111/crates/linnet-py/examples/layout_stream.py (missing repository source file crates/linnet-py/examples/layout_stream.py)
60.19 s
gammaloop-nextest-docs> products/linnet/latest/playground/index.html -> https://github.com/alphal00p/gammaloop/blob/1111111111111111111111111111111111111111/crates/linnet-py/examples/layout_stream.py (missing repository source file crates/linnet-py/examples/layout_stream.py)
60.19 s
gammaloop-nextest-docs> products/linnet/latest/guides/python-rendering/index.html -> https://github.com/alphal00p/gammaloop/blob/1111111111111111111111111111111111111111/crates/linnet-py/examples/rendering_api.py (missing repository source file crates/linnet-py/examples/rendering_api.py)
60.19 s
gammaloop-nextest-docs>
60.19 s
gammaloop-nextest-docs> Location:
60.19 s
gammaloop-nextest-docs> crates/alphal00p-docs-builder/src/lib.rs:4940:9
60.19 s
gammaloop-nextest-docs> stack backtrace:
60.19 s
gammaloop-nextest-docs> 0: __rustc::rust_begin_unwind
60.19 s
gammaloop-nextest-docs> 1: core::panicking::panic_fmt
60.19 s
gammaloop-nextest-docs> 2: core::result::unwrap_failed
60.19 s
gammaloop-nextest-docs> 3: alphal00p_docs_builder::provenance_tests::each_build_captures_one_revision_before_rendering
60.19 s
gammaloop-nextest-docs> 4: <alphal00p_docs_builder::provenance_tests::each_build_captures_one_revision_before_rendering::{closure#0} as core::ops::function::FnOnce<()>>::call_once
60.19 s
gammaloop-nextest-docs> note: Some details are omitted, run with `RUST_BACKTRACE=full` for a verbose backtrace.
60.19 s
gammaloop-nextest-docs>
60.19 s
gammaloop-nextest-docs> thread 'provenance_tests::each_build_captures_one_revision_before_rendering' (173) panicked at crates/alphal00p-docs-builder/src/provenance_tests.rs:274:9:
60.19 s
gammaloop-nextest-docs> assertion failed: command.status().unwrap().success()
60.19 s
gammaloop-nextest-docs> stack backtrace:
60.19 s
gammaloop-nextest-docs> 0: __rustc::rust_begin_unwind
60.19 s
gammaloop-nextest-docs> 1: core::panicking::panic_fmt
60.19 s
gammaloop-nextest-docs> 2: core::panicking::panic
60.19 s
gammaloop-nextest-docs> 3: alphal00p_docs_builder::provenance_tests::each_build_captures_one_revision_before_rendering
60.19 s
gammaloop-nextest-docs> 4: <alphal00p_docs_builder::provenance_tests::each_build_captures_one_revision_before_rendering::{closure#0} as core::ops::function::FnOnce<()>>::call_once
60.19 s
gammaloop-nextest-docs> note: Some details are omitted, run with `RUST_BACKTRACE=full` for a verbose backtrace.
60.19 s
gammaloop-nextest-docs>
66.39 s
gammaloop-nextest-docs> ------------
66.39 s
gammaloop-nextest-docs> Summary [ 37.129s] 129 tests run: 128 passed , 1 failed , 0 skipped
66.39 s
gammaloop-nextest-docs> FAIL [ 30.926s] (128/129) alphal00p-docs-builder provenance_tests :: each_build_captures_one_revision_before_rendering
66.39 s
gammaloop-nextest-docs> stdout ---
66.39 s
gammaloop-nextest-docs>
66.39 s
gammaloop-nextest-docs> running 1 test
66.39 s
gammaloop-nextest-docs>
66.39 s
gammaloop-nextest-docs> running 1 test
66.39 s
gammaloop-nextest-docs> test provenance_tests::each_build_captures_one_revision_before_rendering ... FAILED
66.39 s
gammaloop-nextest-docs>
66.39 s
gammaloop-nextest-docs> failures:
66.39 s
gammaloop-nextest-docs>
66.39 s
gammaloop-nextest-docs> failures:
66.39 s
gammaloop-nextest-docs> provenance_tests::each_build_captures_one_revision_before_rendering
66.39 s
gammaloop-nextest-docs>
66.39 s
gammaloop-nextest-docs> test result: FAILED. 0 passed; 1 failed; 0 ignored; 0 measured; 128 filtered out; finished in 30.86s
66.39 s
gammaloop-nextest-docs>
66.39 s
gammaloop-nextest-docs> test provenance_tests::each_build_captures_one_revision_before_rendering ... FAILED
66.39 s
gammaloop-nextest-docs>
66.39 s
gammaloop-nextest-docs> failures:
66.39 s
gammaloop-nextest-docs>
66.39 s
gammaloop-nextest-docs> failures:
66.39 s
gammaloop-nextest-docs> provenance_tests::each_build_captures_one_revision_before_rendering
66.39 s
gammaloop-nextest-docs>
66.39 s
gammaloop-nextest-docs> test result: FAILED. 0 passed; 1 failed; 0 ignored; 0 measured; 128 filtered out; finished in 30.92s
66.39 s
gammaloop-nextest-docs>
66.39 s
gammaloop-nextest-docs> stderr ---
66.39 s
gammaloop-nextest-docs> warning: bundle export is experimental
66.39 s
gammaloop-nextest-docs> = hint: its behaviour may change at any time
66.39 s
gammaloop-nextest-docs> = hint: do not rely on this feature for production use cases
66.39 s
gammaloop-nextest-docs>
66.39 s
gammaloop-nextest-docs> warning: unknown font family: roboto
66.39 s
gammaloop-nextest-docs> ┌─ crates/linnest/typst/docs/manual.typ:11:28
66.39 s
gammaloop-nextest-docs> │
66.39 s
gammaloop-nextest-docs> 11 │ #set text(size: 10pt, font: "Roboto")
66.39 s
gammaloop-nextest-docs> │ ^^^^^^^^
66.39 s
gammaloop-nextest-docs>
66.39 s
gammaloop-nextest-docs> warning: unknown font family: roboto
66.39 s
gammaloop-nextest-docs> ┌─ crates/linnest/typst/docs/manual.typ:14:29
66.39 s
gammaloop-nextest-docs> │
66.39 s
gammaloop-nextest-docs> 14 │ #set text(size: 3em, font: "Roboto")
66.39 s
gammaloop-nextest-docs> │ ^^^^^^^^
66.39 s
gammaloop-nextest-docs>
66.39 s
gammaloop-nextest-docs> warning: unknown font family: roboto
66.39 s
gammaloop-nextest-docs> ┌─ crates/linnest/typst/docs/manual.typ:16:31
66.39 s
gammaloop-nextest-docs> │
66.39 s
gammaloop-nextest-docs> 16 │ #set text(size: 0.3em, font: "Roboto")
66.39 s
gammaloop-nextest-docs> │ ^^^^^^^^
66.39 s
gammaloop-nextest-docs>
66.39 s
gammaloop-nextest-docs> warning: overline was ignored during MathML export
66.39 s
gammaloop-nextest-docs> ┌─ crates/linnest/typst/docs/manual.typ:949:55
66.39 s
gammaloop-nextest-docs> │
66.39 s
gammaloop-nextest-docs> 949 │ + sum_("dangling" e) c_("dangling-centroid") / (d(e, overline(v)) + epsilon)
66.39 s
gammaloop-nextest-docs> │ ^^^^^^^^^^^
66.39 s
gammaloop-nextest-docs>
66.39 s
gammaloop-nextest-docs> warning: overline was ignored during MathML export
66.39 s
gammaloop-nextest-docs> ┌─ crates/linnest/typst/docs/manual.typ:953:8
66.39 s
gammaloop-nextest-docs> │
66.39 s
gammaloop-nextest-docs> 953 │ Here $overline(v)$ is the mean node position. The centroid term pushes every
66.39 s
gammaloop-nextest-docs> │ ^^^^^^^^^^^
66.39 s
gammaloop-nextest-docs>
66.39 s
gammaloop-nextest-docs>
66.39 s
gammaloop-nextest-docs> thread 'provenance_tests::each_build_captures_one_revision_before_rendering' (243) panicked at crates/alphal00p-docs-builder/src/provenance_tests.rs:297:14:
66.39 s
gammaloop-nextest-docs> called `Result::unwrap()` on an `Err` value: generated site has broken links:
66.39 s
gammaloop-nextest-docs> products/linnet/latest/reference/interfaces/index.html -> https://github.com/alphal00p/gammaloop/blob/1111111111111111111111111111111111111111/crates/linnet-py/examples/physics_render_settings.py (missing repository source file crates/linnet-py/examples/physics_render_settings.py)
66.39 s
gammaloop-nextest-docs> products/linnet/latest/reference/interfaces/index.html -> https://github.com/alphal00p/gammaloop/blob/1111111111111111111111111111111111111111/crates/linnet-py/examples/layout_stream.py (missing repository source file crates/linnet-py/examples/layout_stream.py)
66.39 s
gammaloop-nextest-docs> products/linnet/latest/playground/index.html -> https://github.com/alphal00p/gammaloop/blob/1111111111111111111111111111111111111111/crates/linnet-py/examples/layout_stream.py (missing repository source file crates/linnet-py/examples/layout_stream.py)
66.39 s
gammaloop-nextest-docs> products/linnet/latest/guides/python-rendering/index.html -> https://github.com/alphal00p/gammaloop/blob/1111111111111111111111111111111111111111/crates/linnet-py/examples/rendering_api.py (missing repository source file crates/linnet-py/examples/rendering_api.py)
66.39 s
gammaloop-nextest-docs>
66.39 s
gammaloop-nextest-docs> Location:
66.39 s
gammaloop-nextest-docs> crates/alphal00p-docs-builder/src/lib.rs:4940:9
66.39 s
gammaloop-nextest-docs> stack backtrace:
66.39 s
gammaloop-nextest-docs> 0: __rustc::rust_begin_unwind
66.39 s
gammaloop-nextest-docs> 1: core::panicking::panic_fmt
66.39 s
gammaloop-nextest-docs> 2: core::result::unwrap_failed
66.39 s
gammaloop-nextest-docs> 3: alphal00p_docs_builder::provenance_tests::each_build_captures_one_revision_before_rendering
66.39 s
gammaloop-nextest-docs> 4: <alphal00p_docs_builder::provenance_tests::each_build_captures_one_revision_before_rendering::{closure#0} as core::ops::function::FnOnce<()>>::call_once
66.39 s
gammaloop-nextest-docs> note: Some details are omitted, run with `RUST_BACKTRACE=full` for a verbose backtrace.
66.39 s
gammaloop-nextest-docs>
66.39 s
gammaloop-nextest-docs> thread 'provenance_tests::each_build_captures_one_revision_before_rendering' (173) panicked at crates/alphal00p-docs-builder/src/provenance_tests.rs:274:9:
66.39 s
gammaloop-nextest-docs> assertion failed: command.status().unwrap().success()
66.39 s
gammaloop-nextest-docs> stack backtrace:
66.39 s
gammaloop-nextest-docs> 0: __rustc::rust_begin_unwind
66.39 s
gammaloop-nextest-docs> 1: core::panicking::panic_fmt
66.39 s
gammaloop-nextest-docs> 2: core::panicking::panic
66.39 s
gammaloop-nextest-docs> 3: alphal00p_docs_builder::provenance_tests::each_build_captures_one_revision_before_rendering
66.39 s
gammaloop-nextest-docs> 4: <alphal00p_docs_builder::provenance_tests::each_build_captures_one_revision_before_rendering::{closure#0} as core::ops::function::FnOnce<()>>::call_once
66.39 s
gammaloop-nextest-docs> note: Some details are omitted, run with `RUST_BACKTRACE=full` for a verbose backtrace.
66.39 s
gammaloop-nextest-docs>
66.40 s
gammaloop-nextest-docs> error : test run failed
66.45 s
gammaloop-nextest-docs>
66.45 s
gammaloop-nextest-docs> ========== nextest test summary ==========
66.45 s
gammaloop-nextest-docs> report: target/nextest/ci_gammaloop/junit.xml
66.45 s
gammaloop-nextest-docs> tests: 129, failures: 1, errors: 0
66.45 s
gammaloop-nextest-docs>
66.45 s
gammaloop-nextest-docs> 1. alphal00p-docs-builder::provenance_tests::each_build_captures_one_revision_before_rendering
66.45 s
gammaloop-nextest-docs> failure: test failure with exit code 101
66.45 s
gammaloop-nextest-docs> thread 'provenance_tests::each_build_captures_one_revision_before_rendering' (173) panicked at crates/alphal00p-docs-builder/src/provenance_tests.rs:274:9:
66.45 s
gammaloop-nextest-docs> assertion failed: command.status().unwrap().success()
66.45 s
gammaloop-nextest-docs> stack backtrace:
66.45 s
gammaloop-nextest-docs> 0: __rustc::rust_begin_unwind
66.45 s
gammaloop-nextest-docs> 1: core::panicking::panic_fmt
66.45 s
gammaloop-nextest-docs> 2: core::panicking::panic
66.45 s
gammaloop-nextest-docs> 3: alphal00p_docs_builder::provenance_tests::each_build_captures_one_revision_before_rendering
66.45 s
gammaloop-nextest-docs> 4: <alphal00p_docs_builder::provenance_tests::each_build_captures_one_revision_before_rendering::{closure#0} as core::ops::function::FnOnce<()>>::call_once
66.45 s
gammaloop-nextest-docs> note: Some details are omitted, run with `RUST_BACKTRACE=full` for a verbose backtrace.
66.45 s
gammaloop-nextest-docs> system-out
66.45 s
gammaloop-nextest-docs> running 1 test
66.45 s
gammaloop-nextest-docs>
66.45 s
gammaloop-nextest-docs> running 1 test
66.45 s
gammaloop-nextest-docs> test provenance_tests::each_build_captures_one_revision_before_rendering ... FAILED
66.45 s
gammaloop-nextest-docs>
66.45 s
gammaloop-nextest-docs> failures:
66.45 s
gammaloop-nextest-docs>
66.45 s
gammaloop-nextest-docs> failures:
66.45 s
gammaloop-nextest-docs> provenance_tests::each_build_captures_one_revision_before_rendering
66.45 s
gammaloop-nextest-docs>
66.45 s
gammaloop-nextest-docs> test result: FAILED. 0 passed; 1 failed; 0 ignored; 0 measured; 128 filtered out; finished in 30.86s
66.45 s
gammaloop-nextest-docs>
66.45 s
gammaloop-nextest-docs> test provenance_tests::each_build_captures_one_revision_before_rendering ... FAILED
66.45 s
gammaloop-nextest-docs>
66.45 s
gammaloop-nextest-docs> failures:
66.45 s
gammaloop-nextest-docs>
66.45 s
gammaloop-nextest-docs> failures:
66.45 s
gammaloop-nextest-docs> provenance_tests::each_build_captures_one_revision_before_rendering
66.45 s
gammaloop-nextest-docs>
66.45 s
gammaloop-nextest-docs> test result: FAILED. 0 passed; 1 failed; 0 ignored; 0 measured; 128 filtered out; finished in 30.92s
66.45 s
gammaloop-nextest-docs> system-err
66.45 s
gammaloop-nextest-docs> warning: bundle export is experimental
66.45 s
gammaloop-nextest-docs> = hint: its behaviour may change at any time
66.45 s
gammaloop-nextest-docs> = hint: do not rely on this feature for production use cases
66.45 s
gammaloop-nextest-docs>
66.45 s
gammaloop-nextest-docs> warning: unknown font family: roboto
66.45 s
gammaloop-nextest-docs> ┌─ crates/linnest/typst/docs/manual.typ:11:28
66.45 s
gammaloop-nextest-docs> │
66.45 s
gammaloop-nextest-docs> 11 │ #set text(size: 10pt, font: "Roboto")
66.45 s
gammaloop-nextest-docs> │ ^^^^^^^^
66.45 s
gammaloop-nextest-docs>
66.45 s
gammaloop-nextest-docs> warning: unknown font family: roboto
66.45 s
gammaloop-nextest-docs> ┌─ crates/linnest/typst/docs/manual.typ:14:29
66.45 s
gammaloop-nextest-docs> │
66.45 s
gammaloop-nextest-docs> 14 │ #set text(size: 3em, font: "Roboto")
66.45 s
gammaloop-nextest-docs> │ ^^^^^^^^
66.45 s
gammaloop-nextest-docs>
66.45 s
gammaloop-nextest-docs> warning: unknown font family: roboto
66.45 s
gammaloop-nextest-docs> ┌─ crates/linnest/typst/docs/manual.typ:16:31
66.45 s
gammaloop-nextest-docs> │
66.45 s
gammaloop-nextest-docs> 16 │ #set text(size: 0.3em, font: "Roboto")
66.45 s
gammaloop-nextest-docs> │ ^^^^^^^^
66.45 s
gammaloop-nextest-docs>
66.45 s
gammaloop-nextest-docs> warning: overline was ignored during MathML export
66.45 s
gammaloop-nextest-docs> ┌─ crates/linnest/typst/docs/manual.typ:949:55
66.45 s
gammaloop-nextest-docs> │
66.45 s
gammaloop-nextest-docs> 949 │ + sum_("dangling" e) c_("dangling-centroid") / (d(e, overline(v)) + epsilon)
66.45 s
gammaloop-nextest-docs> │ ^^^^^^^^^^^
66.45 s
gammaloop-nextest-docs>
66.45 s
gammaloop-nextest-docs> warning: overline was ignored during MathML export
66.45 s
gammaloop-nextest-docs> ┌─ crates/linnest/typst/docs/manual.typ:953:8
66.45 s
gammaloop-nextest-docs> │
66.45 s
gammaloop-nextest-docs> 953 │ Here $overline(v)$ is the mean node position. The centroid term pushes every
66.45 s
gammaloop-nextest-docs> │ ^^^^^^^^^^^
66.45 s
gammaloop-nextest-docs>
66.45 s
gammaloop-nextest-docs>
66.45 s
gammaloop-nextest-docs> thread 'provenance_tests::each_build_captures_one_revision_before_rendering' (243) panicked at crates/alphal00p-docs-builder/src/provenance_tests.rs:297:14:
66.45 s
gammaloop-nextest-docs> called `Result::unwrap()` on an `Err` value: generated site has broken links:
66.45 s
gammaloop-nextest-docs> products/linnet/latest/reference/interfaces/index.html -> https://github.com/alphal00p/gammaloop/blob/1111111111111111111111111111111111111111/crates/linnet-py/examples/physics_render_settings.py (missing repository source file crates/linnet-py/examples/physics_render_settings.py)
66.45 s
gammaloop-nextest-docs> products/linnet/latest/reference/interfaces/index.html -> https://github.com/alphal00p/gammaloop/blob/1111111111111111111111111111111111111111/crates/linnet-py/examples/layout_stream.py (missing repository source file crates/linnet-py/examples/layout_stream.py)
66.45 s
gammaloop-nextest-docs> products/linnet/latest/playground/index.html -> https://github.com/alphal00p/gammaloop/blob/1111111111111111111111111111111111111111/crates/linnet-py/examples/layout_stream.py (missing repository source file crates/linnet-py/examples/layout_stream.py)
66.45 s
gammaloop-nextest-docs> products/linnet/latest/guides/python-rendering/index.html -> https://github.com/alphal00p/gammaloop/blob/1111111111111111111111111111111111111111/crates/linnet-py/examples/rendering_api.py (missing repository source file crates/linnet-py/examples/rendering_api.py)
66.45 s
gammaloop-nextest-docs>
66.45 s
gammaloop-nextest-docs> Location:
66.45 s
gammaloop-nextest-docs> crates/alphal00p-docs-builder/src/lib.rs:4940:9
66.45 s
gammaloop-nextest-docs> stack backtrace:
66.45 s
gammaloop-nextest-docs> 0: __rustc::rust_begin_unwind
66.45 s
gammaloop-nextest-docs> 1: core::panicking::panic_fmt
66.45 s
gammaloop-nextest-docs> 2: core::result::unwrap_failed
66.45 s
gammaloop-nextest-docs> 3: alphal00p_docs_builder::provenance_tests::each_build_captures_one_revision_before_rendering
66.45 s
gammaloop-nextest-docs> 4: <alphal00p_docs_builder::provenance_tests::each_build_captures_one_revision_before_rendering::{closure#0} as core::ops::function::FnOnce<()>>::call_once
66.45 s
gammaloop-nextest-docs> note: Some details are omitted, run with `RUST_BACKTRACE=full` for a verbose backtrace.
66.45 s
gammaloop-nextest-docs>
66.45 s
gammaloop-nextest-docs> thread 'provenance_tests::each_build_captures_one_revision_before_rendering' (173) panicked at crates/alphal00p-docs-builder/src/provenance_tests.rs:274:9:
66.45 s
gammaloop-nextest-docs> assertion failed: command.status().unwrap().success()
66.45 s
gammaloop-nextest-docs> stack backtrace:
66.45 s
gammaloop-nextest-docs> 0: __rustc::rust_begin_unwind
66.45 s
gammaloop-nextest-docs> 1: core::panicking::panic_fmt
66.45 s
gammaloop-nextest-docs> 2: core::panicking::panic
66.45 s
gammaloop-nextest-docs> 3: alphal00p_docs_builder::provenance_tests::each_build_captures_one_revision_before_rendering
66.45 s
gammaloop-nextest-docs> 4: <alphal00p_docs_builder::provenance_tests::each_build_captures_one_revision_before_rendering::{closure#0} as core::ops::function::FnOnce<()>>::call_once
66.45 s
gammaloop-nextest-docs> note: Some details are omitted, run with `RUST_BACKTRACE=full` for a verbose backtrace.
66.45 s
gammaloop-nextest-docs> =========================================
66.46 s
gammaloop-nextest-docs> Extracting 2 binaries to /build/source
66.50 s
gammaloop-nextest-docs> Extracted 5 files to /build/source in 0.04s
66.51 s
gammaloop-nextest-docs> ------------
66.51 s
gammaloop-nextest-docs> Nextest run ID d9c6f16d-d29f-43f8-a63c-0cabcd717122 with nextest profile: ci_gammaloop
66.51 s
gammaloop-nextest-docs> Starting 22 tests across 2 binaries
66.53 s
gammaloop-nextest-docs> ------------
66.53 s
gammaloop-nextest-docs> Summary [ 0.018s] 22 tests run: 22 passed , 0 skipped
66.56 s
gammaloop-nextest-docs>
66.56 s
gammaloop-nextest-docs> ========== nextest test summary ==========
66.56 s
gammaloop-nextest-docs> report: target/nextest/ci_gammaloop/junit.xml
66.56 s
gammaloop-nextest-docs> tests: 22, failures: 0, errors: 0
66.56 s
gammaloop-nextest-docs> No failing testcases found.
66.56 s
gammaloop-nextest-docs> =========================================
66.57 s
gammaloop-nextest-docs> Extracting 3 binaries (including 2 non-test binaries), 1 build script output directory, and 2 linked paths to /build/source
66.83 s
gammaloop-nextest-docs> Extracted 22 files to /build/source in 0.26s
66.84 s
gammaloop-nextest-docs> ------------
66.84 s
gammaloop-nextest-docs> Nextest run ID 8d87a80d-03f5-4da0-b80d-3fd308049fde with nextest profile: ci_gammaloop
66.84 s
gammaloop-nextest-docs> Starting 89 tests across 1 binary
66.88 s
gammaloop-nextest-docs> ------------
66.88 s
gammaloop-nextest-docs> Summary [ 0.041s] 89 tests run: 89 passed , 0 skipped
66.92 s
gammaloop-nextest-docs>
66.92 s
gammaloop-nextest-docs> ========== nextest test summary ==========
66.92 s
gammaloop-nextest-docs> report: target/nextest/ci_gammaloop/junit.xml
66.92 s
gammaloop-nextest-docs> tests: 89, failures: 0, errors: 0
66.92 s
gammaloop-nextest-docs> No failing testcases found.
66.92 s
gammaloop-nextest-docs> =========================================
66.93 s
gammaloop-nextest-docs> Extracting 2 binaries to /build/source
66.98 s
gammaloop-nextest-docs> Extracted 5 files to /build/source in 0.04s
66.99 s
gammaloop-nextest-docs> ------------
66.99 s
gammaloop-nextest-docs> Nextest run ID 10c084cd-9cf9-4ea9-a75f-6428ebc01151 with nextest profile: ci_gammaloop
66.99 s
gammaloop-nextest-docs> Starting 10 tests across 2 binaries
80.31 s
gammaloop-nextest-docs> ------------
80.31 s
gammaloop-nextest-docs> Summary [ 13.317s] 10 tests run: 10 passed , 0 skipped
80.34 s
gammaloop-nextest-docs>
80.34 s
gammaloop-nextest-docs> ========== nextest test summary ==========
80.34 s
gammaloop-nextest-docs> report: target/nextest/ci_gammaloop/junit.xml
80.34 s
gammaloop-nextest-docs> tests: 10, failures: 0, errors: 0
80.34 s
gammaloop-nextest-docs> No failing testcases found.
80.34 s
gammaloop-nextest-docs> =========================================
80.35 s
gammaloop-nextest-docs> Extracting 1 binary to /build/source
80.39 s
gammaloop-nextest-docs> Extracted 4 files to /build/source in 0.04s
80.40 s
gammaloop-nextest-docs> ------------
80.40 s
gammaloop-nextest-docs> Nextest run ID 9f7549ec-e974-4fe4-adc3-30ab6c99f7f8 with nextest profile: ci_gammaloop
80.40 s
gammaloop-nextest-docs> Starting 0 tests across 1 binary
80.40 s
gammaloop-nextest-docs> ------------
80.40 s
gammaloop-nextest-docs> Summary [ 0.000s] 0 tests run: 0 passed , 0 skipped
80.43 s
gammaloop-nextest-docs>
80.43 s
gammaloop-nextest-docs> ========== nextest test summary ==========
80.43 s
gammaloop-nextest-docs> report: target/nextest/ci_gammaloop/junit.xml
80.43 s
gammaloop-nextest-docs> tests: 0, failures: 0, errors: 0
80.43 s
gammaloop-nextest-docs> No failing testcases found.
80.43 s
gammaloop-nextest-docs> =========================================
80.44 s
gammaloop-nextest-docs> Extracting 1 binary to /build/source
80.47 s
gammaloop-nextest-docs> Extracted 4 files to /build/source in 0.04s
80.48 s
gammaloop-nextest-docs> ------------
80.48 s
gammaloop-nextest-docs> Nextest run ID 2adec7da-6c02-4e1d-a09e-72c4e207d410 with nextest profile: ci_gammaloop
80.48 s
gammaloop-nextest-docs> Starting 5 tests across 1 binary
80.49 s
gammaloop-nextest-docs> ------------
80.49 s
gammaloop-nextest-docs> Summary [ 0.005s] 5 tests run: 5 passed , 0 skipped
80.51 s
gammaloop-nextest-docs>
80.51 s
gammaloop-nextest-docs> ========== nextest test summary ==========
80.51 s
gammaloop-nextest-docs> report: target/nextest/ci_gammaloop/junit.xml
80.51 s
gammaloop-nextest-docs> tests: 5, failures: 0, errors: 0
80.51 s
gammaloop-nextest-docs> No failing testcases found.
80.51 s
gammaloop-nextest-docs> =========================================
80.73 s
error: Cannot build '/nix/store/9rs74w2crrwhaq7f0dxdi11wd515i6dj-gammaloop-nextest-docs.drv '.
80.73 s
Reason: builder failed with exit code 100 .
80.73 s
Output paths:
80.73 s
/nix/store/1jyipvscqlj4v0h7qjznydlgdlc4bjy7-gammaloop-nextest-docs
80.73 s
Last 347 log lines:
80.73 s
> Extracting 2 binaries to /build/source
80.73 s
> Extracted 5 files to /build/source in 0.06s
80.73 s
> ------------
80.73 s
> Nextest run ID 01a960f8-c7fc-4ace-810e-78eaa52465c1 with nextest profile: ci_gammaloop
80.73 s
> Starting 129 tests across 2 binaries
80.73 s
> FAIL [ 30.926s] (128/129) alphal00p-docs-builder provenance_tests :: each_build_captures_one_revision_before_rendering
80.73 s
> stdout ---
80.73 s
>
80.73 s
> running 1 test
80.73 s
>
80.73 s
> running 1 test
80.73 s
> test provenance_tests::each_build_captures_one_revision_before_rendering ... FAILED
80.73 s
>
80.73 s
> failures:
80.73 s
>
80.73 s
> failures:
80.73 s
> provenance_tests::each_build_captures_one_revision_before_rendering
80.73 s
>
80.73 s
> test result: FAILED. 0 passed; 1 failed; 0 ignored; 0 measured; 128 filtered out; finished in 30.86s
80.73 s
>
80.73 s
> test provenance_tests::each_build_captures_one_revision_before_rendering ... FAILED
80.73 s
>
80.73 s
> failures:
80.73 s
>
80.73 s
> failures:
80.73 s
> provenance_tests::each_build_captures_one_revision_before_rendering
80.73 s
>
80.73 s
> test result: FAILED. 0 passed; 1 failed; 0 ignored; 0 measured; 128 filtered out; finished in 30.92s
80.73 s
>
80.73 s
> stderr ---
80.73 s
> warning: bundle export is experimental
80.73 s
> = hint: its behaviour may change at any time
80.73 s
> = hint: do not rely on this feature for production use cases
80.73 s
>
80.73 s
> warning: unknown font family: roboto
80.73 s
> ┌─ crates/linnest/typst/docs/manual.typ:11:28
80.73 s
> │
80.73 s
> 11 │ #set text(size: 10pt, font: "Roboto")
80.73 s
> │ ^^^^^^^^
80.73 s
>
80.73 s
> warning: unknown font family: roboto
80.73 s
> ┌─ crates/linnest/typst/docs/manual.typ:14:29
80.73 s
> │
80.73 s
> 14 │ #set text(size: 3em, font: "Roboto")
80.73 s
> │ ^^^^^^^^
80.73 s
>
80.73 s
> warning: unknown font family: roboto
80.73 s
> ┌─ crates/linnest/typst/docs/manual.typ:16:31
80.73 s
> │
80.73 s
> 16 │ #set text(size: 0.3em, font: "Roboto")
80.73 s
> │ ^^^^^^^^
80.73 s
>
80.73 s
> warning: overline was ignored during MathML export
80.73 s
> ┌─ crates/linnest/typst/docs/manual.typ:949:55
80.73 s
> │
80.73 s
> 949 │ + sum_("dangling" e) c_("dangling-centroid") / (d(e, overline(v)) + epsilon)
80.73 s
> │ ^^^^^^^^^^^
80.73 s
>
80.73 s
> warning: overline was ignored during MathML export
80.73 s
> ┌─ crates/linnest/typst/docs/manual.typ:953:8
80.73 s
> │
80.73 s
> 953 │ Here $overline(v)$ is the mean node position. The centroid term pushes every
80.73 s
> │ ^^^^^^^^^^^
80.73 s
>
80.73 s
>
80.73 s
> thread 'provenance_tests::each_build_captures_one_revision_before_rendering' (243) panicked at crates/alphal00p-docs-builder/src/provenance_tests.rs:297:14:
80.73 s
> called `Result::unwrap()` on an `Err` value: generated site has broken links:
80.73 s
> products/linnet/latest/reference/interfaces/index.html -> https://github.com/alphal00p/gammaloop/blob/1111111111111111111111111111111111111111/crates/linnet-py/examples/physics_render_settings.py (missing repository source file crates/linnet-py/examples/physics_render_settings.py)
80.73 s
> products/linnet/latest/reference/interfaces/index.html -> https://github.com/alphal00p/gammaloop/blob/1111111111111111111111111111111111111111/crates/linnet-py/examples/layout_stream.py (missing repository source file crates/linnet-py/examples/layout_stream.py)
80.73 s
> products/linnet/latest/playground/index.html -> https://github.com/alphal00p/gammaloop/blob/1111111111111111111111111111111111111111/crates/linnet-py/examples/layout_stream.py (missing repository source file crates/linnet-py/examples/layout_stream.py)
80.73 s
> products/linnet/latest/guides/python-rendering/index.html -> https://github.com/alphal00p/gammaloop/blob/1111111111111111111111111111111111111111/crates/linnet-py/examples/rendering_api.py (missing repository source file crates/linnet-py/examples/rendering_api.py)
80.73 s
>
80.73 s
> Location:
80.73 s
> crates/alphal00p-docs-builder/src/lib.rs:4940:9
80.73 s
> stack backtrace:
80.73 s
> 0: __rustc::rust_begin_unwind
80.73 s
> 1: core::panicking::panic_fmt
80.73 s
> 2: core::result::unwrap_failed
80.73 s
> 3: alphal00p_docs_builder::provenance_tests::each_build_captures_one_revision_before_rendering
80.73 s
> 4: <alphal00p_docs_builder::provenance_tests::each_build_captures_one_revision_before_rendering::{closure#0} as core::ops::function::FnOnce<()>>::call_once
80.73 s
> note: Some details are omitted, run with `RUST_BACKTRACE=full` for a verbose backtrace.
80.73 s
>
80.73 s
> thread 'provenance_tests::each_build_captures_one_revision_before_rendering' (173) panicked at crates/alphal00p-docs-builder/src/provenance_tests.rs:274:9:
80.73 s
> assertion failed: command.status().unwrap().success()
80.73 s
> stack backtrace:
80.73 s
> 0: __rustc::rust_begin_unwind
80.73 s
> 1: core::panicking::panic_fmt
80.73 s
> 2: core::panicking::panic
80.73 s
> 3: alphal00p_docs_builder::provenance_tests::each_build_captures_one_revision_before_rendering
80.73 s
> 4: <alphal00p_docs_builder::provenance_tests::each_build_captures_one_revision_before_rendering::{closure#0} as core::ops::function::FnOnce<()>>::call_once
80.73 s
> note: Some details are omitted, run with `RUST_BACKTRACE=full` for a verbose backtrace.
80.73 s
>
80.73 s
> ------------
80.73 s
> Summary [ 37.129s] 129 tests run: 128 passed , 1 failed , 0 skipped
80.73 s
> FAIL [ 30.926s] (128/129) alphal00p-docs-builder provenance_tests :: each_build_captures_one_revision_before_rendering
80.73 s
> stdout ---
80.73 s
>
80.73 s
> running 1 test
80.73 s
>
80.73 s
> running 1 test
80.73 s
> test provenance_tests::each_build_captures_one_revision_before_rendering ... FAILED
80.73 s
>
80.73 s
> failures:
80.73 s
>
80.73 s
> failures:
80.73 s
> provenance_tests::each_build_captures_one_revision_before_rendering
80.73 s
>
80.73 s
> test result: FAILED. 0 passed; 1 failed; 0 ignored; 0 measured; 128 filtered out; finished in 30.86s
80.73 s
>
80.73 s
> test provenance_tests::each_build_captures_one_revision_before_rendering ... FAILED
80.73 s
>
80.73 s
> failures:
80.73 s
>
80.73 s
> failures:
80.73 s
> provenance_tests::each_build_captures_one_revision_before_rendering
80.73 s
>
80.73 s
> test result: FAILED. 0 passed; 1 failed; 0 ignored; 0 measured; 128 filtered out; finished in 30.92s
80.73 s
>
80.73 s
> stderr ---
80.73 s
> warning: bundle export is experimental
80.73 s
> = hint: its behaviour may change at any time
80.73 s
> = hint: do not rely on this feature for production use cases
80.73 s
>
80.73 s
> warning: unknown font family: roboto
80.73 s
> ┌─ crates/linnest/typst/docs/manual.typ:11:28
80.73 s
> │
80.73 s
> 11 │ #set text(size: 10pt, font: "Roboto")
80.73 s
> │ ^^^^^^^^
80.73 s
>
80.73 s
> warning: unknown font family: roboto
80.73 s
> ┌─ crates/linnest/typst/docs/manual.typ:14:29
80.73 s
> │
80.73 s
> 14 │ #set text(size: 3em, font: "Roboto")
80.73 s
> │ ^^^^^^^^
80.73 s
>
80.73 s
> warning: unknown font family: roboto
80.73 s
> ┌─ crates/linnest/typst/docs/manual.typ:16:31
80.73 s
> │
80.73 s
> 16 │ #set text(size: 0.3em, font: "Roboto")
80.73 s
> │ ^^^^^^^^
80.73 s
>
80.73 s
> warning: overline was ignored during MathML export
80.73 s
> ┌─ crates/linnest/typst/docs/manual.typ:949:55
80.73 s
> │
80.73 s
> 949 │ + sum_("dangling" e) c_("dangling-centroid") / (d(e, overline(v)) + epsilon)
80.73 s
> │ ^^^^^^^^^^^
80.73 s
>
80.73 s
> warning: overline was ignored during MathML export
80.73 s
> ┌─ crates/linnest/typst/docs/manual.typ:953:8
80.73 s
> │
80.73 s
> 953 │ Here $overline(v)$ is the mean node position. The centroid term pushes every
80.73 s
> │ ^^^^^^^^^^^
80.73 s
>
80.73 s
>
80.73 s
> thread 'provenance_tests::each_build_captures_one_revision_before_rendering' (243) panicked at crates/alphal00p-docs-builder/src/provenance_tests.rs:297:14:
80.73 s
> called `Result::unwrap()` on an `Err` value: generated site has broken links:
80.73 s
> products/linnet/latest/reference/interfaces/index.html -> https://github.com/alphal00p/gammaloop/blob/1111111111111111111111111111111111111111/crates/linnet-py/examples/physics_render_settings.py (missing repository source file crates/linnet-py/examples/physics_render_settings.py)
80.73 s
> products/linnet/latest/reference/interfaces/index.html -> https://github.com/alphal00p/gammaloop/blob/1111111111111111111111111111111111111111/crates/linnet-py/examples/layout_stream.py (missing repository source file crates/linnet-py/examples/layout_stream.py)
80.73 s
> products/linnet/latest/playground/index.html -> https://github.com/alphal00p/gammaloop/blob/1111111111111111111111111111111111111111/crates/linnet-py/examples/layout_stream.py (missing repository source file crates/linnet-py/examples/layout_stream.py)
80.73 s
> products/linnet/latest/guides/python-rendering/index.html -> https://github.com/alphal00p/gammaloop/blob/1111111111111111111111111111111111111111/crates/linnet-py/examples/rendering_api.py (missing repository source file crates/linnet-py/examples/rendering_api.py)
80.73 s
>
80.73 s
> Location:
80.73 s
> crates/alphal00p-docs-builder/src/lib.rs:4940:9
80.73 s
> stack backtrace:
80.73 s
> 0: __rustc::rust_begin_unwind
80.73 s
> 1: core::panicking::panic_fmt
80.73 s
> 2: core::result::unwrap_failed
80.73 s
> 3: alphal00p_docs_builder::provenance_tests::each_build_captures_one_revision_before_rendering
80.73 s
> 4: <alphal00p_docs_builder::provenance_tests::each_build_captures_one_revision_before_rendering::{closure#0} as core::ops::function::FnOnce<()>>::call_once
80.73 s
> note: Some details are omitted, run with `RUST_BACKTRACE=full` for a verbose backtrace.
80.73 s
>
80.73 s
> thread 'provenance_tests::each_build_captures_one_revision_before_rendering' (173) panicked at crates/alphal00p-docs-builder/src/provenance_tests.rs:274:9:
80.73 s
> assertion failed: command.status().unwrap().success()
80.73 s
> stack backtrace:
80.73 s
> 0: __rustc::rust_begin_unwind
80.73 s
> 1: core::panicking::panic_fmt
80.73 s
> 2: core::panicking::panic
80.73 s
> 3: alphal00p_docs_builder::provenance_tests::each_build_captures_one_revision_before_rendering
80.73 s
> 4: <alphal00p_docs_builder::provenance_tests::each_build_captures_one_revision_before_rendering::{closure#0} as core::ops::function::FnOnce<()>>::call_once
80.73 s
> note: Some details are omitted, run with `RUST_BACKTRACE=full` for a verbose backtrace.
80.73 s
>
80.73 s
> error : test run failed
80.73 s
>
80.73 s
> ========== nextest test summary ==========
80.73 s
> report: target/nextest/ci_gammaloop/junit.xml
80.73 s
> tests: 129, failures: 1, errors: 0
80.73 s
>
80.73 s
> 1. alphal00p-docs-builder::provenance_tests::each_build_captures_one_revision_before_rendering
80.73 s
> failure: test failure with exit code 101
80.73 s
> thread 'provenance_tests::each_build_captures_one_revision_before_rendering' (173) panicked at crates/alphal00p-docs-builder/src/provenance_tests.rs:274:9:
80.73 s
> assertion failed: command.status().unwrap().success()
80.73 s
> stack backtrace:
80.73 s
> 0: __rustc::rust_begin_unwind
80.73 s
> 1: core::panicking::panic_fmt
80.73 s
> 2: core::panicking::panic
80.73 s
> 3: alphal00p_docs_builder::provenance_tests::each_build_captures_one_revision_before_rendering
80.73 s
> 4: <alphal00p_docs_builder::provenance_tests::each_build_captures_one_revision_before_rendering::{closure#0} as core::ops::function::FnOnce<()>>::call_once
80.73 s
> note: Some details are omitted, run with `RUST_BACKTRACE=full` for a verbose backtrace.
80.73 s
> system-out
80.73 s
> running 1 test
80.73 s
>
80.73 s
> running 1 test
80.73 s
> test provenance_tests::each_build_captures_one_revision_before_rendering ... FAILED
80.73 s
>
80.73 s
> failures:
80.73 s
>
80.73 s
> failures:
80.73 s
> provenance_tests::each_build_captures_one_revision_before_rendering
80.73 s
>
80.73 s
> test result: FAILED. 0 passed; 1 failed; 0 ignored; 0 measured; 128 filtered out; finished in 30.86s
80.73 s
>
80.73 s
> test provenance_tests::each_build_captures_one_revision_before_rendering ... FAILED
80.73 s
>
80.73 s
> failures:
80.73 s
>
80.73 s
> failures:
80.73 s
> provenance_tests::each_build_captures_one_revision_before_rendering
80.73 s
>
80.73 s
> test result: FAILED. 0 passed; 1 failed; 0 ignored; 0 measured; 128 filtered out; finished in 30.92s
80.73 s
> system-err
80.73 s
> warning: bundle export is experimental
80.73 s
> = hint: its behaviour may change at any time
80.73 s
> = hint: do not rely on this feature for production use cases
80.73 s
>
80.73 s
> warning: unknown font family: roboto
80.73 s
> ┌─ crates/linnest/typst/docs/manual.typ:11:28
80.73 s
> │
80.73 s
> 11 │ #set text(size: 10pt, font: "Roboto")
80.73 s
> │ ^^^^^^^^
80.73 s
>
80.73 s
> warning: unknown font family: roboto
80.73 s
> ┌─ crates/linnest/typst/docs/manual.typ:14:29
80.73 s
> │
80.73 s
> 14 │ #set text(size: 3em, font: "Roboto")
80.73 s
> │ ^^^^^^^^
80.73 s
>
80.73 s
> warning: unknown font family: roboto
80.73 s
> ┌─ crates/linnest/typst/docs/manual.typ:16:31
80.73 s
> │
80.73 s
> 16 │ #set text(size: 0.3em, font: "Roboto")
80.73 s
> │ ^^^^^^^^
80.73 s
>
80.73 s
> warning: overline was ignored during MathML export
80.73 s
> ┌─ crates/linnest/typst/docs/manual.typ:949:55
80.73 s
> │
80.73 s
> 949 │ + sum_("dangling" e) c_("dangling-centroid") / (d(e, overline(v)) + epsilon)
80.73 s
> │ ^^^^^^^^^^^
80.73 s
>
80.73 s
> warning: overline was ignored during MathML export
80.73 s
> ┌─ crates/linnest/typst/docs/manual.typ:953:8
80.73 s
> │
80.73 s
> 953 │ Here $overline(v)$ is the mean node position. The centroid term pushes every
80.73 s
> │ ^^^^^^^^^^^
80.73 s
>
80.73 s
>
80.73 s
> thread 'provenance_tests::each_build_captures_one_revision_before_rendering' (243) panicked at crates/alphal00p-docs-builder/src/provenance_tests.rs:297:14:
80.73 s
> called `Result::unwrap()` on an `Err` value: generated site has broken links:
80.73 s
> products/linnet/latest/reference/interfaces/index.html -> https://github.com/alphal00p/gammaloop/blob/1111111111111111111111111111111111111111/crates/linnet-py/examples/physics_render_settings.py (missing repository source file crates/linnet-py/examples/physics_render_settings.py)
80.73 s
> products/linnet/latest/reference/interfaces/index.html -> https://github.com/alphal00p/gammaloop/blob/1111111111111111111111111111111111111111/crates/linnet-py/examples/layout_stream.py (missing repository source file crates/linnet-py/examples/layout_stream.py)
80.73 s
> products/linnet/latest/playground/index.html -> https://github.com/alphal00p/gammaloop/blob/1111111111111111111111111111111111111111/crates/linnet-py/examples/layout_stream.py (missing repository source file crates/linnet-py/examples/layout_stream.py)
80.73 s
> products/linnet/latest/guides/python-rendering/index.html -> https://github.com/alphal00p/gammaloop/blob/1111111111111111111111111111111111111111/crates/linnet-py/examples/rendering_api.py (missing repository source file crates/linnet-py/examples/rendering_api.py)
80.73 s
>
80.73 s
> Location:
80.73 s
> crates/alphal00p-docs-builder/src/lib.rs:4940:9
80.73 s
> stack backtrace:
80.73 s
> 0: __rustc::rust_begin_unwind
80.73 s
> 1: core::panicking::panic_fmt
80.73 s
> 2: core::result::unwrap_failed
80.73 s
> 3: alphal00p_docs_builder::provenance_tests::each_build_captures_one_revision_before_rendering
80.73 s
> 4: <alphal00p_docs_builder::provenance_tests::each_build_captures_one_revision_before_rendering::{closure#0} as core::ops::function::FnOnce<()>>::call_once
80.73 s
> note: Some details are omitted, run with `RUST_BACKTRACE=full` for a verbose backtrace.
80.73 s
>
80.73 s
> thread 'provenance_tests::each_build_captures_one_revision_before_rendering' (173) panicked at crates/alphal00p-docs-builder/src/provenance_tests.rs:274:9:
80.73 s
> assertion failed: command.status().unwrap().success()
80.73 s
> stack backtrace:
80.73 s
> 0: __rustc::rust_begin_unwind
80.73 s
> 1: core::panicking::panic_fmt
80.73 s
> 2: core::panicking::panic
80.73 s
> 3: alphal00p_docs_builder::provenance_tests::each_build_captures_one_revision_before_rendering
80.73 s
> 4: <alphal00p_docs_builder::provenance_tests::each_build_captures_one_revision_before_rendering::{closure#0} as core::ops::function::FnOnce<()>>::call_once
80.73 s
> note: Some details are omitted, run with `RUST_BACKTRACE=full` for a verbose backtrace.
80.73 s
> =========================================
80.73 s
> Extracting 2 binaries to /build/source
80.73 s
> Extracted 5 files to /build/source in 0.04s
80.73 s
> ------------
80.73 s
> Nextest run ID d9c6f16d-d29f-43f8-a63c-0cabcd717122 with nextest profile: ci_gammaloop
80.73 s
> Starting 22 tests across 2 binaries
80.73 s
> ------------
80.73 s
> Summary [ 0.018s] 22 tests run: 22 passed , 0 skipped
80.73 s
>
80.73 s
> ========== nextest test summary ==========
80.73 s
> report: target/nextest/ci_gammaloop/junit.xml
80.73 s
> tests: 22, failures: 0, errors: 0
80.73 s
> No failing testcases found.
80.73 s
> =========================================
80.73 s
> Extracting 3 binaries (including 2 non-test binaries), 1 build script output directory, and 2 linked paths to /build/source
80.73 s
> Extracted 22 files to /build/source in 0.26s
80.73 s
> ------------
80.73 s
> Nextest run ID 8d87a80d-03f5-4da0-b80d-3fd308049fde with nextest profile: ci_gammaloop
80.73 s
> Starting 89 tests across 1 binary
80.73 s
> ------------
80.73 s
> Summary [ 0.041s] 89 tests run: 89 passed , 0 skipped
80.73 s
>
80.73 s
> ========== nextest test summary ==========
80.73 s
> report: target/nextest/ci_gammaloop/junit.xml
80.73 s
> tests: 89, failures: 0, errors: 0
80.73 s
> No failing testcases found.
80.73 s
> =========================================
80.73 s
> Extracting 2 binaries to /build/source
80.73 s
> Extracted 5 files to /build/source in 0.04s
80.73 s
> ------------
80.73 s
> Nextest run ID 10c084cd-9cf9-4ea9-a75f-6428ebc01151 with nextest profile: ci_gammaloop
80.73 s
> Starting 10 tests across 2 binaries
80.73 s
> ------------
80.73 s
> Summary [ 13.317s] 10 tests run: 10 passed , 0 skipped
80.73 s
>
80.73 s
> ========== nextest test summary ==========
80.73 s
> report: target/nextest/ci_gammaloop/junit.xml
80.73 s
> tests: 10, failures: 0, errors: 0
80.73 s
> No failing testcases found.
80.73 s
> =========================================
80.73 s
> Extracting 1 binary to /build/source
80.73 s
> Extracted 4 files to /build/source in 0.04s
80.73 s
> ------------
80.73 s
> Nextest run ID 9f7549ec-e974-4fe4-adc3-30ab6c99f7f8 with nextest profile: ci_gammaloop
80.73 s
> Starting 0 tests across 1 binary
80.73 s
> ------------
80.73 s
> Summary [ 0.000s] 0 tests run: 0 passed , 0 skipped
80.73 s
>
80.73 s
> ========== nextest test summary ==========
80.73 s
> report: target/nextest/ci_gammaloop/junit.xml
80.73 s
> tests: 0, failures: 0, errors: 0
80.73 s
> No failing testcases found.
80.73 s
> =========================================
80.73 s
> Extracting 1 binary to /build/source
80.73 s
> Extracted 4 files to /build/source in 0.04s
80.73 s
> ------------
80.73 s
> Nextest run ID 2adec7da-6c02-4e1d-a09e-72c4e207d410 with nextest profile: ci_gammaloop
80.73 s
> Starting 5 tests across 1 binary
80.73 s
> ------------
80.73 s
> Summary [ 0.005s] 5 tests run: 5 passed , 0 skipped
80.73 s
>
80.73 s
> ========== nextest test summary ==========
80.73 s
> report: target/nextest/ci_gammaloop/junit.xml
80.73 s
> tests: 5, failures: 0, errors: 0
80.73 s
> No failing testcases found.
80.73 s
> =========================================
80.73 s
For full logs, run:
80.73 s
nix log /nix/store/9rs74w2crrwhaq7f0dxdi11wd515i6dj-gammaloop-nextest-docs.drv
80.88 s
[2 built (1 failed ), 7 cRun failed.