1. 0.01 s $ /nix/store/9ypz3flqsrl5xl495mm8h645gadjsxi1-coreutils-9.11/bin/timeout --kill-after=15s 7200s /nix/store/23zk8sgzamrbmj1fday15szf7f2279s8-nix-2.34.7/bin/nix --extra-experimental-features nix-command --extra-experimental-features flakes flake clone git+https://github.com/alphal00p/gammaloop --dest /tmp/nix-ci-worker/stable-pwd/repo/
  2. 0.22 s Cloning into '/tmp/nix-ci-worker/stable-pwd/repo'...
  3. 1.15 s remote: Enumerating objects: 87750, done.
  4. 1.26 s remote: Counting objects: 0% (1/10318) remote: Counting objects: 1% (104/10318) remote: Counting objects: 2% (207/10318) remote: Counting objects: 3% (310/10318) remote: Counting objects: 4% (413/10318) remote: Counting objects: 5% (516/10318) remote: Counting objects: 6% (620/10318) remote: Counting objects: 7% (723/10318) remote: Counting objects: 8% (826/10318) remote: Counting objects: 9% (929/10318) remote: Counting objects: 10% (1032/10318) remote: Counting objects: 11% (1135/10318) remote: Counting objects: 12% (1239/10318) remote: Counting objects: 13% (1342/10318) remote: Counting objects: 14% (1445/10318) remote: Counting objects: 15% (1548/10318) remote: Counting objects: 16% (1651/10318) remote: Counting objects: 17% (1755/10318) remote: Counting objects: 18% (1858/10318) remote: Counting objects: 19% (1961/10318) remote: Counting objects: 20% (2064/10318) remote: Counting objects: 21% (2167/10318) remote: Counting objects: 22% (2270/10318) remote: Counting objects: 23% (2374/10318) remote: Counting objects: 24% (2477/10318) remote: Counting objects: 25% (2580/10318) remote: Counting objects: 26% (2683/10318) remote: Counting objects: 27% (2786/10318) remote: Counting objects: 28% (2890/10318) remote: Counting objects: 29% (2993/10318) remote: Counting objects: 30% (3096/10318) remote: Counting objects: 31% (3199/10318) remote: Counting objects: 32% (3302/10318) remote: Counting objects: 33% (3405/10318) remote: Counting objects: 34% (3509/10318) remote: Counting objects: 35% (3612/10318) remote: Counting objects: 36% (3715/10318) remote: Counting objects: 37% (3818/10318) remote: Counting objects: 38% (3921/10318) remote: Counting objects: 39% (4025/10318) remote: Counting objects: 40% (4128/10318) remote: Counting objects: 41% (4231/10318) remote: Counting objects: 42% (4334/10318) remote: Counting objects: 43% (4437/10318) remote: Counting objects: 44% (4540/10318) remote: Counting objects: 45% (4644/10318) remote: Counting objects: 46% (4747/10318) remote: Counting objects: 47% (4850/10318) remote: Counting objects: 48% (4953/10318) remote: Counting objects: 49% (5056/10318) remote: Counting objects: 50% (5159/10318) remote: Counting objects: 51% (5263/10318) remote: Counting objects: 52% (5366/10318) remote: Counting objects: 53% (5469/10318) remote: Counting objects: 54% (5572/10318) remote: Counting objects: 55% (5675/10318) remote: Counting objects: 56% (5779/10318) remote: Counting objects: 57% (5882/10318) remote: Counting objects: 58% (5985/10318) remote: Counting objects: 59% (6088/10318) remote: Counting objects: 60% (6191/10318) remote: Counting objects: 61% (6294/10318) remote: Counting objects: 62% (6398/10318) remote: Counting objects: 63% (6501/10318) remote: Counting objects: 64% (6604/10318) remote: Counting objects: 65% (6707/10318) remote: Counting objects: 66% (6810/10318) remote: Counting objects: 67% (6914/10318) remote: Counting objects: 68% (7017/10318) remote: Counting objects: 69% (7120/10318) remote: Counting objects: 70% (7223/10318) remote: Counting objects: 71% (7326/10318) remote: Counting objects: 72% (7429/10318) remote: Counting objects: 73% (7533/10318) remote: Counting objects: 74% (7636/10318) remote: Counting objects: 75% (7739/10318) remote: Counting objects: 76% (7842/10318) remote: Counting objects: 77% (7945/10318) remote: Counting objects: 78% (8049/10318) remote: Counting objects: 79% (8152/10318) remote: Counting objects: 80% (8255/10318) remote: Counting objects: 81% (8358/10318) remote: Counting objects: 82% (8461/10318) remote: Counting objects: 83% (8564/10318) remote: Counting objects: 84% (8668/10318) remote: Counting objects: 85% (8771/10318) remote: Counting objects: 86% (8874/10318) remote: Counting objects: 87% (8977/10318) remote: Counting objects: 88% (9080/10318) remote: Counting objects: 89% (9184/10318) remote: Counting objects: 90% (9287/10318) remote: Counting objects: 91% (9390/10318) remote: Counting objects: 92% (9493/10318) remote: Counting objects: 93% (9596/10318) remote: Counting objects: 94% (9699/10318) remote: Counting objects: 95% (9803/10318) remote: Counting objects: 96% (9906/10318) remote: Counting objects: 97% (10009/10318) remote: Counting objects: 98% (10112/10318) remote: Counting objects: 99% (10215/10318) remote: Counting objects: 100% (10318/10318) remote: Counting objects: 100% (10318/10318), done.
  5. 3.77 s remote: Compressing objects: 0% (1/2796) remote: Compressing objects: 1% (28/2796) remote: Compressing objects: 2% (56/2796) remote: Compressing objects: 3% (84/2796) remote: Compressing objects: 4% (112/2796) remote: Compressing objects: 5% (140/2796) remote: Compressing objects: 6% (168/2796) remote: Compressing objects: 7% (196/2796) remote: Compressing objects: 8% (224/2796) remote: Compressing objects: 9% (252/2796) remote: Compressing objects: 10% (280/2796) remote: Compressing objects: 11% (308/2796) remote: Compressing objects: 12% (336/2796) remote: Compressing objects: 13% (364/2796) remote: Compressing objects: 14% (392/2796) remote: Compressing objects: 15% (420/2796) remote: Compressing objects: 16% (448/2796) remote: Compressing objects: 17% (476/2796) remote: Compressing objects: 18% (504/2796) remote: Compressing objects: 19% (532/2796) remote: Compressing objects: 19% (549/2796) remote: Compressing objects: 20% (560/2796) remote: Compressing objects: 21% (588/2796) remote: Compressing objects: 22% (616/2796) remote: Compressing objects: 23% (644/2796) remote: Compressing objects: 24% (672/2796) remote: Compressing objects: 25% (699/2796) remote: Compressing objects: 25% (723/2796) remote: Compressing objects: 26% (727/2796) remote: Compressing objects: 27% (755/2796) remote: Compressing objects: 28% (783/2796) remote: Compressing objects: 29% (811/2796) remote: Compressing objects: 30% (839/2796) remote: Compressing objects: 31% (867/2796) remote: Compressing objects: 32% (895/2796) remote: Compressing objects: 33% (923/2796) remote: Compressing objects: 34% (951/2796) remote: Compressing objects: 35% (979/2796) remote: Compressing objects: 36% (1007/2796) remote: Compressing objects: 37% (1035/2796) remote: Compressing objects: 38% (1063/2796) remote: Compressing objects: 39% (1091/2796) remote: Compressing objects: 40% (1119/2796) remote: Compressing objects: 41% (1147/2796) remote: Compressing objects: 42% (1175/2796) remote: Compressing objects: 43% (1203/2796) remote: Compressing objects: 44% (1231/2796) remote: Compressing objects: 45% (1259/2796) remote: Compressing objects: 46% (1287/2796) remote: Compressing objects: 47% (1315/2796) remote: Compressing objects: 48% (1343/2796) remote: Compressing objects: 49% (1371/2796) remote: Compressing objects: 50% (1398/2796) remote: Compressing objects: 51% (1426/2796) remote: Compressing objects: 52% (1454/2796) remote: Compressing objects: 53% (1482/2796) remote: Compressing objects: 54% (1510/2796) remote: Compressing objects: 55% (1538/2796) remote: Compressing objects: 56% (1566/2796) remote: Compressing objects: 57% (1594/2796) remote: Compressing objects: 58% (1622/2796) remote: Compressing objects: 59% (1650/2796) remote: Compressing objects: 60% (1678/2796) remote: Compressing objects: 61% (1706/2796) remote: Compressing objects: 62% (1734/2796) remote: Compressing objects: 63% (1762/2796) remote: Compressing objects: 64% (1790/2796) remote: Compressing objects: 65% (1818/2796) remote: Compressing objects: 66% (1846/2796) remote: Compressing objects: 67% (1874/2796) remote: Compressing objects: 68% (1902/2796) remote: Compressing objects: 69% (1930/2796) remote: Compressing objects: 70% (1958/2796) remote: Compressing objects: 71% (1986/2796) remote: Compressing objects: 72% (2014/2796) remote: Compressing objects: 73% (2042/2796) remote: Compressing objects: 74% (2070/2796) remote: Compressing objects: 75% (2097/2796) remote: Compressing objects: 76% (2125/2796) remote: Compressing objects: 77% (2153/2796) remote: Compressing objects: 78% (2181/2796) remote: Compressing objects: 79% (2209/2796) remote: Compressing objects: 80% (2237/2796) remote: Compressing objects: 81% (2265/2796) remote: Compressing objects: 82% (2293/2796) remote: Compressing objects: 83% (2321/2796) remote: Compressing objects: 84% (2349/2796) remote: Compressing objects: 85% (2377/2796) remote: Compressing objects: 86% (2405/2796) remote: Compressing objects: 87% (2433/2796) remote: Compressing objects: 88% (2461/2796) remote: Compressing objects: 89% (2489/2796) remote: Compressing objects: 90% (2517/2796) remote: Compressing objects: 91% (2545/2796) remote: Compressing objects: 92% (2573/2796) remote: Compressing objects: 93% (2601/2796) remote: Compressing objects: 94% (2629/2796) remote: Compressing objects: 95% (2657/2796) remote: Compressing objects: 96% (2685/2796) remote: Compressing objects: 97% (2713/2796) remote: Compressing objects: 98% (2741/2796) remote: Compressing objects: 99% (2769/2796) remote: Compressing objects: 100% (2796/2796) remote: Compressing objects: 100% (2796/2796), done.
  6. 9.28 s Receiving objects: 0% (1/87750) Receiving objects: 1% (878/87750) Receiving objects: 2% (1755/87750) Receiving objects: 3% (2633/87750) Receiving objects: 4% (3510/87750) Receiving objects: 5% (4388/87750) Receiving objects: 6% (5265/87750) Receiving objects: 7% (6143/87750) Receiving objects: 8% (7020/87750) Receiving objects: 9% (7898/87750), 13.08 MiB | 26.14 MiB/s Receiving objects: 10% (8775/87750), 13.08 MiB | 26.14 MiB/s Receiving objects: 11% (9653/87750), 13.08 MiB | 26.14 MiB/s Receiving objects: 12% (10530/87750), 13.08 MiB | 26.14 MiB/s Receiving objects: 13% (11408/87750), 13.08 MiB | 26.14 MiB/s Receiving objects: 14% (12285/87750), 13.08 MiB | 26.14 MiB/s Receiving objects: 15% (13163/87750), 13.08 MiB | 26.14 MiB/s Receiving objects: 16% (14040/87750), 13.08 MiB | 26.14 MiB/s Receiving objects: 17% (14918/87750), 13.08 MiB | 26.14 MiB/s Receiving objects: 18% (15795/87750), 13.08 MiB | 26.14 MiB/s Receiving objects: 19% (16673/87750), 13.08 MiB | 26.14 MiB/s Receiving objects: 20% (17550/87750), 13.08 MiB | 26.14 MiB/s Receiving objects: 21% (18428/87750), 13.08 MiB | 26.14 MiB/s Receiving objects: 22% (19305/87750), 13.08 MiB | 26.14 MiB/s Receiving objects: 23% (20183/87750), 13.08 MiB | 26.14 MiB/s Receiving objects: 24% (21060/87750), 13.08 MiB | 26.14 MiB/s Receiving objects: 25% (21938/87750), 13.08 MiB | 26.14 MiB/s Receiving objects: 25% (22649/87750), 25.21 MiB | 25.20 MiB/s Receiving objects: 26% (22815/87750), 25.21 MiB | 25.20 MiB/s Receiving objects: 27% (23693/87750), 25.21 MiB | 25.20 MiB/s Receiving objects: 28% (24570/87750), 25.21 MiB | 25.20 MiB/s Receiving objects: 29% (25448/87750), 25.21 MiB | 25.20 MiB/s Receiving objects: 30% (26325/87750), 25.21 MiB | 25.20 MiB/s Receiving objects: 31% (27203/87750), 25.21 MiB | 25.20 MiB/s Receiving objects: 32% (28080/87750), 25.21 MiB | 25.20 MiB/s Receiving objects: 33% (28958/87750), 25.21 MiB | 25.20 MiB/s Receiving objects: 34% (29835/87750), 25.21 MiB | 25.20 MiB/s Receiving objects: 35% (30713/87750), 25.21 MiB | 25.20 MiB/s Receiving objects: 36% (31590/87750), 25.21 MiB | 25.20 MiB/s Receiving objects: 37% (32468/87750), 25.21 MiB | 25.20 MiB/s Receiving objects: 38% (33345/87750), 25.21 MiB | 25.20 MiB/s Receiving objects: 39% (34223/87750), 25.21 MiB | 25.20 MiB/s Receiving objects: 40% (35100/87750), 25.21 MiB | 25.20 MiB/s Receiving objects: 41% (35978/87750), 25.21 MiB | 25.20 MiB/s Receiving objects: 42% (36855/87750), 38.14 MiB | 25.42 MiB/s Receiving objects: 43% (37733/87750), 38.14 MiB | 25.42 MiB/s Receiving objects: 44% (38610/87750), 38.14 MiB | 25.42 MiB/s Receiving objects: 45% (39488/87750), 38.14 MiB | 25.42 MiB/s Receiving objects: 46% (40365/87750), 38.14 MiB | 25.42 MiB/s Receiving objects: 47% (41243/87750), 38.14 MiB | 25.42 MiB/s Receiving objects: 48% (42120/87750), 38.14 MiB | 25.42 MiB/s Receiving objects: 49% (42998/87750), 38.14 MiB | 25.42 MiB/s Receiving objects: 50% (43875/87750), 38.14 MiB | 25.42 MiB/s Receiving objects: 50% (44688/87750), 38.14 MiB | 25.42 MiB/s Receiving objects: 51% (44753/87750), 53.91 MiB | 26.95 MiB/s Receiving objects: 52% (45630/87750), 53.91 MiB | 26.95 MiB/s Receiving objects: 53% (46508/87750), 53.91 MiB | 26.95 MiB/s Receiving objects: 54% (47385/87750), 53.91 MiB | 26.95 MiB/s Receiving objects: 55% (48263/87750), 53.91 MiB | 26.95 MiB/s Receiving objects: 56% (49140/87750), 67.44 MiB | 26.87 MiB/s Receiving objects: 57% (50018/87750), 67.44 MiB | 26.87 MiB/s Receiving objects: 58% (50895/87750), 67.44 MiB | 26.87 MiB/s Receiving objects: 59% (51773/87750), 67.44 MiB | 26.87 MiB/s Receiving objects: 60% (52650/87750), 67.44 MiB | 26.87 MiB/s Receiving objects: 61% (53528/87750), 67.44 MiB | 26.87 MiB/s Receiving objects: 62% (54405/87750), 67.44 MiB | 26.87 MiB/s Receiving objects: 63% (55283/87750), 67.44 MiB | 26.87 MiB/s Receiving objects: 64% (56160/87750), 67.44 MiB | 26.87 MiB/s Receiving objects: 64% (56823/87750), 67.44 MiB | 26.87 MiB/s Receiving objects: 65% (57038/87750), 67.44 MiB | 26.87 MiB/s Receiving objects: 66% (57915/87750), 99.49 MiB | 28.34 MiB/s Receiving objects: 67% (58793/87750), 99.49 MiB | 28.34 MiB/s Receiving objects: 68% (59670/87750), 99.49 MiB | 28.34 MiB/s Receiving objects: 69% (60548/87750), 99.49 MiB | 28.34 MiB/s Receiving objects: 70% (61425/87750), 99.49 MiB | 28.34 MiB/s Receiving objects: 71% (62303/87750), 99.49 MiB | 28.34 MiB/s Receiving objects: 71% (62804/87750), 99.49 MiB | 28.34 MiB/s Receiving objects: 72% (63180/87750), 116.04 MiB | 28.94 MiB/s Receiving objects: 73% (64058/87750), 116.04 MiB | 28.94 MiB/s Receiving objects: 74% (64935/87750), 116.04 MiB | 28.94 MiB/s Receiving objects: 75% (65813/87750), 116.04 MiB | 28.94 MiB/s Receiving objects: 76% (66690/87750), 116.04 MiB | 28.94 MiB/s Receiving objects: 77% (67568/87750), 116.04 MiB | 28.94 MiB/s Receiving objects: 78% (68445/87750), 133.67 MiB | 29.64 MiB/s Receiving objects: 79% (69323/87750), 133.67 MiB | 29.64 MiB/s Receiving objects: 80% (70200/87750), 133.67 MiB | 29.64 MiB/s Receiving objects: 81% (71078/87750), 133.67 MiB | 29.64 MiB/s Receiving objects: 82% (71955/87750), 133.67 MiB | 29.64 MiB/s Receiving objects: 83% (72833/87750), 133.67 MiB | 29.64 MiB/s Receiving objects: 84% (73710/87750), 133.67 MiB | 29.64 MiB/s Receiving objects: 85% (74588/87750), 133.67 MiB | 29.64 MiB/s Receiving objects: 86% (75465/87750), 133.67 MiB | 29.64 MiB/s Receiving objects: 87% (76343/87750), 133.67 MiB | 29.64 MiB/s Receiving objects: 88% (77220/87750), 133.67 MiB | 29.64 MiB/s Receiving objects: 88% (77663/87750), 133.67 MiB | 29.64 MiB/s Receiving objects: 89% (78098/87750), 133.67 MiB | 29.64 MiB/s Receiving objects: 90% (78975/87750), 133.67 MiB | 29.64 MiB/s Receiving objects: 91% (79853/87750), 133.67 MiB | 29.64 MiB/s Receiving objects: 92% (80730/87750), 133.67 MiB | 29.64 MiB/s Receiving objects: 93% (81608/87750), 150.65 MiB | 30.50 MiB/s Receiving objects: 94% (82485/87750), 150.65 MiB | 30.50 MiB/s Receiving objects: 95% (83363/87750), 150.65 MiB | 30.50 MiB/s Receiving objects: 96% (84240/87750), 150.65 MiB | 30.50 MiB/s Receiving objects: 97% (85118/87750), 150.65 MiB | 30.50 MiB/s Receiving objects: 98% (85995/87750), 150.65 MiB | 30.50 MiB/s Receiving objects: 99% (86873/87750), 150.65 MiB | 30.50 MiB/s remote: Total 87750 (delta 8523), reused 8153 (delta 7496), pack-reused 77432 (from 3)
  7. 9.29 s Receiving objects: 100% (87750/87750), 167.18 MiB | 31.48 MiB/s Receiving objects: 100% (87750/87750), 167.18 MiB | 30.33 MiB/s, done.
  8. 11.91 s Resolving deltas: 0% (0/59418) Resolving deltas: 1% (595/59418) Resolving deltas: 2% (1189/59418) Resolving deltas: 3% (1783/59418) Resolving deltas: 4% (2377/59418) Resolving deltas: 5% (2971/59418) Resolving deltas: 6% (3566/59418) Resolving deltas: 7% (4160/59418) Resolving deltas: 8% (4754/59418) Resolving deltas: 9% (5348/59418) Resolving deltas: 10% (5942/59418) Resolving deltas: 11% (6536/59418) Resolving deltas: 12% (7131/59418) Resolving deltas: 13% (7725/59418) Resolving deltas: 14% (8319/59418) Resolving deltas: 15% (8913/59418) Resolving deltas: 16% (9507/59418) Resolving deltas: 17% (10102/59418) Resolving deltas: 18% (10697/59418) Resolving deltas: 19% (11290/59418) Resolving deltas: 20% (11884/59418) Resolving deltas: 21% (12478/59418) Resolving deltas: 22% (13073/59418) Resolving deltas: 23% (13667/59418) Resolving deltas: 24% (14261/59418) Resolving deltas: 25% (14855/59418) Resolving deltas: 26% (15449/59418) Resolving deltas: 27% (16043/59418) Resolving deltas: 28% (16638/59418) Resolving deltas: 29% (17233/59418) Resolving deltas: 30% (17826/59418) Resolving deltas: 31% (18420/59418) Resolving deltas: 32% (19014/59418) Resolving deltas: 33% (19608/59418) Resolving deltas: 34% (20203/59418) Resolving deltas: 35% (20797/59418) Resolving deltas: 36% (21391/59418) Resolving deltas: 37% (21985/59418) Resolving deltas: 38% (22579/59418) Resolving deltas: 39% (23174/59418) Resolving deltas: 40% (23768/59418) Resolving deltas: 41% (24362/59418) Resolving deltas: 42% (24956/59418) Resolving deltas: 43% (25550/59418) Resolving deltas: 44% (26144/59418) Resolving deltas: 45% (26739/59418) Resolving deltas: 46% (27333/59418) Resolving deltas: 47% (27927/59418) Resolving deltas: 48% (28521/59418) Resolving deltas: 49% (29115/59418) Resolving deltas: 50% (29709/59418) Resolving deltas: 51% (30304/59418) Resolving deltas: 51% (30400/59418) Resolving deltas: 52% (30898/59418) Resolving deltas: 53% (31492/59418) Resolving deltas: 54% (32086/59418) Resolving deltas: 55% (32680/59418) Resolving deltas: 56% (33275/59418) Resolving deltas: 57% (33869/59418) Resolving deltas: 58% (34463/59418) Resolving deltas: 59% (35058/59418) Resolving deltas: 60% (35651/59418) Resolving deltas: 61% (36245/59418) Resolving deltas: 62% (36840/59418) Resolving deltas: 63% (37434/59418) Resolving deltas: 64% (38028/59418) Resolving deltas: 65% (38622/59418) Resolving deltas: 66% (39216/59418) Resolving deltas: 67% (39811/59418) Resolving deltas: 68% (40405/59418) Resolving deltas: 69% (40999/59418) Resolving deltas: 70% (41593/59418) Resolving deltas: 71% (42187/59418) Resolving deltas: 72% (42781/59418) Resolving deltas: 73% (43376/59418) Resolving deltas: 74% (43970/59418) Resolving deltas: 75% (44564/59418) Resolving deltas: 76% (45158/59418) Resolving deltas: 76% (45538/59418) Resolving deltas: 77% (45752/59418) Resolving deltas: 78% (46347/59418) Resolving deltas: 79% (46942/59418) Resolving deltas: 80% (47535/59418) Resolving deltas: 81% (48129/59418) Resolving deltas: 82% (48723/59418) Resolving deltas: 83% (49318/59418) Resolving deltas: 84% (49912/59418) Resolving deltas: 85% (50506/59418) Resolving deltas: 86% (51100/59418) Resolving deltas: 87% (51694/59418) Resolving deltas: 88% (52289/59418) Resolving deltas: 89% (52883/59418) Resolving deltas: 90% (53477/59418) Resolving deltas: 91% (54071/59418) Resolving deltas: 92% (54665/59418) Resolving deltas: 93% (55259/59418) Resolving deltas: 94% (55854/59418) Resolving deltas: 95% (56448/59418) Resolving deltas: 96% (57042/59418) Resolving deltas: 97% (57636/59418) Resolving deltas: 98% (58230/59418) Resolving deltas: 99% (58824/59418) Resolving deltas: 100% (59418/59418) Resolving deltas: 100% (59418/59418), done.
  9. 12.65 s Fetching commit 8ecfe383f31edc9471a94db42a1bce8122dd3b6a for docs ...
  10. 12.65 s $ /nix/store/bcnisk3ydfgv26v2gw3zlky24g00yww2-git-2.54.0/bin/git fetch origin 8ecfe383f31edc9471a94db42a1bce8122dd3b6a
  11. 13.22 s From https://github.com/alphal00p/gammaloop
  12. 13.22 s * branch 8ecfe383f31edc9471a94db42a1bce8122dd3b6a -> FETCH_HEAD
  13. 13.26 s $ /nix/store/9ypz3flqsrl5xl495mm8h645gadjsxi1-coreutils-9.11/bin/timeout --kill-after=15s 7200s /nix/store/bcnisk3ydfgv26v2gw3zlky24g00yww2-git-2.54.0/bin/git -c advice.detachedHead=false checkout 8ecfe383f31edc9471a94db42a1bce8122dd3b6a
  14. 13.57 s HEAD is now at 8ecfe383f support jj docs builds and warn on scope drift during watch
  15. 13.58 s $ /nix/store/9ypz3flqsrl5xl495mm8h645gadjsxi1-coreutils-9.11/bin/timeout --kill-after=15s 7200s /nix/store/23zk8sgzamrbmj1fday15szf7f2279s8-nix-2.34.7/bin/nix --extra-experimental-features nix-command --extra-experimental-features flakes --log-format internal-json run .#packages.x86_64-linux.nix-ci-check-gammaloop-nextest-linnet --print-build-logs
  16. 18.01 s
  17. 23.33 s evaluating derivation 'g copying '/nix/store/wlg6 evaluating derivation 'g copying '/nix/store/wlg6 evaluating derivation 'g [0/1 built] [1/0/1 built] building ggammaloop-nextest-linnet> Extracting 2 binaries (including 1 non-test binary) to /build/source
  18. 23.38 s gammaloop-nextest-linnet> Extracted 6 files to /build/source in 0.05s
  19. 23.40 s gammaloop-nextest-linnet> ------------
  20. 23.40 s gammaloop-nextest-linnet> Nextest run ID df87bcb4-7a80-4ea5-a233-f54f11ef54c8 with nextest profile: ci_gammaloop
  21. 23.40 s gammaloop-nextest-linnet> Starting 24 tests across 1 binary
  22. 23.47 s gammaloop-nextest-linnet> ------------
  23. 23.47 s gammaloop-nextest-linnet> Summary [ 0.060s] 24 tests run: 24 passed, 0 skipped
  24. 23.51 s gammaloop-nextest-linnet>
  25. 23.51 s gammaloop-nextest-linnet> ========== nextest test summary ==========
  26. 23.51 s gammaloop-nextest-linnet> report: target/nextest/ci_gammaloop/junit.xml
  27. 23.51 s gammaloop-nextest-linnet> tests: 24, failures: 0, errors: 0
  28. 23.51 s gammaloop-nextest-linnet> No failing testcases found.
  29. 23.51 s gammaloop-nextest-linnet> =========================================
  30. 23.53 s gammaloop-nextest-linnet> Extracting 2 binaries (including 1 non-test binary) and 1 linked path to /build/source
  31. 23.70 s gammaloop-nextest-linnet> Extracted 9 files to /build/source in 0.17s
  32. 23.73 s gammaloop-nextest-linnet> ------------
  33. 23.73 s gammaloop-nextest-linnet> Nextest run ID 67c85bb4-b62f-4a43-b4d1-07ffd93d5ac3 with nextest profile: ci_gammaloop
  34. 23.73 s gammaloop-nextest-linnet> Starting 183 tests across 1 binary
  35. 24.00 s gammaloop-nextest-linnet> ------------
  36. 24.00 s gammaloop-nextest-linnet> Summary [ 0.279s] 183 tests run: 183 passed, 0 skipped
  37. 24.05 s gammaloop-nextest-linnet>
  38. 24.05 s gammaloop-nextest-linnet> ========== nextest test summary ==========
  39. 24.05 s gammaloop-nextest-linnet> report: target/nextest/ci_gammaloop/junit.xml
  40. 24.05 s gammaloop-nextest-linnet> tests: 183, failures: 0, errors: 0
  41. 24.05 s gammaloop-nextest-linnet> No failing testcases found.
  42. 24.05 s gammaloop-nextest-linnet> =========================================
  43. 24.07 s gammaloop-nextest-linnet> Extracting 4 binaries (including 3 non-test binaries), 1 build script output directory, and 1 linked path to /build/source
  44. 24.35 s gammaloop-nextest-linnet> Extracted 13 files to /build/source in 0.29s
  45. 24.37 s gammaloop-nextest-linnet> ------------
  46. 24.37 s gammaloop-nextest-linnet> Nextest run ID 4fb5193f-b8d5-4308-8e7f-1335bdcb6880 with nextest profile: ci_gammaloop
  47. 24.37 s gammaloop-nextest-linnet> Starting 0 tests across 1 binary
  48. 24.38 s gammaloop-nextest-linnet> ------------
  49. 24.38 s gammaloop-nextest-linnet> Summary [ 0.007s] 0 tests run: 0 passed, 0 skipped
  50. 24.43 s gammaloop-nextest-linnet>
  51. 24.43 s gammaloop-nextest-linnet> ========== nextest test summary ==========
  52. 24.43 s gammaloop-nextest-linnet> report: target/nextest/ci_gammaloop/junit.xml
  53. 24.43 s gammaloop-nextest-linnet> tests: 0, failures: 0, errors: 0
  54. 24.43 s gammaloop-nextest-linnet> No failing testcases found.
  55. 24.43 s gammaloop-nextest-linnet> =========================================
  56. 24.45 s gammaloop-nextest-linnet> Extracting 2 binaries (including 1 non-test binary) and 1 linked path to /build/source
  57. 24.55 s gammaloop-nextest-linnet> Extracted 9 files to /build/source in 0.10s
  58. 24.57 s gammaloop-nextest-linnet> ------------
  59. 24.57 s gammaloop-nextest-linnet> Nextest run ID 0936aac9-84af-46af-aa19-da54175203bc with nextest profile: ci_gammaloop
  60. 24.57 s gammaloop-nextest-linnet> Starting 128 tests across 1 binary
  61. 24.71 s gammaloop-nextest-linnet> FAIL [ 0.017s] (101/128) linnest tests::test_graph_structural_axis_merge_preserves_edge_positions_and_constraints
  62. 24.71 s gammaloop-nextest-linnet> stdout ---
  63. 24.71 s gammaloop-nextest-linnet>
  64. 24.71 s gammaloop-nextest-linnet> running 1 test
  65. 24.71 s gammaloop-nextest-linnet> test tests::test_graph_structural_axis_merge_preserves_edge_positions_and_constraints ... FAILED
  66. 24.71 s gammaloop-nextest-linnet>
  67. 24.71 s gammaloop-nextest-linnet> failures:
  68. 24.71 s gammaloop-nextest-linnet>
  69. 24.71 s gammaloop-nextest-linnet> failures:
  70. 24.71 s gammaloop-nextest-linnet> tests::test_graph_structural_axis_merge_preserves_edge_positions_and_constraints
  71. 24.71 s gammaloop-nextest-linnet>
  72. 24.71 s gammaloop-nextest-linnet> test result: FAILED. 0 passed; 1 failed; 0 ignored; 0 measured; 127 filtered out; finished in 0.00s
  73. 24.71 s gammaloop-nextest-linnet>
  74. 24.71 s gammaloop-nextest-linnet> stderr ---
  75. 24.71 s gammaloop-nextest-linnet>
  76. 24.71 s gammaloop-nextest-linnet> thread 'tests::test_graph_structural_axis_merge_preserves_edge_positions_and_constraints' (921) panicked at crates/linnest/src/tests.rs:1721:32:
  77. 24.71 s gammaloop-nextest-linnet> no entry found for key
  78. 24.71 s gammaloop-nextest-linnet> stack backtrace:
  79. 24.71 s gammaloop-nextest-linnet> 0: __rustc::rust_begin_unwind
  80. 24.71 s gammaloop-nextest-linnet> 1: core::panicking::panic_fmt
  81. 24.71 s gammaloop-nextest-linnet> 2: core::option::expect_failed
  82. 24.71 s gammaloop-nextest-linnet> 3: linnest::tests::test_graph_structural_axis_merge_preserves_edge_positions_and_constraints
  83. 24.71 s gammaloop-nextest-linnet> 4: <linnest::tests::test_graph_structural_axis_merge_preserves_edge_positions_and_constraints::{closure#0} as core::ops::function::FnOnce<()>>::call_once
  84. 24.71 s gammaloop-nextest-linnet> note: Some details are omitted, run with `RUST_BACKTRACE=full` for a verbose backtrace.
  85. 24.71 s gammaloop-nextest-linnet>
  86. 24.75 s gammaloop-nextest-linnet> ------------
  87. 24.75 s gammaloop-nextest-linnet> Summary [ 0.180s] 128 tests run: 127 passed, 1 failed, 0 skipped
  88. 24.75 s gammaloop-nextest-linnet> FAIL [ 0.017s] (101/128) linnest tests::test_graph_structural_axis_merge_preserves_edge_positions_and_constraints
  89. 24.75 s gammaloop-nextest-linnet> stdout ---
  90. 24.75 s gammaloop-nextest-linnet>
  91. 24.75 s gammaloop-nextest-linnet> running 1 test
  92. 24.75 s gammaloop-nextest-linnet> test tests::test_graph_structural_axis_merge_preserves_edge_positions_and_constraints ... FAILED
  93. 24.75 s gammaloop-nextest-linnet>
  94. 24.75 s gammaloop-nextest-linnet> failures:
  95. 24.75 s gammaloop-nextest-linnet>
  96. 24.75 s gammaloop-nextest-linnet> failures:
  97. 24.75 s gammaloop-nextest-linnet> tests::test_graph_structural_axis_merge_preserves_edge_positions_and_constraints
  98. 24.75 s gammaloop-nextest-linnet>
  99. 24.75 s gammaloop-nextest-linnet> test result: FAILED. 0 passed; 1 failed; 0 ignored; 0 measured; 127 filtered out; finished in 0.00s
  100. 24.75 s gammaloop-nextest-linnet>
  101. 24.75 s gammaloop-nextest-linnet> stderr ---
  102. 24.75 s gammaloop-nextest-linnet>
  103. 24.75 s gammaloop-nextest-linnet> thread 'tests::test_graph_structural_axis_merge_preserves_edge_positions_and_constraints' (921) panicked at crates/linnest/src/tests.rs:1721:32:
  104. 24.75 s gammaloop-nextest-linnet> no entry found for key
  105. 24.75 s gammaloop-nextest-linnet> stack backtrace:
  106. 24.75 s gammaloop-nextest-linnet> 0: __rustc::rust_begin_unwind
  107. 24.75 s gammaloop-nextest-linnet> 1: core::panicking::panic_fmt
  108. 24.75 s gammaloop-nextest-linnet> 2: core::option::expect_failed
  109. 24.75 s gammaloop-nextest-linnet> 3: linnest::tests::test_graph_structural_axis_merge_preserves_edge_positions_and_constraints
  110. 24.75 s gammaloop-nextest-linnet> 4: <linnest::tests::test_graph_structural_axis_merge_preserves_edge_positions_and_constraints::{closure#0} as core::ops::function::FnOnce<()>>::call_once
  111. 24.75 s gammaloop-nextest-linnet> note: Some details are omitted, run with `RUST_BACKTRACE=full` for a verbose backtrace.
  112. 24.75 s gammaloop-nextest-linnet>
  113. 24.76 s gammaloop-nextest-linnet> error: test run failed
  114. 24.79 s gammaloop-nextest-linnet>
  115. 24.79 s gammaloop-nextest-linnet> ========== nextest test summary ==========
  116. 24.79 s gammaloop-nextest-linnet> report: target/nextest/ci_gammaloop/junit.xml
  117. 24.79 s gammaloop-nextest-linnet> tests: 128, failures: 1, errors: 0
  118. 24.79 s gammaloop-nextest-linnet>
  119. 24.79 s gammaloop-nextest-linnet> 1. linnest::tests::test_graph_structural_axis_merge_preserves_edge_positions_and_constraints
  120. 24.79 s gammaloop-nextest-linnet> failure: test failure with exit code 101
  121. 24.79 s gammaloop-nextest-linnet> thread 'tests::test_graph_structural_axis_merge_preserves_edge_positions_and_constraints' (921) panicked at crates/linnest/src/tests.rs:1721:32:
  122. 24.79 s gammaloop-nextest-linnet> no entry found for key
  123. 24.79 s gammaloop-nextest-linnet> stack backtrace:
  124. 24.79 s gammaloop-nextest-linnet> 0: __rustc::rust_begin_unwind
  125. 24.79 s gammaloop-nextest-linnet> 1: core::panicking::panic_fmt
  126. 24.79 s gammaloop-nextest-linnet> 2: core::option::expect_failed
  127. 24.79 s gammaloop-nextest-linnet> 3: linnest::tests::test_graph_structural_axis_merge_preserves_edge_positions_and_constraints
  128. 24.79 s gammaloop-nextest-linnet> 4: <linnest::tests::test_graph_structural_axis_merge_preserves_edge_positions_and_constraints::{closure#0} as core::ops::function::FnOnce<()>>::call_once
  129. 24.79 s gammaloop-nextest-linnet> note: Some details are omitted, run with `RUST_BACKTRACE=full` for a verbose backtrace.
  130. 24.79 s gammaloop-nextest-linnet> system-out
  131. 24.79 s gammaloop-nextest-linnet> running 1 test
  132. 24.79 s gammaloop-nextest-linnet> test tests::test_graph_structural_axis_merge_preserves_edge_positions_and_constraints ... FAILED
  133. 24.79 s gammaloop-nextest-linnet>
  134. 24.79 s gammaloop-nextest-linnet> failures:
  135. 24.79 s gammaloop-nextest-linnet>
  136. 24.79 s gammaloop-nextest-linnet> failures:
  137. 24.79 s gammaloop-nextest-linnet> tests::test_graph_structural_axis_merge_preserves_edge_positions_and_constraints
  138. 24.79 s gammaloop-nextest-linnet>
  139. 24.79 s gammaloop-nextest-linnet> test result: FAILED. 0 passed; 1 failed; 0 ignored; 0 measured; 127 filtered out; finished in 0.00s
  140. 24.79 s gammaloop-nextest-linnet> system-err
  141. 24.79 s gammaloop-nextest-linnet> thread 'tests::test_graph_structural_axis_merge_preserves_edge_positions_and_constraints' (921) panicked at crates/linnest/src/tests.rs:1721:32:
  142. 24.79 s gammaloop-nextest-linnet> no entry found for key
  143. 24.79 s gammaloop-nextest-linnet> stack backtrace:
  144. 24.79 s gammaloop-nextest-linnet> 0: __rustc::rust_begin_unwind
  145. 24.79 s gammaloop-nextest-linnet> 1: core::panicking::panic_fmt
  146. 24.79 s gammaloop-nextest-linnet> 2: core::option::expect_failed
  147. 24.79 s gammaloop-nextest-linnet> 3: linnest::tests::test_graph_structural_axis_merge_preserves_edge_positions_and_constraints
  148. 24.79 s gammaloop-nextest-linnet> 4: <linnest::tests::test_graph_structural_axis_merge_preserves_edge_positions_and_constraints::{closure#0} as core::ops::function::FnOnce<()>>::call_once
  149. 24.79 s gammaloop-nextest-linnet> note: Some details are omitted, run with `RUST_BACKTRACE=full` for a verbose backtrace.
  150. 24.79 s gammaloop-nextest-linnet> =========================================
  151. 24.91 s error: Cannot build '/nix/store/3a6s86hhbf2g1hgbkmcq3zdrmaha78qr-gammaloop-nextest-linnet.drv'.
  152. 24.91 s Reason: builder failed with exit code 100.
  153. 24.91 s Output paths:
  154. 24.91 s /nix/store/v4cbh6ql60kq7xlziivk5va382nw7f4v-gammaloop-nextest-linnet
  155. 24.91 s Last 134 log lines:
  156. 24.91 s > Extracting 2 binaries (including 1 non-test binary) to /build/source
  157. 24.91 s > Extracted 6 files to /build/source in 0.05s
  158. 24.91 s > ------------
  159. 24.91 s > Nextest run ID df87bcb4-7a80-4ea5-a233-f54f11ef54c8 with nextest profile: ci_gammaloop
  160. 24.91 s > Starting 24 tests across 1 binary
  161. 24.91 s > ------------
  162. 24.91 s > Summary [ 0.060s] 24 tests run: 24 passed, 0 skipped
  163. 24.91 s >
  164. 24.91 s > ========== nextest test summary ==========
  165. 24.91 s > report: target/nextest/ci_gammaloop/junit.xml
  166. 24.91 s > tests: 24, failures: 0, errors: 0
  167. 24.91 s > No failing testcases found.
  168. 24.91 s > =========================================
  169. 24.91 s > Extracting 2 binaries (including 1 non-test binary) and 1 linked path to /build/source
  170. 24.91 s > Extracted 9 files to /build/source in 0.17s
  171. 24.91 s > ------------
  172. 24.91 s > Nextest run ID 67c85bb4-b62f-4a43-b4d1-07ffd93d5ac3 with nextest profile: ci_gammaloop
  173. 24.91 s > Starting 183 tests across 1 binary
  174. 24.91 s > ------------
  175. 24.91 s > Summary [ 0.279s] 183 tests run: 183 passed, 0 skipped
  176. 24.91 s >
  177. 24.91 s > ========== nextest test summary ==========
  178. 24.91 s > report: target/nextest/ci_gammaloop/junit.xml
  179. 24.91 s > tests: 183, failures: 0, errors: 0
  180. 24.91 s > No failing testcases found.
  181. 24.91 s > =========================================
  182. 24.91 s > Extracting 4 binaries (including 3 non-test binaries), 1 build script output directory, and 1 linked path to /build/source
  183. 24.91 s > Extracted 13 files to /build/source in 0.29s
  184. 24.91 s > ------------
  185. 24.91 s > Nextest run ID 4fb5193f-b8d5-4308-8e7f-1335bdcb6880 with nextest profile: ci_gammaloop
  186. 24.91 s > Starting 0 tests across 1 binary
  187. 24.91 s > ------------
  188. 24.91 s > Summary [ 0.007s] 0 tests run: 0 passed, 0 skipped
  189. 24.91 s >
  190. 24.91 s > ========== nextest test summary ==========
  191. 24.91 s > report: target/nextest/ci_gammaloop/junit.xml
  192. 24.91 s > tests: 0, failures: 0, errors: 0
  193. 24.91 s > No failing testcases found.
  194. 24.91 s > =========================================
  195. 24.91 s > Extracting 2 binaries (including 1 non-test binary) and 1 linked path to /build/source
  196. 24.91 s > Extracted 9 files to /build/source in 0.10s
  197. 24.91 s > ------------
  198. 24.91 s > Nextest run ID 0936aac9-84af-46af-aa19-da54175203bc with nextest profile: ci_gammaloop
  199. 24.91 s > Starting 128 tests across 1 binary
  200. 24.91 s > FAIL [ 0.017s] (101/128) linnest tests::test_graph_structural_axis_merge_preserves_edge_positions_and_constraints
  201. 24.91 s > stdout ---
  202. 24.91 s >
  203. 24.91 s > running 1 test
  204. 24.91 s > test tests::test_graph_structural_axis_merge_preserves_edge_positions_and_constraints ... FAILED
  205. 24.91 s >
  206. 24.91 s > failures:
  207. 24.91 s >
  208. 24.91 s > failures:
  209. 24.91 s > tests::test_graph_structural_axis_merge_preserves_edge_positions_and_constraints
  210. 24.91 s >
  211. 24.91 s > test result: FAILED. 0 passed; 1 failed; 0 ignored; 0 measured; 127 filtered out; finished in 0.00s
  212. 24.91 s >
  213. 24.92 s > stderr ---
  214. 24.92 s >
  215. 24.92 s > thread 'tests::test_graph_structural_axis_merge_preserves_edge_positions_and_constraints' (921) panicked at crates/linnest/src/tests.rs:1721:32:
  216. 24.92 s > no entry found for key
  217. 24.92 s > stack backtrace:
  218. 24.92 s > 0: __rustc::rust_begin_unwind
  219. 24.92 s > 1: core::panicking::panic_fmt
  220. 24.92 s > 2: core::option::expect_failed
  221. 24.92 s > 3: linnest::tests::test_graph_structural_axis_merge_preserves_edge_positions_and_constraints
  222. 24.92 s > 4: <linnest::tests::test_graph_structural_axis_merge_preserves_edge_positions_and_constraints::{closure#0} as core::ops::function::FnOnce<()>>::call_once
  223. 24.92 s > note: Some details are omitted, run with `RUST_BACKTRACE=full` for a verbose backtrace.
  224. 24.92 s >
  225. 24.92 s > ------------
  226. 24.92 s > Summary [ 0.180s] 128 tests run: 127 passed, 1 failed, 0 skipped
  227. 24.92 s > FAIL [ 0.017s] (101/128) linnest tests::test_graph_structural_axis_merge_preserves_edge_positions_and_constraints
  228. 24.92 s > stdout ---
  229. 24.92 s >
  230. 24.92 s > running 1 test
  231. 24.92 s > test tests::test_graph_structural_axis_merge_preserves_edge_positions_and_constraints ... FAILED
  232. 24.92 s >
  233. 24.92 s > failures:
  234. 24.92 s >
  235. 24.92 s > failures:
  236. 24.92 s > tests::test_graph_structural_axis_merge_preserves_edge_positions_and_constraints
  237. 24.92 s >
  238. 24.92 s > test result: FAILED. 0 passed; 1 failed; 0 ignored; 0 measured; 127 filtered out; finished in 0.00s
  239. 24.92 s >
  240. 24.92 s > stderr ---
  241. 24.92 s >
  242. 24.92 s > thread 'tests::test_graph_structural_axis_merge_preserves_edge_positions_and_constraints' (921) panicked at crates/linnest/src/tests.rs:1721:32:
  243. 24.92 s > no entry found for key
  244. 24.92 s > stack backtrace:
  245. 24.92 s > 0: __rustc::rust_begin_unwind
  246. 24.92 s > 1: core::panicking::panic_fmt
  247. 24.92 s > 2: core::option::expect_failed
  248. 24.92 s > 3: linnest::tests::test_graph_structural_axis_merge_preserves_edge_positions_and_constraints
  249. 24.92 s > 4: <linnest::tests::test_graph_structural_axis_merge_preserves_edge_positions_and_constraints::{closure#0} as core::ops::function::FnOnce<()>>::call_once
  250. 24.92 s > note: Some details are omitted, run with `RUST_BACKTRACE=full` for a verbose backtrace.
  251. 24.92 s >
  252. 24.92 s > error: test run failed
  253. 24.92 s >
  254. 24.92 s > ========== nextest test summary ==========
  255. 24.92 s > report: target/nextest/ci_gammaloop/junit.xml
  256. 24.92 s > tests: 128, failures: 1, errors: 0
  257. 24.92 s >
  258. 24.92 s > 1. linnest::tests::test_graph_structural_axis_merge_preserves_edge_positions_and_constraints
  259. 24.92 s > failure: test failure with exit code 101
  260. 24.92 s > thread 'tests::test_graph_structural_axis_merge_preserves_edge_positions_and_constraints' (921) panicked at crates/linnest/src/tests.rs:1721:32:
  261. 24.92 s > no entry found for key
  262. 24.92 s > stack backtrace:
  263. 24.92 s > 0: __rustc::rust_begin_unwind
  264. 24.92 s > 1: core::panicking::panic_fmt
  265. 24.92 s > 2: core::option::expect_failed
  266. 24.92 s > 3: linnest::tests::test_graph_structural_axis_merge_preserves_edge_positions_and_constraints
  267. 24.92 s > 4: <linnest::tests::test_graph_structural_axis_merge_preserves_edge_positions_and_constraints::{closure#0} as core::ops::function::FnOnce<()>>::call_once
  268. 24.92 s > note: Some details are omitted, run with `RUST_BACKTRACE=full` for a verbose backtrace.
  269. 24.92 s > system-out
  270. 24.92 s > running 1 test
  271. 24.92 s > test tests::test_graph_structural_axis_merge_preserves_edge_positions_and_constraints ... FAILED
  272. 24.92 s >
  273. 24.92 s > failures:
  274. 24.92 s >
  275. 24.92 s > failures:
  276. 24.92 s > tests::test_graph_structural_axis_merge_preserves_edge_positions_and_constraints
  277. 24.92 s >
  278. 24.92 s > test result: FAILED. 0 passed; 1 failed; 0 ignored; 0 measured; 127 filtered out; finished in 0.00s
  279. 24.92 s > system-err
  280. 24.92 s > thread 'tests::test_graph_structural_axis_merge_preserves_edge_positions_and_constraints' (921) panicked at crates/linnest/src/tests.rs:1721:32:
  281. 24.92 s > no entry found for key
  282. 24.92 s > stack backtrace:
  283. 24.92 s > 0: __rustc::rust_begin_unwind
  284. 24.92 s > 1: core::panicking::panic_fmt
  285. 24.92 s > 2: core::option::expect_failed
  286. 24.92 s > 3: linnest::tests::test_graph_structural_axis_merge_preserves_edge_positions_and_constraints
  287. 24.92 s > 4: <linnest::tests::test_graph_structural_axis_merge_preserves_edge_positions_and_constraints::{closure#0} as core::ops::function::FnOnce<()>>::call_once
  288. 24.92 s > note: Some details are omitted, run with `RUST_BACKTRACE=full` for a verbose backtrace.
  289. 24.92 s > =========================================
  290. 24.92 s For full logs, run:
  291. 24.92 s nix log /nix/store/3a6s86hhbf2g1hgbkmcq3zdrmaha78qr-gammaloop-nextest-linnet.drv
  292. 25.07 s [0 built (1 failed)]Run failed.