1. 0.00 s $ /nix/store/9ypz3flqsrl5xl495mm8h645gadjsxi1-coreutils-9.11/bin/timeout --kill-after=15s 7200s /nix/store/23zk8sgzamrbmj1fday15szf7f2279s8-nix-2.34.7/bin/nix --extra-experimental-features nix-command --extra-experimental-features flakes flake clone git+https://github.com/alphal00p/gammaloop --dest /tmp/nix-ci-worker/stable-pwd/repo/
  2. 0.16 s Cloning into '/tmp/nix-ci-worker/stable-pwd/repo'...
  3. 0.89 s remote: Enumerating objects: 87750, done.
  4. 1.01 s remote: Counting objects: 0% (1/10348) remote: Counting objects: 1% (104/10348) remote: Counting objects: 2% (207/10348) remote: Counting objects: 3% (311/10348) remote: Counting objects: 4% (414/10348) remote: Counting objects: 5% (518/10348) remote: Counting objects: 6% (621/10348) remote: Counting objects: 7% (725/10348) remote: Counting objects: 8% (828/10348) remote: Counting objects: 9% (932/10348) remote: Counting objects: 10% (1035/10348) remote: Counting objects: 11% (1139/10348) remote: Counting objects: 12% (1242/10348) remote: Counting objects: 13% (1346/10348) remote: Counting objects: 14% (1449/10348) remote: Counting objects: 15% (1553/10348) remote: Counting objects: 16% (1656/10348) remote: Counting objects: 17% (1760/10348) remote: Counting objects: 18% (1863/10348) remote: Counting objects: 19% (1967/10348) remote: Counting objects: 20% (2070/10348) remote: Counting objects: 21% (2174/10348) remote: Counting objects: 22% (2277/10348) remote: Counting objects: 23% (2381/10348) remote: Counting objects: 24% (2484/10348) remote: Counting objects: 25% (2587/10348) remote: Counting objects: 26% (2691/10348) remote: Counting objects: 27% (2794/10348) remote: Counting objects: 28% (2898/10348) remote: Counting objects: 29% (3001/10348) remote: Counting objects: 30% (3105/10348) remote: Counting objects: 31% (3208/10348) remote: Counting objects: 32% (3312/10348) remote: Counting objects: 33% (3415/10348) remote: Counting objects: 34% (3519/10348) remote: Counting objects: 35% (3622/10348) remote: Counting objects: 36% (3726/10348) remote: Counting objects: 37% (3829/10348) remote: Counting objects: 38% (3933/10348) remote: Counting objects: 39% (4036/10348) remote: Counting objects: 40% (4140/10348) remote: Counting objects: 41% (4243/10348) remote: Counting objects: 42% (4347/10348) remote: Counting objects: 43% (4450/10348) remote: Counting objects: 44% (4554/10348) remote: Counting objects: 45% (4657/10348) remote: Counting objects: 46% (4761/10348) remote: Counting objects: 47% (4864/10348) remote: Counting objects: 48% (4968/10348) remote: Counting objects: 49% (5071/10348) remote: Counting objects: 50% (5174/10348) remote: Counting objects: 51% (5278/10348) remote: Counting objects: 52% (5381/10348) remote: Counting objects: 53% (5485/10348) remote: Counting objects: 54% (5588/10348) remote: Counting objects: 55% (5692/10348) remote: Counting objects: 56% (5795/10348) remote: Counting objects: 57% (5899/10348) remote: Counting objects: 58% (6002/10348) remote: Counting objects: 59% (6106/10348) remote: Counting objects: 60% (6209/10348) remote: Counting objects: 61% (6313/10348) remote: Counting objects: 62% (6416/10348) remote: Counting objects: 63% (6520/10348) remote: Counting objects: 64% (6623/10348) remote: Counting objects: 65% (6727/10348) remote: Counting objects: 66% (6830/10348) remote: Counting objects: 67% (6934/10348) remote: Counting objects: 68% (7037/10348) remote: Counting objects: 69% (7141/10348) remote: Counting objects: 70% (7244/10348) remote: Counting objects: 71% (7348/10348) remote: Counting objects: 72% (7451/10348) remote: Counting objects: 73% (7555/10348) remote: Counting objects: 74% (7658/10348) remote: Counting objects: 75% (7761/10348) remote: Counting objects: 76% (7865/10348) remote: Counting objects: 77% (7968/10348) remote: Counting objects: 78% (8072/10348) remote: Counting objects: 79% (8175/10348) remote: Counting objects: 80% (8279/10348) remote: Counting objects: 81% (8382/10348) remote: Counting objects: 82% (8486/10348) remote: Counting objects: 83% (8589/10348) remote: Counting objects: 84% (8693/10348) remote: Counting objects: 85% (8796/10348) remote: Counting objects: 86% (8900/10348) remote: Counting objects: 87% (9003/10348) remote: Counting objects: 88% (9107/10348) remote: Counting objects: 89% (9210/10348) remote: Counting objects: 90% (9314/10348) remote: Counting objects: 91% (9417/10348) remote: Counting objects: 92% (9521/10348) remote: Counting objects: 93% (9624/10348) remote: Counting objects: 94% (9728/10348) remote: Counting objects: 95% (9831/10348) remote: Counting objects: 96% (9935/10348) remote: Counting objects: 97% (10038/10348) remote: Counting objects: 98% (10142/10348) remote: Counting objects: 99% (10245/10348) remote: Counting objects: 100% (10348/10348) remote: Counting objects: 100% (10348/10348), done.
  5. 3.60 s remote: Compressing objects: 0% (1/2800) remote: Compressing objects: 1% (28/2800) remote: Compressing objects: 2% (56/2800) remote: Compressing objects: 3% (84/2800) remote: Compressing objects: 4% (112/2800) remote: Compressing objects: 5% (140/2800) remote: Compressing objects: 6% (168/2800) remote: Compressing objects: 7% (196/2800) remote: Compressing objects: 8% (224/2800) remote: Compressing objects: 9% (252/2800) remote: Compressing objects: 10% (280/2800) remote: Compressing objects: 11% (308/2800) remote: Compressing objects: 12% (336/2800) remote: Compressing objects: 13% (364/2800) remote: Compressing objects: 14% (392/2800) remote: Compressing objects: 15% (420/2800) remote: Compressing objects: 16% (448/2800) remote: Compressing objects: 17% (476/2800) remote: Compressing objects: 18% (504/2800) remote: Compressing objects: 19% (532/2800) remote: Compressing objects: 19% (547/2800) remote: Compressing objects: 20% (560/2800) remote: Compressing objects: 21% (588/2800) remote: Compressing objects: 22% (616/2800) remote: Compressing objects: 23% (644/2800) remote: Compressing objects: 24% (672/2800) remote: Compressing objects: 25% (700/2800) remote: Compressing objects: 25% (708/2800) remote: Compressing objects: 26% (728/2800) remote: Compressing objects: 27% (756/2800) remote: Compressing objects: 28% (784/2800) remote: Compressing objects: 29% (812/2800) remote: Compressing objects: 30% (840/2800) remote: Compressing objects: 31% (868/2800) remote: Compressing objects: 32% (896/2800) remote: Compressing objects: 33% (924/2800) remote: Compressing objects: 34% (952/2800) remote: Compressing objects: 35% (980/2800) remote: Compressing objects: 36% (1008/2800) remote: Compressing objects: 37% (1036/2800) remote: Compressing objects: 38% (1064/2800) remote: Compressing objects: 39% (1092/2800) remote: Compressing objects: 40% (1120/2800) remote: Compressing objects: 41% (1148/2800) remote: Compressing objects: 42% (1176/2800) remote: Compressing objects: 43% (1204/2800) remote: Compressing objects: 44% (1232/2800) remote: Compressing objects: 45% (1260/2800) remote: Compressing objects: 46% (1288/2800) remote: Compressing objects: 47% (1316/2800) remote: Compressing objects: 48% (1344/2800) remote: Compressing objects: 49% (1372/2800) remote: Compressing objects: 50% (1400/2800) remote: Compressing objects: 51% (1428/2800) remote: Compressing objects: 52% (1456/2800) remote: Compressing objects: 53% (1484/2800) remote: Compressing objects: 54% (1512/2800) remote: Compressing objects: 55% (1540/2800) remote: Compressing objects: 56% (1568/2800) remote: Compressing objects: 57% (1596/2800) remote: Compressing objects: 58% (1624/2800) remote: Compressing objects: 59% (1652/2800) remote: Compressing objects: 60% (1680/2800) remote: Compressing objects: 61% (1708/2800) remote: Compressing objects: 62% (1736/2800) remote: Compressing objects: 63% (1764/2800) remote: Compressing objects: 64% (1792/2800) remote: Compressing objects: 65% (1820/2800) remote: Compressing objects: 66% (1848/2800) remote: Compressing objects: 67% (1876/2800) remote: Compressing objects: 68% (1904/2800) remote: Compressing objects: 69% (1932/2800) remote: Compressing objects: 70% (1960/2800) remote: Compressing objects: 71% (1988/2800) remote: Compressing objects: 72% (2016/2800) remote: Compressing objects: 73% (2044/2800) remote: Compressing objects: 74% (2072/2800) remote: Compressing objects: 75% (2100/2800) remote: Compressing objects: 76% (2128/2800) remote: Compressing objects: 77% (2156/2800) remote: Compressing objects: 78% (2184/2800) remote: Compressing objects: 79% (2212/2800) remote: Compressing objects: 80% (2240/2800) remote: Compressing objects: 81% (2268/2800) remote: Compressing objects: 82% (2296/2800) remote: Compressing objects: 83% (2324/2800) remote: Compressing objects: 84% (2352/2800) remote: Compressing objects: 85% (2380/2800) remote: Compressing objects: 86% (2408/2800) remote: Compressing objects: 87% (2436/2800) remote: Compressing objects: 88% (2464/2800) remote: Compressing objects: 89% (2492/2800) remote: Compressing objects: 90% (2520/2800) remote: Compressing objects: 91% (2548/2800) remote: Compressing objects: 92% (2576/2800) remote: Compressing objects: 93% (2604/2800) remote: Compressing objects: 94% (2632/2800) remote: Compressing objects: 95% (2660/2800) remote: Compressing objects: 96% (2688/2800) remote: Compressing objects: 97% (2716/2800) remote: Compressing objects: 98% (2744/2800) remote: Compressing objects: 99% (2772/2800) remote: Compressing objects: 100% (2800/2800) remote: Compressing objects: 100% (2800/2800), done.
  6. 8.88 s Receiving objects: 0% (1/87750) Receiving objects: 1% (878/87750) Receiving objects: 2% (1755/87750) Receiving objects: 3% (2633/87750) Receiving objects: 4% (3510/87750) Receiving objects: 5% (4388/87750) Receiving objects: 6% (5265/87750) Receiving objects: 7% (6143/87750) Receiving objects: 8% (7020/87750) Receiving objects: 9% (7898/87750), 11.37 MiB | 22.72 MiB/s Receiving objects: 10% (8775/87750), 11.37 MiB | 22.72 MiB/s Receiving objects: 11% (9653/87750), 11.37 MiB | 22.72 MiB/s Receiving objects: 12% (10530/87750), 11.37 MiB | 22.72 MiB/s Receiving objects: 13% (11408/87750), 11.37 MiB | 22.72 MiB/s Receiving objects: 14% (12285/87750), 11.37 MiB | 22.72 MiB/s Receiving objects: 15% (13163/87750), 11.37 MiB | 22.72 MiB/s Receiving objects: 16% (14040/87750), 11.37 MiB | 22.72 MiB/s Receiving objects: 17% (14918/87750), 11.37 MiB | 22.72 MiB/s Receiving objects: 18% (15795/87750), 11.37 MiB | 22.72 MiB/s Receiving objects: 19% (16673/87750), 11.37 MiB | 22.72 MiB/s Receiving objects: 20% (17550/87750), 11.37 MiB | 22.72 MiB/s Receiving objects: 21% (18428/87750), 11.37 MiB | 22.72 MiB/s Receiving objects: 22% (19305/87750), 11.37 MiB | 22.72 MiB/s Receiving objects: 23% (20183/87750), 11.37 MiB | 22.72 MiB/s Receiving objects: 24% (21060/87750), 11.37 MiB | 22.72 MiB/s Receiving objects: 25% (21938/87750), 11.37 MiB | 22.72 MiB/s Receiving objects: 26% (22815/87750), 11.37 MiB | 22.72 MiB/s Receiving objects: 27% (23693/87750), 11.37 MiB | 22.72 MiB/s Receiving objects: 28% (24570/87750), 11.37 MiB | 22.72 MiB/s Receiving objects: 29% (25448/87750), 11.37 MiB | 22.72 MiB/s Receiving objects: 30% (26325/87750), 11.37 MiB | 22.72 MiB/s Receiving objects: 31% (27203/87750), 11.37 MiB | 22.72 MiB/s Receiving objects: 32% (28080/87750), 11.37 MiB | 22.72 MiB/s Receiving objects: 33% (28958/87750), 11.37 MiB | 22.72 MiB/s Receiving objects: 34% (29835/87750), 11.37 MiB | 22.72 MiB/s Receiving objects: 35% (30713/87750), 11.37 MiB | 22.72 MiB/s Receiving objects: 35% (31445/87750), 11.37 MiB | 22.72 MiB/s Receiving objects: 36% (31590/87750), 29.41 MiB | 29.40 MiB/s Receiving objects: 37% (32468/87750), 29.41 MiB | 29.40 MiB/s Receiving objects: 38% (33345/87750), 29.41 MiB | 29.40 MiB/s Receiving objects: 39% (34223/87750), 29.41 MiB | 29.40 MiB/s Receiving objects: 40% (35100/87750), 29.41 MiB | 29.40 MiB/s Receiving objects: 41% (35978/87750), 29.41 MiB | 29.40 MiB/s Receiving objects: 42% (36855/87750), 29.41 MiB | 29.40 MiB/s Receiving objects: 43% (37733/87750), 29.41 MiB | 29.40 MiB/s Receiving objects: 44% (38610/87750), 29.41 MiB | 29.40 MiB/s Receiving objects: 45% (39488/87750), 29.41 MiB | 29.40 MiB/s Receiving objects: 46% (40365/87750), 45.68 MiB | 30.44 MiB/s Receiving objects: 47% (41243/87750), 45.68 MiB | 30.44 MiB/s Receiving objects: 48% (42120/87750), 45.68 MiB | 30.44 MiB/s Receiving objects: 49% (42998/87750), 45.68 MiB | 30.44 MiB/s Receiving objects: 50% (43875/87750), 45.68 MiB | 30.44 MiB/s Receiving objects: 51% (44753/87750), 45.68 MiB | 30.44 MiB/s Receiving objects: 52% (45630/87750), 45.68 MiB | 30.44 MiB/s Receiving objects: 53% (46508/87750), 45.68 MiB | 30.44 MiB/s Receiving objects: 54% (47385/87750), 45.68 MiB | 30.44 MiB/s Receiving objects: 55% (48263/87750), 45.68 MiB | 30.44 MiB/s Receiving objects: 55% (48424/87750), 45.68 MiB | 30.44 MiB/s Receiving objects: 56% (49140/87750), 61.21 MiB | 30.60 MiB/s Receiving objects: 57% (50018/87750), 61.21 MiB | 30.60 MiB/s Receiving objects: 58% (50895/87750), 61.21 MiB | 30.60 MiB/s Receiving objects: 59% (51773/87750), 61.21 MiB | 30.60 MiB/s Receiving objects: 60% (52650/87750), 61.21 MiB | 30.60 MiB/s Receiving objects: 61% (53528/87750), 61.21 MiB | 30.60 MiB/s Receiving objects: 62% (54405/87750), 77.55 MiB | 30.60 MiB/s Receiving objects: 63% (55283/87750), 77.55 MiB | 30.60 MiB/s Receiving objects: 64% (56160/87750), 77.55 MiB | 30.60 MiB/s Receiving objects: 65% (57038/87750), 77.55 MiB | 30.60 MiB/s Receiving objects: 65% (57330/87750), 94.47 MiB | 31.13 MiB/s Receiving objects: 66% (57915/87750), 94.47 MiB | 31.13 MiB/s Receiving objects: 67% (58793/87750), 94.47 MiB | 31.13 MiB/s Receiving objects: 68% (59670/87750), 94.47 MiB | 31.13 MiB/s Receiving objects: 69% (60548/87750), 110.34 MiB | 31.23 MiB/s Receiving objects: 70% (61425/87750), 110.34 MiB | 31.23 MiB/s Receiving objects: 71% (62303/87750), 110.34 MiB | 31.23 MiB/s Receiving objects: 72% (63180/87750), 110.34 MiB | 31.23 MiB/s Receiving objects: 73% (64058/87750), 110.34 MiB | 31.23 MiB/s Receiving objects: 73% (64272/87750), 125.85 MiB | 31.17 MiB/s Receiving objects: 74% (64935/87750), 125.85 MiB | 31.17 MiB/s Receiving objects: 75% (65813/87750), 125.85 MiB | 31.17 MiB/s Receiving objects: 76% (66690/87750), 125.85 MiB | 31.17 MiB/s Receiving objects: 77% (67568/87750), 125.85 MiB | 31.17 MiB/s Receiving objects: 78% (68445/87750), 125.85 MiB | 31.17 MiB/s Receiving objects: 79% (69323/87750), 125.85 MiB | 31.17 MiB/s Receiving objects: 80% (70200/87750), 125.85 MiB | 31.17 MiB/s Receiving objects: 81% (71078/87750), 125.85 MiB | 31.17 MiB/s Receiving objects: 82% (71955/87750), 125.85 MiB | 31.17 MiB/s Receiving objects: 83% (72833/87750), 125.85 MiB | 31.17 MiB/s Receiving objects: 84% (73710/87750), 125.85 MiB | 31.17 MiB/s Receiving objects: 85% (74588/87750), 142.72 MiB | 31.45 MiB/s Receiving objects: 86% (75465/87750), 142.72 MiB | 31.45 MiB/s Receiving objects: 87% (76343/87750), 142.72 MiB | 31.45 MiB/s Receiving objects: 88% (77220/87750), 142.72 MiB | 31.45 MiB/s Receiving objects: 89% (78098/87750), 142.72 MiB | 31.45 MiB/s Receiving objects: 90% (78975/87750), 142.72 MiB | 31.45 MiB/s Receiving objects: 91% (79853/87750), 142.72 MiB | 31.45 MiB/s Receiving objects: 92% (80730/87750), 142.72 MiB | 31.45 MiB/s Receiving objects: 93% (81608/87750), 142.72 MiB | 31.45 MiB/s Receiving objects: 94% (82485/87750), 142.72 MiB | 31.45 MiB/s Receiving objects: 95% (83363/87750), 142.72 MiB | 31.45 MiB/s Receiving objects: 96% (84240/87750), 142.72 MiB | 31.45 MiB/s Receiving objects: 97% (85118/87750), 142.72 MiB | 31.45 MiB/s Receiving objects: 98% (85995/87750), 142.72 MiB | 31.45 MiB/s Receiving objects: 98% (86255/87750), 142.72 MiB | 31.45 MiB/s Receiving objects: 99% (86873/87750), 159.41 MiB | 32.34 MiB/s remote: Total 87750 (delta 8554), reused 8179 (delta 7522), pack-reused 77402 (from 3)
  7. 8.88 s Receiving objects: 100% (87750/87750), 159.41 MiB | 32.34 MiB/s Receiving objects: 100% (87750/87750), 167.18 MiB | 31.67 MiB/s, done.
  8. 11.35 s Resolving deltas: 0% (0/59419) Resolving deltas: 1% (595/59419) Resolving deltas: 2% (1189/59419) Resolving deltas: 3% (1784/59419) Resolving deltas: 4% (2377/59419) Resolving deltas: 5% (2971/59419) Resolving deltas: 6% (3566/59419) Resolving deltas: 7% (4160/59419) Resolving deltas: 8% (4754/59419) Resolving deltas: 9% (5348/59419) Resolving deltas: 10% (5942/59419) Resolving deltas: 11% (6537/59419) Resolving deltas: 12% (7131/59419) Resolving deltas: 13% (7725/59419) Resolving deltas: 14% (8319/59419) Resolving deltas: 15% (8913/59419) Resolving deltas: 16% (9509/59419) Resolving deltas: 17% (10102/59419) Resolving deltas: 18% (10697/59419) Resolving deltas: 19% (11290/59419) Resolving deltas: 20% (11884/59419) Resolving deltas: 21% (12478/59419) Resolving deltas: 22% (13073/59419) Resolving deltas: 23% (13667/59419) Resolving deltas: 24% (14261/59419) Resolving deltas: 25% (14855/59419) Resolving deltas: 26% (15449/59419) Resolving deltas: 27% (16044/59419) Resolving deltas: 28% (16638/59419) Resolving deltas: 29% (17232/59419) Resolving deltas: 30% (17826/59419) Resolving deltas: 31% (18420/59419) Resolving deltas: 32% (19015/59419) Resolving deltas: 33% (19609/59419) Resolving deltas: 34% (20204/59419) Resolving deltas: 35% (20797/59419) Resolving deltas: 36% (21391/59419) Resolving deltas: 37% (21986/59419) Resolving deltas: 38% (22580/59419) Resolving deltas: 39% (23174/59419) Resolving deltas: 40% (23768/59419) Resolving deltas: 41% (24362/59419) Resolving deltas: 42% (24956/59419) Resolving deltas: 43% (25551/59419) Resolving deltas: 44% (26146/59419) Resolving deltas: 45% (26739/59419) Resolving deltas: 46% (27333/59419) Resolving deltas: 47% (27927/59419) Resolving deltas: 48% (28522/59419) Resolving deltas: 49% (29116/59419) Resolving deltas: 50% (29710/59419) Resolving deltas: 51% (30304/59419) Resolving deltas: 52% (30898/59419) Resolving deltas: 53% (31493/59419) Resolving deltas: 54% (32087/59419) Resolving deltas: 54% (32327/59419) Resolving deltas: 55% (32681/59419) Resolving deltas: 56% (33275/59419) Resolving deltas: 57% (33869/59419) Resolving deltas: 58% (34464/59419) Resolving deltas: 59% (35058/59419) Resolving deltas: 60% (35652/59419) Resolving deltas: 61% (36246/59419) Resolving deltas: 62% (36840/59419) Resolving deltas: 63% (37434/59419) Resolving deltas: 64% (38029/59419) Resolving deltas: 65% (38623/59419) Resolving deltas: 66% (39217/59419) Resolving deltas: 67% (39811/59419) Resolving deltas: 68% (40405/59419) Resolving deltas: 69% (41000/59419) Resolving deltas: 70% (41594/59419) Resolving deltas: 71% (42188/59419) Resolving deltas: 72% (42782/59419) Resolving deltas: 73% (43376/59419) Resolving deltas: 74% (43971/59419) Resolving deltas: 75% (44565/59419) Resolving deltas: 76% (45159/59419) Resolving deltas: 77% (45753/59419) Resolving deltas: 78% (46347/59419) Resolving deltas: 79% (46942/59419) Resolving deltas: 79% (47467/59419) Resolving deltas: 80% (47536/59419) Resolving deltas: 81% (48130/59419) Resolving deltas: 82% (48724/59419) Resolving deltas: 83% (49318/59419) Resolving deltas: 84% (49912/59419) Resolving deltas: 85% (50507/59419) Resolving deltas: 86% (51101/59419) Resolving deltas: 87% (51695/59419) Resolving deltas: 88% (52289/59419) Resolving deltas: 89% (52883/59419) Resolving deltas: 90% (53478/59419) Resolving deltas: 91% (54072/59419) Resolving deltas: 92% (54666/59419) Resolving deltas: 93% (55260/59419) Resolving deltas: 94% (55855/59419) Resolving deltas: 95% (56449/59419) Resolving deltas: 96% (57043/59419) Resolving deltas: 97% (57637/59419) Resolving deltas: 98% (58231/59419) Resolving deltas: 99% (58825/59419) Resolving deltas: 100% (59419/59419) Resolving deltas: 100% (59419/59419), done.
  9. 11.96 s Fetching commit 8ecfe383f31edc9471a94db42a1bce8122dd3b6a for docs ...
  10. 11.96 s $ /nix/store/bcnisk3ydfgv26v2gw3zlky24g00yww2-git-2.54.0/bin/git fetch origin 8ecfe383f31edc9471a94db42a1bce8122dd3b6a
  11. 12.46 s From https://github.com/alphal00p/gammaloop
  12. 12.46 s * branch 8ecfe383f31edc9471a94db42a1bce8122dd3b6a -> FETCH_HEAD
  13. 12.51 s $ /nix/store/9ypz3flqsrl5xl495mm8h645gadjsxi1-coreutils-9.11/bin/timeout --kill-after=15s 7200s /nix/store/bcnisk3ydfgv26v2gw3zlky24g00yww2-git-2.54.0/bin/git -c advice.detachedHead=false checkout 8ecfe383f31edc9471a94db42a1bce8122dd3b6a
  14. 12.89 s HEAD is now at 8ecfe383f support jj docs builds and warn on scope drift during watch
  15. 12.92 s $ /nix/store/9ypz3flqsrl5xl495mm8h645gadjsxi1-coreutils-9.11/bin/timeout --kill-after=15s 7200s /nix/store/23zk8sgzamrbmj1fday15szf7f2279s8-nix-2.34.7/bin/nix --extra-experimental-features nix-command --extra-experimental-features flakes --log-format internal-json run .#packages.x86_64-linux.nix-ci-check-gammaloop-nextest-linnet --print-build-logs
  16. 18.52 s
  17. 18.67 s Downloading cached gammaloop-nextest-binaries-linnet-linnest from https://cache.nix-ci.com
  18. 18.67 s Downloading cached gammaloop-nextest-binaries-linnet-linnet from https://cache.nix-ci.com
  19. 18.67 s Downloading cached gammaloop-nextest-binaries-linnet-kurvst from https://cache.nix-ci.com
  20. 18.67 s Downloading cached gammaloop-nextest-binaries-linnet-linnet-py from https://cache.nix-ci.com
  21. 19.02 s Downloaded cached gammaloop-nextest-binaries-linnet-kurvst (3.2 MiB) in 347ms
  22. 19.02 s Progress: 0 of 1 built, 1 of 6 downloaded from cache (3 downloading)
  23. 19.28 s Downloaded cached gammaloop-nextest-binaries-linnet-linnest (7.4 MiB) in 616ms
  24. 19.28 s Progress: 0 of 1 built, 2 of 6 downloaded from cache (2 downloading)
  25. 20.06 s Downloaded cached gammaloop-nextest-binaries-linnet-linnet (20.5 MiB) in 1.3s
  26. 20.06 s Progress: 0 of 1 built, 3 of 6 downloaded from cache (1 downloading)
  27. 20.93 s Downloaded cached gammaloop-nextest-binaries-linnet-linnet-py (37 MiB) in 2.2s
  28. 20.93 s Progress: 0 of 1 built, 4 of 6 downloaded from cache
  29. 20.93 s Downloading cached gammaloop-nextest-binaries-linnet from https://cache.nix-ci.com
  30. 20.99 s Downloaded cached gammaloop-nextest-binaries-linnet (1512 B) in 62ms
  31. 20.99 s Progress: 0 of 1 built, 5 of 6 downloaded from cache
  32. 20.99 s Downloading cached nix-ci-check-gammaloop-nextest-linnet from https://cache.nix-ci.com
  33. 21.06 s Downloaded cached nix-ci-check-gammaloop-nextest-linnet (1016 B) in 66ms
  34. 21.06 s Progress: 0 of 1 built, 6 of 6 downloaded from cache
  35. 27.07 s evaluating derivation 'g copying '/nix/store/wlg6 evaluating derivation 'g copying '/nix/store/wlg6 evaluating derivation 'g querying gammaloop-nexte [0.0 KiB DL] querying ne [0/2 built, 0.0 KiB DL] [1/0/2 built, 0.0 KiB DLnextest-failure-summary (post)> Uploading to the NixCI cache: /nix/store/k26rsmcl60phb0zkfwz7h6z78qxfkbh3-nextest-failure-summary
  36. 27.45 s nextest-failure-summary (post)> warning: 'warn-short-path-literals' is deprecated, use 'lint-short-path-literals = ignore' instead
  37. 27.64 s nextest-failure-summary (post)> copying 1 paths...
  38. 27.64 s nextest-failure-summary (post)> copying path '/nix/store/k26rsmcl60phb0zkfwz7h6z78qxfkbh3-nextest-failure-summary' to 'https://cache.nix-ci.com'...
  39. 28.44 s nextest-failure-summary (post)> warning: 'warn-short-path-literals' is deprecated, use 'lint-short-path-literals = ignore' instead
  40. 28.86 s nextest-failure-summary (post)> copying 1 paths...
  41. 28.86 s nextest-failure-summary (post)> copying path '/nix/store/jsg1lld746ry77njisi6ziskr7smcpba-nextest-failure-summary.drv' to 'https://cache.nix-ci.com'...
  42. 29.83 s [1/3 built, 0.0 KiB DL] [1/1/2 built, 0.0 KiB DLgammaloop-nextest-linnet> Extracting 2 binaries (including 1 non-test binary) to /build/source
  43. 29.89 s gammaloop-nextest-linnet> Extracted 6 files to /build/source in 0.06s
  44. 29.91 s gammaloop-nextest-linnet> ------------
  45. 29.91 s gammaloop-nextest-linnet> Nextest run ID 68fbd3aa-e9fc-43e5-909b-fa497524fb84 with nextest profile: ci_gammaloop
  46. 29.91 s gammaloop-nextest-linnet> Starting 24 tests across 1 binary
  47. 29.95 s gammaloop-nextest-linnet> ------------
  48. 29.95 s gammaloop-nextest-linnet> Summary [ 0.036s] 24 tests run: 24 passed, 0 skipped
  49. 30.09 s gammaloop-nextest-linnet>
  50. 30.09 s gammaloop-nextest-linnet> ========== nextest test summary ==========
  51. 30.09 s gammaloop-nextest-linnet> report: target/nextest/ci_gammaloop/junit.xml
  52. 30.09 s gammaloop-nextest-linnet> tests: 24, failures: 0, errors: 0
  53. 30.09 s gammaloop-nextest-linnet> No failing testcases found.
  54. 30.09 s gammaloop-nextest-linnet> =========================================
  55. 30.11 s gammaloop-nextest-linnet> Extracting 2 binaries (including 1 non-test binary) and 1 linked path to /build/source
  56. 30.30 s gammaloop-nextest-linnet> Extracted 9 files to /build/source in 0.18s
  57. 30.32 s gammaloop-nextest-linnet> ------------
  58. 30.32 s gammaloop-nextest-linnet> Nextest run ID 821a5d23-f648-4d1d-a950-c72214c6fd3d with nextest profile: ci_gammaloop
  59. 30.32 s gammaloop-nextest-linnet> Starting 183 tests across 1 binary
  60. 30.66 s gammaloop-nextest-linnet> ------------
  61. 30.66 s gammaloop-nextest-linnet> Summary [ 0.336s] 183 tests run: 183 passed, 0 skipped
  62. 30.71 s gammaloop-nextest-linnet>
  63. 30.71 s gammaloop-nextest-linnet> ========== nextest test summary ==========
  64. 30.71 s gammaloop-nextest-linnet> report: target/nextest/ci_gammaloop/junit.xml
  65. 30.71 s gammaloop-nextest-linnet> tests: 183, failures: 0, errors: 0
  66. 30.71 s gammaloop-nextest-linnet> No failing testcases found.
  67. 30.71 s gammaloop-nextest-linnet> =========================================
  68. 30.75 s gammaloop-nextest-linnet> Extracting 4 binaries (including 3 non-test binaries), 1 build script output directory, and 1 linked path to /build/source
  69. 31.11 s gammaloop-nextest-linnet> Extracted 13 files to /build/source in 0.37s
  70. 31.15 s gammaloop-nextest-linnet> ------------
  71. 31.15 s gammaloop-nextest-linnet> Nextest run ID ddb7c2c0-aceb-47d0-91d6-cd56fca62af6 with nextest profile: ci_gammaloop
  72. 31.15 s gammaloop-nextest-linnet> Starting 0 tests across 1 binary
  73. 31.15 s gammaloop-nextest-linnet> ------------
  74. 31.15 s gammaloop-nextest-linnet> Summary [ 0.000s] 0 tests run: 0 passed, 0 skipped
  75. 31.22 s gammaloop-nextest-linnet>
  76. 31.22 s gammaloop-nextest-linnet> ========== nextest test summary ==========
  77. 31.22 s gammaloop-nextest-linnet> report: target/nextest/ci_gammaloop/junit.xml
  78. 31.22 s gammaloop-nextest-linnet> tests: 0, failures: 0, errors: 0
  79. 31.22 s gammaloop-nextest-linnet> No failing testcases found.
  80. 31.22 s gammaloop-nextest-linnet> =========================================
  81. 31.26 s gammaloop-nextest-linnet> Extracting 2 binaries (including 1 non-test binary) and 1 linked path to /build/source
  82. 31.36 s gammaloop-nextest-linnet> Extracted 9 files to /build/source in 0.11s
  83. 31.40 s gammaloop-nextest-linnet> ------------
  84. 31.40 s gammaloop-nextest-linnet> Nextest run ID e6ec4dd6-869c-42dc-8b07-1b5f144909cd with nextest profile: ci_gammaloop
  85. 31.40 s gammaloop-nextest-linnet> Starting 128 tests across 1 binary
  86. 31.69 s gammaloop-nextest-linnet> FAIL [ 0.172s] (128/128) linnest tests::test_graph_structural_axis_merge_preserves_edge_positions_and_constraints
  87. 31.69 s gammaloop-nextest-linnet> stdout ---
  88. 31.69 s gammaloop-nextest-linnet>
  89. 31.69 s gammaloop-nextest-linnet> running 1 test
  90. 31.69 s gammaloop-nextest-linnet> test tests::test_graph_structural_axis_merge_preserves_edge_positions_and_constraints ... FAILED
  91. 31.69 s gammaloop-nextest-linnet>
  92. 31.69 s gammaloop-nextest-linnet> failures:
  93. 31.69 s gammaloop-nextest-linnet>
  94. 31.69 s gammaloop-nextest-linnet> failures:
  95. 31.69 s gammaloop-nextest-linnet> tests::test_graph_structural_axis_merge_preserves_edge_positions_and_constraints
  96. 31.69 s gammaloop-nextest-linnet>
  97. 31.69 s gammaloop-nextest-linnet> test result: FAILED. 0 passed; 1 failed; 0 ignored; 0 measured; 127 filtered out; finished in 0.16s
  98. 31.69 s gammaloop-nextest-linnet>
  99. 31.69 s gammaloop-nextest-linnet> stderr ---
  100. 31.69 s gammaloop-nextest-linnet>
  101. 31.69 s gammaloop-nextest-linnet> thread 'tests::test_graph_structural_axis_merge_preserves_edge_positions_and_constraints' (909) panicked at crates/linnest/src/tests.rs:1721:32:
  102. 31.69 s gammaloop-nextest-linnet> no entry found for key
  103. 31.69 s gammaloop-nextest-linnet> stack backtrace:
  104. 31.69 s gammaloop-nextest-linnet> 0: __rustc::rust_begin_unwind
  105. 31.69 s gammaloop-nextest-linnet> 1: core::panicking::panic_fmt
  106. 31.69 s gammaloop-nextest-linnet> 2: core::option::expect_failed
  107. 31.69 s gammaloop-nextest-linnet> 3: linnest::tests::test_graph_structural_axis_merge_preserves_edge_positions_and_constraints
  108. 31.69 s gammaloop-nextest-linnet> 4: <linnest::tests::test_graph_structural_axis_merge_preserves_edge_positions_and_constraints::{closure#0} as core::ops::function::FnOnce<()>>::call_once
  109. 31.69 s gammaloop-nextest-linnet> note: Some details are omitted, run with `RUST_BACKTRACE=full` for a verbose backtrace.
  110. 31.69 s gammaloop-nextest-linnet>
  111. 31.69 s gammaloop-nextest-linnet> ------------
  112. 31.69 s gammaloop-nextest-linnet> Summary [ 0.284s] 128 tests run: 127 passed, 1 failed, 0 skipped
  113. 31.69 s gammaloop-nextest-linnet> FAIL [ 0.172s] (128/128) linnest tests::test_graph_structural_axis_merge_preserves_edge_positions_and_constraints
  114. 31.69 s gammaloop-nextest-linnet> stdout ---
  115. 31.69 s gammaloop-nextest-linnet>
  116. 31.69 s gammaloop-nextest-linnet> running 1 test
  117. 31.69 s gammaloop-nextest-linnet> test tests::test_graph_structural_axis_merge_preserves_edge_positions_and_constraints ... FAILED
  118. 31.69 s gammaloop-nextest-linnet>
  119. 31.69 s gammaloop-nextest-linnet> failures:
  120. 31.69 s gammaloop-nextest-linnet>
  121. 31.69 s gammaloop-nextest-linnet> failures:
  122. 31.69 s gammaloop-nextest-linnet> tests::test_graph_structural_axis_merge_preserves_edge_positions_and_constraints
  123. 31.69 s gammaloop-nextest-linnet>
  124. 31.69 s gammaloop-nextest-linnet> test result: FAILED. 0 passed; 1 failed; 0 ignored; 0 measured; 127 filtered out; finished in 0.16s
  125. 31.69 s gammaloop-nextest-linnet>
  126. 31.69 s gammaloop-nextest-linnet> stderr ---
  127. 31.69 s gammaloop-nextest-linnet>
  128. 31.69 s gammaloop-nextest-linnet> thread 'tests::test_graph_structural_axis_merge_preserves_edge_positions_and_constraints' (909) panicked at crates/linnest/src/tests.rs:1721:32:
  129. 31.69 s gammaloop-nextest-linnet> no entry found for key
  130. 31.69 s gammaloop-nextest-linnet> stack backtrace:
  131. 31.69 s gammaloop-nextest-linnet> 0: __rustc::rust_begin_unwind
  132. 31.69 s gammaloop-nextest-linnet> 1: core::panicking::panic_fmt
  133. 31.69 s gammaloop-nextest-linnet> 2: core::option::expect_failed
  134. 31.69 s gammaloop-nextest-linnet> 3: linnest::tests::test_graph_structural_axis_merge_preserves_edge_positions_and_constraints
  135. 31.69 s gammaloop-nextest-linnet> 4: <linnest::tests::test_graph_structural_axis_merge_preserves_edge_positions_and_constraints::{closure#0} as core::ops::function::FnOnce<()>>::call_once
  136. 31.69 s gammaloop-nextest-linnet> note: Some details are omitted, run with `RUST_BACKTRACE=full` for a verbose backtrace.
  137. 31.69 s gammaloop-nextest-linnet>
  138. 31.69 s gammaloop-nextest-linnet> error: test run failed
  139. 31.74 s gammaloop-nextest-linnet>
  140. 31.74 s gammaloop-nextest-linnet> ========== nextest test summary ==========
  141. 31.74 s gammaloop-nextest-linnet> report: target/nextest/ci_gammaloop/junit.xml
  142. 31.74 s gammaloop-nextest-linnet> tests: 128, failures: 1, errors: 0
  143. 31.74 s gammaloop-nextest-linnet>
  144. 31.74 s gammaloop-nextest-linnet> 1. linnest::tests::test_graph_structural_axis_merge_preserves_edge_positions_and_constraints
  145. 31.74 s gammaloop-nextest-linnet> failure: test failure with exit code 101
  146. 31.74 s gammaloop-nextest-linnet> thread 'tests::test_graph_structural_axis_merge_preserves_edge_positions_and_constraints' (909) panicked at crates/linnest/src/tests.rs:1721:32:
  147. 31.74 s gammaloop-nextest-linnet> no entry found for key
  148. 31.74 s gammaloop-nextest-linnet> stack backtrace:
  149. 31.74 s gammaloop-nextest-linnet> 0: __rustc::rust_begin_unwind
  150. 31.74 s gammaloop-nextest-linnet> 1: core::panicking::panic_fmt
  151. 31.74 s gammaloop-nextest-linnet> 2: core::option::expect_failed
  152. 31.74 s gammaloop-nextest-linnet> 3: linnest::tests::test_graph_structural_axis_merge_preserves_edge_positions_and_constraints
  153. 31.74 s gammaloop-nextest-linnet> 4: <linnest::tests::test_graph_structural_axis_merge_preserves_edge_positions_and_constraints::{closure#0} as core::ops::function::FnOnce<()>>::call_once
  154. 31.74 s gammaloop-nextest-linnet> note: Some details are omitted, run with `RUST_BACKTRACE=full` for a verbose backtrace.
  155. 31.74 s gammaloop-nextest-linnet> system-out
  156. 31.74 s gammaloop-nextest-linnet> running 1 test
  157. 31.74 s gammaloop-nextest-linnet> test tests::test_graph_structural_axis_merge_preserves_edge_positions_and_constraints ... FAILED
  158. 31.74 s gammaloop-nextest-linnet>
  159. 31.74 s gammaloop-nextest-linnet> failures:
  160. 31.74 s gammaloop-nextest-linnet>
  161. 31.74 s gammaloop-nextest-linnet> failures:
  162. 31.74 s gammaloop-nextest-linnet> tests::test_graph_structural_axis_merge_preserves_edge_positions_and_constraints
  163. 31.74 s gammaloop-nextest-linnet>
  164. 31.74 s gammaloop-nextest-linnet> test result: FAILED. 0 passed; 1 failed; 0 ignored; 0 measured; 127 filtered out; finished in 0.16s
  165. 31.74 s gammaloop-nextest-linnet> system-err
  166. 31.74 s gammaloop-nextest-linnet> thread 'tests::test_graph_structural_axis_merge_preserves_edge_positions_and_constraints' (909) panicked at crates/linnest/src/tests.rs:1721:32:
  167. 31.74 s gammaloop-nextest-linnet> no entry found for key
  168. 31.74 s gammaloop-nextest-linnet> stack backtrace:
  169. 31.74 s gammaloop-nextest-linnet> 0: __rustc::rust_begin_unwind
  170. 31.74 s gammaloop-nextest-linnet> 1: core::panicking::panic_fmt
  171. 31.74 s gammaloop-nextest-linnet> 2: core::option::expect_failed
  172. 31.74 s gammaloop-nextest-linnet> 3: linnest::tests::test_graph_structural_axis_merge_preserves_edge_positions_and_constraints
  173. 31.74 s gammaloop-nextest-linnet> 4: <linnest::tests::test_graph_structural_axis_merge_preserves_edge_positions_and_constraints::{closure#0} as core::ops::function::FnOnce<()>>::call_once
  174. 31.74 s gammaloop-nextest-linnet> note: Some details are omitted, run with `RUST_BACKTRACE=full` for a verbose backtrace.
  175. 31.74 s gammaloop-nextest-linnet> =========================================
  176. 31.86 s [1 built (1 failed), 0.0error: Cannot build '/nix/store/3a6s86hhbf2g1hgbkmcq3zdrmaha78qr-gammaloop-nextest-linnet.drv'.
  177. 31.86 s Reason: builder failed with exit code 100.
  178. 31.86 s Output paths:
  179. 31.86 s /nix/store/v4cbh6ql60kq7xlziivk5va382nw7f4v-gammaloop-nextest-linnet
  180. 31.86 s Last 134 log lines:
  181. 31.86 s > Extracting 2 binaries (including 1 non-test binary) to /build/source
  182. 31.86 s > Extracted 6 files to /build/source in 0.06s
  183. 31.86 s > ------------
  184. 31.86 s > Nextest run ID 68fbd3aa-e9fc-43e5-909b-fa497524fb84 with nextest profile: ci_gammaloop
  185. 31.86 s > Starting 24 tests across 1 binary
  186. 31.86 s > ------------
  187. 31.86 s > Summary [ 0.036s] 24 tests run: 24 passed, 0 skipped
  188. 31.86 s >
  189. 31.86 s > ========== nextest test summary ==========
  190. 31.86 s > report: target/nextest/ci_gammaloop/junit.xml
  191. 31.86 s > tests: 24, failures: 0, errors: 0
  192. 31.86 s > No failing testcases found.
  193. 31.86 s > =========================================
  194. 31.86 s > Extracting 2 binaries (including 1 non-test binary) and 1 linked path to /build/source
  195. 31.86 s > Extracted 9 files to /build/source in 0.18s
  196. 31.86 s > ------------
  197. 31.86 s > Nextest run ID 821a5d23-f648-4d1d-a950-c72214c6fd3d with nextest profile: ci_gammaloop
  198. 31.86 s > Starting 183 tests across 1 binary
  199. 31.86 s > ------------
  200. 31.86 s > Summary [ 0.336s] 183 tests run: 183 passed, 0 skipped
  201. 31.86 s >
  202. 31.86 s > ========== nextest test summary ==========
  203. 31.86 s > report: target/nextest/ci_gammaloop/junit.xml
  204. 31.86 s > tests: 183, failures: 0, errors: 0
  205. 31.86 s > No failing testcases found.
  206. 31.86 s > =========================================
  207. 31.86 s > Extracting 4 binaries (including 3 non-test binaries), 1 build script output directory, and 1 linked path to /build/source
  208. 31.86 s > Extracted 13 files to /build/source in 0.37s
  209. 31.86 s > ------------
  210. 31.86 s > Nextest run ID ddb7c2c0-aceb-47d0-91d6-cd56fca62af6 with nextest profile: ci_gammaloop
  211. 31.86 s > Starting 0 tests across 1 binary
  212. 31.86 s > ------------
  213. 31.86 s > Summary [ 0.000s] 0 tests run: 0 passed, 0 skipped
  214. 31.86 s >
  215. 31.86 s > ========== nextest test summary ==========
  216. 31.86 s > report: target/nextest/ci_gammaloop/junit.xml
  217. 31.86 s > tests: 0, failures: 0, errors: 0
  218. 31.86 s > No failing testcases found.
  219. 31.86 s > =========================================
  220. 31.86 s > Extracting 2 binaries (including 1 non-test binary) and 1 linked path to /build/source
  221. 31.86 s > Extracted 9 files to /build/source in 0.11s
  222. 31.86 s > ------------
  223. 31.86 s > Nextest run ID e6ec4dd6-869c-42dc-8b07-1b5f144909cd with nextest profile: ci_gammaloop
  224. 31.86 s > Starting 128 tests across 1 binary
  225. 31.86 s > FAIL [ 0.172s] (128/128) linnest tests::test_graph_structural_axis_merge_preserves_edge_positions_and_constraints
  226. 31.86 s > stdout ---
  227. 31.86 s >
  228. 31.86 s > running 1 test
  229. 31.86 s > test tests::test_graph_structural_axis_merge_preserves_edge_positions_and_constraints ... FAILED
  230. 31.86 s >
  231. 31.86 s > failures:
  232. 31.86 s >
  233. 31.86 s > failures:
  234. 31.86 s > tests::test_graph_structural_axis_merge_preserves_edge_positions_and_constraints
  235. 31.86 s >
  236. 31.86 s > test result: FAILED. 0 passed; 1 failed; 0 ignored; 0 measured; 127 filtered out; finished in 0.16s
  237. 31.86 s >
  238. 31.86 s > stderr ---
  239. 31.86 s >
  240. 31.86 s > thread 'tests::test_graph_structural_axis_merge_preserves_edge_positions_and_constraints' (909) panicked at crates/linnest/src/tests.rs:1721:32:
  241. 31.86 s > no entry found for key
  242. 31.86 s > stack backtrace:
  243. 31.86 s > 0: __rustc::rust_begin_unwind
  244. 31.86 s > 1: core::panicking::panic_fmt
  245. 31.86 s > 2: core::option::expect_failed
  246. 31.86 s > 3: linnest::tests::test_graph_structural_axis_merge_preserves_edge_positions_and_constraints
  247. 31.86 s > 4: <linnest::tests::test_graph_structural_axis_merge_preserves_edge_positions_and_constraints::{closure#0} as core::ops::function::FnOnce<()>>::call_once
  248. 31.86 s > note: Some details are omitted, run with `RUST_BACKTRACE=full` for a verbose backtrace.
  249. 31.86 s >
  250. 31.86 s > ------------
  251. 31.86 s > Summary [ 0.284s] 128 tests run: 127 passed, 1 failed, 0 skipped
  252. 31.86 s > FAIL [ 0.172s] (128/128) linnest tests::test_graph_structural_axis_merge_preserves_edge_positions_and_constraints
  253. 31.86 s > stdout ---
  254. 31.86 s >
  255. 31.86 s > running 1 test
  256. 31.86 s > test tests::test_graph_structural_axis_merge_preserves_edge_positions_and_constraints ... FAILED
  257. 31.86 s >
  258. 31.86 s > failures:
  259. 31.86 s >
  260. 31.86 s > failures:
  261. 31.86 s > tests::test_graph_structural_axis_merge_preserves_edge_positions_and_constraints
  262. 31.86 s >
  263. 31.86 s > test result: FAILED. 0 passed; 1 failed; 0 ignored; 0 measured; 127 filtered out; finished in 0.16s
  264. 31.86 s >
  265. 31.86 s > stderr ---
  266. 31.86 s >
  267. 31.86 s > thread 'tests::test_graph_structural_axis_merge_preserves_edge_positions_and_constraints' (909) panicked at crates/linnest/src/tests.rs:1721:32:
  268. 31.86 s > no entry found for key
  269. 31.86 s > stack backtrace:
  270. 31.86 s > 0: __rustc::rust_begin_unwind
  271. 31.86 s > 1: core::panicking::panic_fmt
  272. 31.86 s > 2: core::option::expect_failed
  273. 31.86 s > 3: linnest::tests::test_graph_structural_axis_merge_preserves_edge_positions_and_constraints
  274. 31.86 s > 4: <linnest::tests::test_graph_structural_axis_merge_preserves_edge_positions_and_constraints::{closure#0} as core::ops::function::FnOnce<()>>::call_once
  275. 31.86 s > note: Some details are omitted, run with `RUST_BACKTRACE=full` for a verbose backtrace.
  276. 31.86 s >
  277. 31.86 s > error: test run failed
  278. 31.86 s >
  279. 31.86 s > ========== nextest test summary ==========
  280. 31.86 s > report: target/nextest/ci_gammaloop/junit.xml
  281. 31.86 s > tests: 128, failures: 1, errors: 0
  282. 31.86 s >
  283. 31.86 s > 1. linnest::tests::test_graph_structural_axis_merge_preserves_edge_positions_and_constraints
  284. 31.86 s > failure: test failure with exit code 101
  285. 31.86 s > thread 'tests::test_graph_structural_axis_merge_preserves_edge_positions_and_constraints' (909) panicked at crates/linnest/src/tests.rs:1721:32:
  286. 31.86 s > no entry found for key
  287. 31.86 s > stack backtrace:
  288. 31.86 s > 0: __rustc::rust_begin_unwind
  289. 31.86 s > 1: core::panicking::panic_fmt
  290. 31.86 s > 2: core::option::expect_failed
  291. 31.86 s > 3: linnest::tests::test_graph_structural_axis_merge_preserves_edge_positions_and_constraints
  292. 31.86 s > 4: <linnest::tests::test_graph_structural_axis_merge_preserves_edge_positions_and_constraints::{closure#0} as core::ops::function::FnOnce<()>>::call_once
  293. 31.86 s > note: Some details are omitted, run with `RUST_BACKTRACE=full` for a verbose backtrace.
  294. 31.86 s > system-out
  295. 31.86 s > running 1 test
  296. 31.86 s > test tests::test_graph_structural_axis_merge_preserves_edge_positions_and_constraints ... FAILED
  297. 31.86 s >
  298. 31.86 s > failures:
  299. 31.86 s >
  300. 31.86 s > failures:
  301. 31.86 s > tests::test_graph_structural_axis_merge_preserves_edge_positions_and_constraints
  302. 31.86 s >
  303. 31.86 s > test result: FAILED. 0 passed; 1 failed; 0 ignored; 0 measured; 127 filtered out; finished in 0.16s
  304. 31.86 s > system-err
  305. 31.86 s > thread 'tests::test_graph_structural_axis_merge_preserves_edge_positions_and_constraints' (909) panicked at crates/linnest/src/tests.rs:1721:32:
  306. 31.86 s > no entry found for key
  307. 31.86 s > stack backtrace:
  308. 31.86 s > 0: __rustc::rust_begin_unwind
  309. 31.86 s > 1: core::panicking::panic_fmt
  310. 31.86 s > 2: core::option::expect_failed
  311. 31.86 s > 3: linnest::tests::test_graph_structural_axis_merge_preserves_edge_positions_and_constraints
  312. 31.86 s > 4: <linnest::tests::test_graph_structural_axis_merge_preserves_edge_positions_and_constraints::{closure#0} as core::ops::function::FnOnce<()>>::call_once
  313. 31.86 s > note: Some details are omitted, run with `RUST_BACKTRACE=full` for a verbose backtrace.
  314. 31.86 s > =========================================
  315. 31.86 s For full logs, run:
  316. 31.86 s nix log /nix/store/3a6s86hhbf2g1hgbkmcq3zdrmaha78qr-gammaloop-nextest-linnet.drv
  317. 32.01 s Run failed.