1. 0.22 s $ /nix/store/9ypz3flqsrl5xl495mm8h645gadjsxi1-coreutils-9.11/bin/timeout --kill-after=15s 7200s /nix/store/23zk8sgzamrbmj1fday15szf7f2279s8-nix-2.34.7/bin/nix --extra-experimental-features nix-command --extra-experimental-features flakes flake clone git+https://github.com/alphal00p/gammaloop --dest /tmp/nix-ci-worker/stable-pwd/repo/
  2. 0.44 s Cloning into '/tmp/nix-ci-worker/stable-pwd/repo'...
  3. 1.52 s remote: Enumerating objects: 72729, done.
  4. 1.74 s remote: Counting objects: 0% (1/8572) remote: Counting objects: 1% (86/8572) remote: Counting objects: 2% (172/8572) remote: Counting objects: 3% (258/8572) remote: Counting objects: 4% (343/8572) remote: Counting objects: 5% (429/8572) remote: Counting objects: 6% (515/8572) remote: Counting objects: 7% (601/8572) remote: Counting objects: 8% (686/8572) remote: Counting objects: 9% (772/8572) remote: Counting objects: 10% (858/8572) remote: Counting objects: 11% (943/8572) remote: Counting objects: 12% (1029/8572) remote: Counting objects: 13% (1115/8572) remote: Counting objects: 14% (1201/8572) remote: Counting objects: 15% (1286/8572) remote: Counting objects: 16% (1372/8572) remote: Counting objects: 17% (1458/8572) remote: Counting objects: 18% (1543/8572) remote: Counting objects: 19% (1629/8572) remote: Counting objects: 20% (1715/8572) remote: Counting objects: 21% (1801/8572) remote: Counting objects: 22% (1886/8572) remote: Counting objects: 23% (1972/8572) remote: Counting objects: 24% (2058/8572) remote: Counting objects: 25% (2143/8572) remote: Counting objects: 26% (2229/8572) remote: Counting objects: 27% (2315/8572) remote: Counting objects: 28% (2401/8572) remote: Counting objects: 29% (2486/8572) remote: Counting objects: 30% (2572/8572) remote: Counting objects: 31% (2658/8572) remote: Counting objects: 32% (2744/8572) remote: Counting objects: 33% (2829/8572) remote: Counting objects: 34% (2915/8572) remote: Counting objects: 35% (3001/8572) remote: Counting objects: 36% (3086/8572) remote: Counting objects: 37% (3172/8572) remote: Counting objects: 38% (3258/8572) remote: Counting objects: 39% (3344/8572) remote: Counting objects: 40% (3429/8572) remote: Counting objects: 41% (3515/8572) remote: Counting objects: 42% (3601/8572) remote: Counting objects: 43% (3686/8572) remote: Counting objects: 44% (3772/8572) remote: Counting objects: 45% (3858/8572) remote: Counting objects: 46% (3944/8572) remote: Counting objects: 47% (4029/8572) remote: Counting objects: 48% (4115/8572) remote: Counting objects: 49% (4201/8572) remote: Counting objects: 50% (4286/8572) remote: Counting objects: 51% (4372/8572) remote: Counting objects: 52% (4458/8572) remote: Counting objects: 53% (4544/8572) remote: Counting objects: 54% (4629/8572) remote: Counting objects: 55% (4715/8572) remote: Counting objects: 56% (4801/8572) remote: Counting objects: 57% (4887/8572) remote: Counting objects: 58% (4972/8572) remote: Counting objects: 59% (5058/8572) remote: Counting objects: 60% (5144/8572) remote: Counting objects: 61% (5229/8572) remote: Counting objects: 62% (5315/8572) remote: Counting objects: 63% (5401/8572) remote: Counting objects: 64% (5487/8572) remote: Counting objects: 65% (5572/8572) remote: Counting objects: 66% (5658/8572) remote: Counting objects: 67% (5744/8572) remote: Counting objects: 68% (5829/8572) remote: Counting objects: 69% (5915/8572) remote: Counting objects: 70% (6001/8572) remote: Counting objects: 71% (6087/8572) remote: Counting objects: 72% (6172/8572) remote: Counting objects: 73% (6258/8572) remote: Counting objects: 74% (6344/8572) remote: Counting objects: 75% (6429/8572) remote: Counting objects: 76% (6515/8572) remote: Counting objects: 77% (6601/8572) remote: Counting objects: 78% (6687/8572) remote: Counting objects: 79% (6772/8572) remote: Counting objects: 80% (6858/8572) remote: Counting objects: 81% (6944/8572) remote: Counting objects: 82% (7030/8572) remote: Counting objects: 83% (7115/8572) remote: Counting objects: 84% (7201/8572) remote: Counting objects: 85% (7287/8572) remote: Counting objects: 86% (7372/8572) remote: Counting objects: 87% (7458/8572) remote: Counting objects: 88% (7544/8572) remote: Counting objects: 89% (7630/8572) remote: Counting objects: 90% (7715/8572) remote: Counting objects: 91% (7801/8572) remote: Counting objects: 92% (7887/8572) remote: Counting objects: 93% (7972/8572) remote: Counting objects: 94% (8058/8572) remote: Counting objects: 95% (8144/8572) remote: Counting objects: 96% (8230/8572) remote: Counting objects: 97% (8315/8572) remote: Counting objects: 98% (8401/8572) remote: Counting objects: 99% (8487/8572) remote: Counting objects: 100% (8572/8572) remote: Counting objects: 100% (8572/8572), done.
  5. 3.47 s remote: Compressing objects: 0% (1/1760) remote: Compressing objects: 1% (18/1760) remote: Compressing objects: 2% (36/1760) remote: Compressing objects: 3% (53/1760) remote: Compressing objects: 4% (71/1760) remote: Compressing objects: 5% (88/1760) remote: Compressing objects: 6% (106/1760) remote: Compressing objects: 7% (124/1760) remote: Compressing objects: 8% (141/1760) remote: Compressing objects: 9% (159/1760) remote: Compressing objects: 10% (176/1760) remote: Compressing objects: 11% (194/1760) remote: Compressing objects: 12% (212/1760) remote: Compressing objects: 13% (229/1760) remote: Compressing objects: 14% (247/1760) remote: Compressing objects: 15% (264/1760) remote: Compressing objects: 16% (282/1760) remote: Compressing objects: 16% (288/1760) remote: Compressing objects: 17% (300/1760) remote: Compressing objects: 18% (317/1760) remote: Compressing objects: 19% (335/1760) remote: Compressing objects: 20% (352/1760) remote: Compressing objects: 21% (370/1760) remote: Compressing objects: 22% (388/1760) remote: Compressing objects: 23% (405/1760) remote: Compressing objects: 24% (423/1760) remote: Compressing objects: 25% (440/1760) remote: Compressing objects: 26% (458/1760) remote: Compressing objects: 27% (476/1760) remote: Compressing objects: 28% (493/1760) remote: Compressing objects: 29% (511/1760) remote: Compressing objects: 30% (528/1760) remote: Compressing objects: 31% (546/1760) remote: Compressing objects: 32% (564/1760) remote: Compressing objects: 33% (581/1760) remote: Compressing objects: 34% (599/1760) remote: Compressing objects: 35% (616/1760) remote: Compressing objects: 36% (634/1760) remote: Compressing objects: 37% (652/1760) remote: Compressing objects: 38% (669/1760) remote: Compressing objects: 39% (687/1760) remote: Compressing objects: 40% (704/1760) remote: Compressing objects: 41% (722/1760) remote: Compressing objects: 42% (740/1760) remote: Compressing objects: 43% (757/1760) remote: Compressing objects: 44% (775/1760) remote: Compressing objects: 45% (792/1760) remote: Compressing objects: 46% (810/1760) remote: Compressing objects: 47% (828/1760) remote: Compressing objects: 48% (845/1760) remote: Compressing objects: 49% (863/1760) remote: Compressing objects: 50% (880/1760) remote: Compressing objects: 51% (898/1760) remote: Compressing objects: 52% (916/1760) remote: Compressing objects: 53% (933/1760) remote: Compressing objects: 54% (951/1760) remote: Compressing objects: 55% (968/1760) remote: Compressing objects: 56% (986/1760) remote: Compressing objects: 57% (1004/1760) remote: Compressing objects: 58% (1021/1760) remote: Compressing objects: 59% (1039/1760) remote: Compressing objects: 60% (1056/1760) remote: Compressing objects: 61% (1074/1760) remote: Compressing objects: 62% (1092/1760) remote: Compressing objects: 63% (1109/1760) remote: Compressing objects: 64% (1127/1760) remote: Compressing objects: 65% (1144/1760) remote: Compressing objects: 66% (1162/1760) remote: Compressing objects: 67% (1180/1760) remote: Compressing objects: 68% (1197/1760) remote: Compressing objects: 69% (1215/1760) remote: Compressing objects: 70% (1232/1760) remote: Compressing objects: 71% (1250/1760) remote: Compressing objects: 72% (1268/1760) remote: Compressing objects: 73% (1285/1760) remote: Compressing objects: 74% (1303/1760) remote: Compressing objects: 75% (1320/1760) remote: Compressing objects: 76% (1338/1760) remote: Compressing objects: 77% (1356/1760) remote: Compressing objects: 78% (1373/1760) remote: Compressing objects: 79% (1391/1760) remote: Compressing objects: 80% (1408/1760) remote: Compressing objects: 81% (1426/1760) remote: Compressing objects: 82% (1444/1760) remote: Compressing objects: 83% (1461/1760) remote: Compressing objects: 84% (1479/1760) remote: Compressing objects: 85% (1496/1760) remote: Compressing objects: 86% (1514/1760) remote: Compressing objects: 87% (1532/1760) remote: Compressing objects: 88% (1549/1760) remote: Compressing objects: 89% (1567/1760) remote: Compressing objects: 90% (1584/1760) remote: Compressing objects: 91% (1602/1760) remote: Compressing objects: 92% (1620/1760) remote: Compressing objects: 93% (1637/1760) remote: Compressing objects: 94% (1655/1760) remote: Compressing objects: 95% (1672/1760) remote: Compressing objects: 96% (1690/1760) remote: Compressing objects: 97% (1708/1760) remote: Compressing objects: 98% (1725/1760) remote: Compressing objects: 99% (1743/1760) remote: Compressing objects: 100% (1760/1760) remote: Compressing objects: 100% (1760/1760), done.
  6. 7.00 s Receiving objects: 0% (1/72729) Receiving objects: 1% (728/72729) Receiving objects: 2% (1455/72729) Receiving objects: 3% (2182/72729) Receiving objects: 4% (2910/72729) Receiving objects: 5% (3637/72729) Receiving objects: 6% (4364/72729) Receiving objects: 7% (5092/72729), 9.06 MiB | 18.11 MiB/s Receiving objects: 8% (5819/72729), 9.06 MiB | 18.11 MiB/s Receiving objects: 9% (6546/72729), 9.06 MiB | 18.11 MiB/s Receiving objects: 10% (7273/72729), 9.06 MiB | 18.11 MiB/s Receiving objects: 11% (8001/72729), 9.06 MiB | 18.11 MiB/s Receiving objects: 12% (8728/72729), 9.06 MiB | 18.11 MiB/s Receiving objects: 13% (9455/72729), 9.06 MiB | 18.11 MiB/s Receiving objects: 14% (10183/72729), 9.06 MiB | 18.11 MiB/s Receiving objects: 15% (10910/72729), 9.06 MiB | 18.11 MiB/s Receiving objects: 16% (11637/72729), 9.06 MiB | 18.11 MiB/s Receiving objects: 17% (12364/72729), 9.06 MiB | 18.11 MiB/s Receiving objects: 18% (13092/72729), 9.06 MiB | 18.11 MiB/s Receiving objects: 19% (13819/72729), 9.06 MiB | 18.11 MiB/s Receiving objects: 19% (14375/72729), 9.06 MiB | 18.11 MiB/s Receiving objects: 20% (14546/72729), 9.06 MiB | 18.11 MiB/s Receiving objects: 21% (15274/72729), 20.38 MiB | 20.37 MiB/s Receiving objects: 22% (16001/72729), 20.38 MiB | 20.37 MiB/s Receiving objects: 23% (16728/72729), 20.38 MiB | 20.37 MiB/s Receiving objects: 24% (17455/72729), 20.38 MiB | 20.37 MiB/s Receiving objects: 25% (18183/72729), 20.38 MiB | 20.37 MiB/s Receiving objects: 26% (18910/72729), 20.38 MiB | 20.37 MiB/s Receiving objects: 27% (19637/72729), 20.38 MiB | 20.37 MiB/s Receiving objects: 28% (20365/72729), 20.38 MiB | 20.37 MiB/s Receiving objects: 29% (21092/72729), 20.38 MiB | 20.37 MiB/s Receiving objects: 30% (21819/72729), 20.38 MiB | 20.37 MiB/s Receiving objects: 31% (22546/72729), 20.38 MiB | 20.37 MiB/s Receiving objects: 32% (23274/72729), 20.38 MiB | 20.37 MiB/s Receiving objects: 33% (24001/72729), 20.38 MiB | 20.37 MiB/s Receiving objects: 34% (24728/72729), 20.38 MiB | 20.37 MiB/s Receiving objects: 35% (25456/72729), 20.38 MiB | 20.37 MiB/s Receiving objects: 36% (26183/72729), 20.38 MiB | 20.37 MiB/s Receiving objects: 37% (26910/72729), 20.38 MiB | 20.37 MiB/s Receiving objects: 38% (27638/72729), 20.38 MiB | 20.37 MiB/s Receiving objects: 39% (28365/72729), 20.38 MiB | 20.37 MiB/s Receiving objects: 40% (29092/72729), 20.38 MiB | 20.37 MiB/s Receiving objects: 41% (29819/72729), 20.38 MiB | 20.37 MiB/s Receiving objects: 42% (30547/72729), 20.38 MiB | 20.37 MiB/s Receiving objects: 43% (31274/72729), 20.38 MiB | 20.37 MiB/s Receiving objects: 44% (32001/72729), 20.38 MiB | 20.37 MiB/s Receiving objects: 45% (32729/72729), 20.38 MiB | 20.37 MiB/s Receiving objects: 46% (33456/72729), 20.38 MiB | 20.37 MiB/s Receiving objects: 47% (34183/72729), 20.38 MiB | 20.37 MiB/s Receiving objects: 48% (34910/72729), 20.38 MiB | 20.37 MiB/s Receiving objects: 49% (35638/72729), 20.38 MiB | 20.37 MiB/s Receiving objects: 50% (36365/72729), 37.46 MiB | 24.97 MiB/s Receiving objects: 51% (37092/72729), 37.46 MiB | 24.97 MiB/s Receiving objects: 52% (37820/72729), 37.46 MiB | 24.97 MiB/s Receiving objects: 53% (38547/72729), 37.46 MiB | 24.97 MiB/s Receiving objects: 54% (39274/72729), 37.46 MiB | 24.97 MiB/s Receiving objects: 55% (40001/72729), 37.46 MiB | 24.97 MiB/s Receiving objects: 56% (40729/72729), 37.46 MiB | 24.97 MiB/s Receiving objects: 57% (41456/72729), 37.46 MiB | 24.97 MiB/s Receiving objects: 58% (42183/72729), 37.46 MiB | 24.97 MiB/s Receiving objects: 59% (42911/72729), 37.46 MiB | 24.97 MiB/s Receiving objects: 60% (43638/72729), 37.46 MiB | 24.97 MiB/s Receiving objects: 61% (44365/72729), 37.46 MiB | 24.97 MiB/s Receiving objects: 62% (45092/72729), 37.46 MiB | 24.97 MiB/s Receiving objects: 63% (45820/72729), 37.46 MiB | 24.97 MiB/s Receiving objects: 64% (46547/72729), 37.46 MiB | 24.97 MiB/s Receiving objects: 64% (47130/72729), 37.46 MiB | 24.97 MiB/s Receiving objects: 65% (47274/72729), 59.36 MiB | 29.67 MiB/s Receiving objects: 66% (48002/72729), 59.36 MiB | 29.67 MiB/s Receiving objects: 67% (48729/72729), 59.36 MiB | 29.67 MiB/s Receiving objects: 68% (49456/72729), 59.36 MiB | 29.67 MiB/s Receiving objects: 69% (50184/72729), 59.36 MiB | 29.67 MiB/s Receiving objects: 70% (50911/72729), 59.36 MiB | 29.67 MiB/s Receiving objects: 71% (51638/72729), 59.36 MiB | 29.67 MiB/s Receiving objects: 72% (52365/72729), 59.36 MiB | 29.67 MiB/s Receiving objects: 73% (53093/72729), 59.36 MiB | 29.67 MiB/s Receiving objects: 74% (53820/72729), 59.36 MiB | 29.67 MiB/s Receiving objects: 75% (54547/72729), 59.36 MiB | 29.67 MiB/s Receiving objects: 76% (55275/72729), 80.41 MiB | 32.16 MiB/s Receiving objects: 77% (56002/72729), 80.41 MiB | 32.16 MiB/s Receiving objects: 78% (56729/72729), 80.41 MiB | 32.16 MiB/s Receiving objects: 79% (57456/72729), 80.41 MiB | 32.16 MiB/s Receiving objects: 80% (58184/72729), 80.41 MiB | 32.16 MiB/s Receiving objects: 81% (58911/72729), 80.41 MiB | 32.16 MiB/s Receiving objects: 82% (59638/72729), 80.41 MiB | 32.16 MiB/s Receiving objects: 83% (60366/72729), 80.41 MiB | 32.16 MiB/s Receiving objects: 84% (61093/72729), 80.41 MiB | 32.16 MiB/s Receiving objects: 85% (61820/72729), 80.41 MiB | 32.16 MiB/s Receiving objects: 86% (62547/72729), 80.41 MiB | 32.16 MiB/s Receiving objects: 86% (62626/72729), 97.32 MiB | 32.44 MiB/s Receiving objects: 87% (63275/72729), 97.32 MiB | 32.44 MiB/s Receiving objects: 88% (64002/72729), 97.32 MiB | 32.44 MiB/s Receiving objects: 89% (64729/72729), 97.32 MiB | 32.44 MiB/s Receiving objects: 90% (65457/72729), 97.32 MiB | 32.44 MiB/s Receiving objects: 91% (66184/72729), 97.32 MiB | 32.44 MiB/s Receiving objects: 92% (66911/72729), 97.32 MiB | 32.44 MiB/s Receiving objects: 93% (67638/72729), 97.32 MiB | 32.44 MiB/s Receiving objects: 94% (68366/72729), 97.32 MiB | 32.44 MiB/s Receiving objects: 95% (69093/72729), 97.32 MiB | 32.44 MiB/s Receiving objects: 96% (69820/72729), 97.32 MiB | 32.44 MiB/s Receiving objects: 97% (70548/72729), 97.32 MiB | 32.44 MiB/s Receiving objects: 98% (71275/72729), 97.32 MiB | 32.44 MiB/s Receiving objects: 99% (72002/72729), 97.32 MiB | 32.44 MiB/s remote: Total 72729 (delta 7174), reused 6991 (delta 6550), pack-reused 64157 (from 2)
  7. 7.07 s Receiving objects: 100% (72729/72729), 115.37 MiB | 32.96 MiB/s Receiving objects: 100% (72729/72729), 116.72 MiB | 33.02 MiB/s, done.
  8. 9.51 s Resolving deltas: 0% (0/50472) Resolving deltas: 1% (505/50472) Resolving deltas: 2% (1010/50472) Resolving deltas: 3% (1515/50472) Resolving deltas: 4% (2019/50472) Resolving deltas: 5% (2524/50472) Resolving deltas: 6% (3029/50472) Resolving deltas: 7% (3534/50472) Resolving deltas: 8% (4038/50472) Resolving deltas: 9% (4543/50472) Resolving deltas: 10% (5048/50472) Resolving deltas: 11% (5552/50472) Resolving deltas: 12% (6057/50472) Resolving deltas: 13% (6562/50472) Resolving deltas: 14% (7067/50472) Resolving deltas: 15% (7572/50472) Resolving deltas: 16% (8076/50472) Resolving deltas: 17% (8581/50472) Resolving deltas: 18% (9085/50472) Resolving deltas: 19% (9590/50472) Resolving deltas: 20% (10095/50472) Resolving deltas: 21% (10600/50472) Resolving deltas: 22% (11105/50472) Resolving deltas: 23% (11609/50472) Resolving deltas: 24% (12114/50472) Resolving deltas: 25% (12618/50472) Resolving deltas: 26% (13123/50472) Resolving deltas: 27% (13628/50472) Resolving deltas: 28% (14134/50472) Resolving deltas: 29% (14637/50472) Resolving deltas: 30% (15142/50472) Resolving deltas: 31% (15647/50472) Resolving deltas: 32% (16152/50472) Resolving deltas: 33% (16656/50472) Resolving deltas: 34% (17161/50472) Resolving deltas: 35% (17666/50472) Resolving deltas: 36% (18170/50472) Resolving deltas: 37% (18675/50472) Resolving deltas: 38% (19180/50472) Resolving deltas: 39% (19685/50472) Resolving deltas: 40% (20189/50472) Resolving deltas: 41% (20694/50472) Resolving deltas: 42% (21199/50472) Resolving deltas: 43% (21703/50472) Resolving deltas: 44% (22208/50472) Resolving deltas: 45% (22713/50472) Resolving deltas: 46% (23218/50472) Resolving deltas: 47% (23722/50472) Resolving deltas: 48% (24227/50472) Resolving deltas: 49% (24732/50472) Resolving deltas: 50% (25236/50472) Resolving deltas: 51% (25741/50472) Resolving deltas: 52% (26246/50472) Resolving deltas: 53% (26751/50472) Resolving deltas: 54% (27255/50472) Resolving deltas: 55% (27760/50472) Resolving deltas: 56% (28265/50472) Resolving deltas: 57% (28770/50472) Resolving deltas: 57% (28876/50472) Resolving deltas: 58% (29274/50472) Resolving deltas: 59% (29779/50472) Resolving deltas: 60% (30284/50472) Resolving deltas: 61% (30788/50472) Resolving deltas: 62% (31293/50472) Resolving deltas: 63% (31798/50472) Resolving deltas: 64% (32303/50472) Resolving deltas: 65% (32807/50472) Resolving deltas: 66% (33313/50472) Resolving deltas: 67% (33817/50472) Resolving deltas: 68% (34321/50472) Resolving deltas: 69% (34826/50472) Resolving deltas: 70% (35331/50472) Resolving deltas: 71% (35836/50472) Resolving deltas: 72% (36340/50472) Resolving deltas: 73% (36845/50472) Resolving deltas: 74% (37350/50472) Resolving deltas: 75% (37854/50472) Resolving deltas: 76% (38359/50472) Resolving deltas: 77% (38864/50472) Resolving deltas: 78% (39369/50472) Resolving deltas: 79% (39873/50472) Resolving deltas: 80% (40378/50472) Resolving deltas: 80% (40444/50472) Resolving deltas: 81% (40883/50472) Resolving deltas: 82% (41388/50472) Resolving deltas: 83% (41892/50472) Resolving deltas: 84% (42397/50472) Resolving deltas: 85% (42902/50472) Resolving deltas: 86% (43406/50472) Resolving deltas: 87% (43911/50472) Resolving deltas: 88% (44416/50472) Resolving deltas: 89% (44921/50472) Resolving deltas: 90% (45425/50472) Resolving deltas: 91% (45930/50472) Resolving deltas: 92% (46435/50472) Resolving deltas: 93% (46939/50472) Resolving deltas: 94% (47444/50472) Resolving deltas: 95% (47949/50472) Resolving deltas: 96% (48455/50472) Resolving deltas: 97% (48958/50472) Resolving deltas: 98% (49463/50472) Resolving deltas: 99% (49968/50472) Resolving deltas: 100% (50472/50472) Resolving deltas: 100% (50472/50472), done.
  9. 10.10 s Fetching commit addf846a86d5a791511c2064b2a5cac7c6e6e211 for docs ...
  10. 10.10 s $ /nix/store/bcnisk3ydfgv26v2gw3zlky24g00yww2-git-2.54.0/bin/git fetch origin addf846a86d5a791511c2064b2a5cac7c6e6e211
  11. 10.76 s From https://github.com/alphal00p/gammaloop
  12. 10.76 s * branch addf846a86d5a791511c2064b2a5cac7c6e6e211 -> FETCH_HEAD
  13. 10.83 s $ /nix/store/9ypz3flqsrl5xl495mm8h645gadjsxi1-coreutils-9.11/bin/timeout --kill-after=15s 7200s /nix/store/bcnisk3ydfgv26v2gw3zlky24g00yww2-git-2.54.0/bin/git -c advice.detachedHead=false checkout addf846a86d5a791511c2064b2a5cac7c6e6e211
  14. 11.14 s HEAD is now at addf846a8 speed up incremental documentation watches
  15. 11.17 s $ /nix/store/9ypz3flqsrl5xl495mm8h645gadjsxi1-coreutils-9.11/bin/timeout --kill-after=15s 7200s /nix/store/23zk8sgzamrbmj1fday15szf7f2279s8-nix-2.34.7/bin/nix --extra-experimental-features nix-command --extra-experimental-features flakes --log-format internal-json run .#packages.x86_64-linux.nix-ci-check-gammaloop-nextest-core --print-build-logs
  16. 11.64 s
  17. 12.34 s evaluating derivation 'gevaluation warning: stdenv.isDarwin is deprecated, use stdenv.hostPlatform.isDarwin instead
  18. 21.68 s copying '/nix/store/f05i evaluating derivation 'g copying '/nix/store/f05i evaluating derivation 'g copying '/nix/store/f05i evaluating derivation 'g copying '/nix/store/f05i evaluating derivation 'g copying '/nix/store/f05i evaluating derivation 'g copying '/nix/store/f05i evaluating derivation 'g copying '/nix/store/f05i evaluating derivation 'g copying '/nix/store/f05i evaluating derivation 'g copying '/nix/store/f05i evaluating derivation 'g copying '/nix/store/f05i evaluating derivation 'g copying '/nix/store/f05i evaluating derivation 'g copying '/nix/store/f05i evaluating derivation 'g [0/1 built] [1/0/1 built] building ggammaloop-nextest-core> Extracting 4 binaries (including 2 non-test binaries), 1 build script output directory, and 2 linked paths to /build/nextest-archive-hGAAcX
  19. 22.41 s gammaloop-nextest-core> Extracted 20 files to /build/nextest-archive-hGAAcX in 0.73s
  20. 22.46 s gammaloop-nextest-core> ------------
  21. 22.46 s gammaloop-nextest-core> Nextest run ID 60576fd2-9c6d-43e3-8f28-e47f829f2be7 with nextest profile: ci_gammaloop
  22. 22.46 s gammaloop-nextest-core> Starting 339 tests across 2 binaries
  23. 23.33 s gammaloop-nextest-core> FAIL [ 0.047s] (245/339) gammaloop-api repl::tests::completion_shows_type_hint_for_non_boolean_settings_leaf
  24. 23.33 s gammaloop-nextest-core> stdout ---
  25. 23.33 s gammaloop-nextest-core>
  26. 23.33 s gammaloop-nextest-core> running 1 test
  27. 23.33 s gammaloop-nextest-core> test repl::tests::completion_shows_type_hint_for_non_boolean_settings_leaf ... FAILED
  28. 23.33 s gammaloop-nextest-core>
  29. 23.33 s gammaloop-nextest-core> failures:
  30. 23.33 s gammaloop-nextest-core>
  31. 23.33 s gammaloop-nextest-core> failures:
  32. 23.33 s gammaloop-nextest-core> repl::tests::completion_shows_type_hint_for_non_boolean_settings_leaf
  33. 23.33 s gammaloop-nextest-core>
  34. 23.33 s gammaloop-nextest-core> test result: FAILED. 0 passed; 1 failed; 0 ignored; 0 measured; 338 filtered out; finished in 0.02s
  35. 23.33 s gammaloop-nextest-core>
  36. 23.33 s gammaloop-nextest-core> stderr ---
  37. 23.33 s gammaloop-nextest-core>
  38. 23.33 s gammaloop-nextest-core> thread 'repl::tests::completion_shows_type_hint_for_non_boolean_settings_leaf' (761) panicked at crates/gammaloop-api/src/repl.rs:5778:9:
  39. 23.33 s gammaloop-nextest-core> [Suggestion { value: "", description: Some("Number of samples in the first Monte Carlo iteration."), style: None, extra: None, span: Span { start: 42, end: 42 }, append_whitespace: false }]
  40. 23.33 s gammaloop-nextest-core> stack backtrace:
  41. 23.33 s gammaloop-nextest-core> 0: __rustc::rust_begin_unwind
  42. 23.33 s gammaloop-nextest-core> 1: core::panicking::panic_fmt
  43. 23.33 s gammaloop-nextest-core> 2: gammaloop_api::repl::tests::completion_shows_type_hint_for_non_boolean_settings_leaf
  44. 23.33 s gammaloop-nextest-core> 3: <gammaloop_api::repl::tests::completion_shows_type_hint_for_non_boolean_settings_leaf::{closure#0} as core::ops::function::FnOnce<()>>::call_once
  45. 23.33 s gammaloop-nextest-core> note: Some details are omitted, run with `RUST_BACKTRACE=full` for a verbose backtrace.
  46. 23.33 s gammaloop-nextest-core>
  47. 23.72 s gammaloop-nextest-core> ------------
  48. 23.72 s gammaloop-nextest-core> Summary [ 1.256s] 339 tests run: 338 passed, 1 failed, 0 skipped
  49. 23.72 s gammaloop-nextest-core> FAIL [ 0.047s] (245/339) gammaloop-api repl::tests::completion_shows_type_hint_for_non_boolean_settings_leaf
  50. 23.72 s gammaloop-nextest-core> stdout ---
  51. 23.72 s gammaloop-nextest-core>
  52. 23.72 s gammaloop-nextest-core> running 1 test
  53. 23.72 s gammaloop-nextest-core> test repl::tests::completion_shows_type_hint_for_non_boolean_settings_leaf ... FAILED
  54. 23.72 s gammaloop-nextest-core>
  55. 23.72 s gammaloop-nextest-core> failures:
  56. 23.72 s gammaloop-nextest-core>
  57. 23.72 s gammaloop-nextest-core> failures:
  58. 23.72 s gammaloop-nextest-core> repl::tests::completion_shows_type_hint_for_non_boolean_settings_leaf
  59. 23.72 s gammaloop-nextest-core>
  60. 23.72 s gammaloop-nextest-core> test result: FAILED. 0 passed; 1 failed; 0 ignored; 0 measured; 338 filtered out; finished in 0.02s
  61. 23.72 s gammaloop-nextest-core>
  62. 23.72 s gammaloop-nextest-core> stderr ---
  63. 23.72 s gammaloop-nextest-core>
  64. 23.72 s gammaloop-nextest-core> thread 'repl::tests::completion_shows_type_hint_for_non_boolean_settings_leaf' (761) panicked at crates/gammaloop-api/src/repl.rs:5778:9:
  65. 23.72 s gammaloop-nextest-core> [Suggestion { value: "", description: Some("Number of samples in the first Monte Carlo iteration."), style: None, extra: None, span: Span { start: 42, end: 42 }, append_whitespace: false }]
  66. 23.72 s gammaloop-nextest-core> stack backtrace:
  67. 23.72 s gammaloop-nextest-core> 0: __rustc::rust_begin_unwind
  68. 23.72 s gammaloop-nextest-core> 1: core::panicking::panic_fmt
  69. 23.72 s gammaloop-nextest-core> 2: gammaloop_api::repl::tests::completion_shows_type_hint_for_non_boolean_settings_leaf
  70. 23.72 s gammaloop-nextest-core> 3: <gammaloop_api::repl::tests::completion_shows_type_hint_for_non_boolean_settings_leaf::{closure#0} as core::ops::function::FnOnce<()>>::call_once
  71. 23.72 s gammaloop-nextest-core> note: Some details are omitted, run with `RUST_BACKTRACE=full` for a verbose backtrace.
  72. 23.72 s gammaloop-nextest-core>
  73. 23.85 s gammaloop-nextest-core> error: test run failed
  74. 23.90 s gammaloop-nextest-core>
  75. 23.90 s gammaloop-nextest-core> ========== nextest test summary ==========
  76. 23.90 s gammaloop-nextest-core> report: target/nextest/ci_gammaloop/junit.xml
  77. 23.90 s gammaloop-nextest-core> tests: 339, failures: 1, errors: 0
  78. 23.90 s gammaloop-nextest-core>
  79. 23.90 s gammaloop-nextest-core> 1. gammaloop-api::repl::tests::completion_shows_type_hint_for_non_boolean_settings_leaf
  80. 23.90 s gammaloop-nextest-core> failure: test failure with exit code 101
  81. 23.90 s gammaloop-nextest-core> thread 'repl::tests::completion_shows_type_hint_for_non_boolean_settings_leaf' (761) panicked at crates/gammaloop-api/src/repl.rs:5778:9:
  82. 23.90 s gammaloop-nextest-core> [Suggestion { value: "", description: Some("Number of samples in the first Monte Carlo iteration."), style: None, extra: None, span: Span { start: 42, end: 42 }, append_whitespace: false }]
  83. 23.90 s gammaloop-nextest-core> stack backtrace:
  84. 23.90 s gammaloop-nextest-core> 0: __rustc::rust_begin_unwind
  85. 23.90 s gammaloop-nextest-core> 1: core::panicking::panic_fmt
  86. 23.90 s gammaloop-nextest-core> 2: gammaloop_api::repl::tests::completion_shows_type_hint_for_non_boolean_settings_leaf
  87. 23.90 s gammaloop-nextest-core> 3: <gammaloop_api::repl::tests::completion_shows_type_hint_for_non_boolean_settings_leaf::{closure#0} as core::ops::function::FnOnce<()>>::call_once
  88. 23.90 s gammaloop-nextest-core> note: Some details are omitted, run with `RUST_BACKTRACE=full` for a verbose backtrace.
  89. 23.90 s gammaloop-nextest-core> system-out
  90. 23.90 s gammaloop-nextest-core> running 1 test
  91. 23.90 s gammaloop-nextest-core> test repl::tests::completion_shows_type_hint_for_non_boolean_settings_leaf ... FAILED
  92. 23.90 s gammaloop-nextest-core>
  93. 23.90 s gammaloop-nextest-core> failures:
  94. 23.90 s gammaloop-nextest-core>
  95. 23.90 s gammaloop-nextest-core> failures:
  96. 23.90 s gammaloop-nextest-core> repl::tests::completion_shows_type_hint_for_non_boolean_settings_leaf
  97. 23.90 s gammaloop-nextest-core>
  98. 23.90 s gammaloop-nextest-core> test result: FAILED. 0 passed; 1 failed; 0 ignored; 0 measured; 338 filtered out; finished in 0.02s
  99. 23.90 s gammaloop-nextest-core> system-err
  100. 23.90 s gammaloop-nextest-core> thread 'repl::tests::completion_shows_type_hint_for_non_boolean_settings_leaf' (761) panicked at crates/gammaloop-api/src/repl.rs:5778:9:
  101. 23.90 s gammaloop-nextest-core> [Suggestion { value: "", description: Some("Number of samples in the first Monte Carlo iteration."), style: None, extra: None, span: Span { start: 42, end: 42 }, append_whitespace: false }]
  102. 23.90 s gammaloop-nextest-core> stack backtrace:
  103. 23.90 s gammaloop-nextest-core> 0: __rustc::rust_begin_unwind
  104. 23.90 s gammaloop-nextest-core> 1: core::panicking::panic_fmt
  105. 23.90 s gammaloop-nextest-core> 2: gammaloop_api::repl::tests::completion_shows_type_hint_for_non_boolean_settings_leaf
  106. 23.90 s gammaloop-nextest-core> 3: <gammaloop_api::repl::tests::completion_shows_type_hint_for_non_boolean_settings_leaf::{closure#0} as core::ops::function::FnOnce<()>>::call_once
  107. 23.90 s gammaloop-nextest-core> note: Some details are omitted, run with `RUST_BACKTRACE=full` for a verbose backtrace.
  108. 23.90 s gammaloop-nextest-core> =========================================
  109. 23.93 s gammaloop-nextest-core> Extracting 1 binary and 1 linked path to /build/nextest-archive-lZOpOt
  110. 24.06 s gammaloop-nextest-core> Extracted 7 files to /build/nextest-archive-lZOpOt in 0.13s
  111. 24.10 s gammaloop-nextest-core> ------------
  112. 24.10 s gammaloop-nextest-core> Nextest run ID 568a6c66-498f-4785-8d66-a10590858b5d with nextest profile: ci_gammaloop
  113. 24.10 s gammaloop-nextest-core> Starting 19 tests across 1 binary
  114. 24.14 s gammaloop-nextest-core> ------------
  115. 24.14 s gammaloop-nextest-core> Summary [ 0.039s] 19 tests run: 19 passed, 0 skipped
  116. 24.22 s gammaloop-nextest-core>
  117. 24.22 s gammaloop-nextest-core> ========== nextest test summary ==========
  118. 24.22 s gammaloop-nextest-core> report: target/nextest/ci_gammaloop/junit.xml
  119. 24.22 s gammaloop-nextest-core> tests: 19, failures: 0, errors: 0
  120. 24.22 s gammaloop-nextest-core> No failing testcases found.
  121. 24.22 s gammaloop-nextest-core> =========================================
  122. 24.25 s gammaloop-nextest-core> Extracting 1 binary to /build/nextest-archive-tyWR7I
  123. 24.32 s gammaloop-nextest-core> Extracted 4 files to /build/nextest-archive-tyWR7I in 0.07s
  124. 24.34 s gammaloop-nextest-core> ------------
  125. 24.34 s gammaloop-nextest-core> Nextest run ID ad049845-8c05-4cfb-af57-979f741d129b with nextest profile: ci_gammaloop
  126. 24.34 s gammaloop-nextest-core> Starting 0 tests across 1 binary
  127. 24.35 s gammaloop-nextest-core> ------------
  128. 24.35 s gammaloop-nextest-core> Summary [ 0.006s] 0 tests run: 0 passed, 0 skipped
  129. 24.42 s gammaloop-nextest-core>
  130. 24.42 s gammaloop-nextest-core> ========== nextest test summary ==========
  131. 24.42 s gammaloop-nextest-core> report: target/nextest/ci_gammaloop/junit.xml
  132. 24.42 s gammaloop-nextest-core> tests: 0, failures: 0, errors: 0
  133. 24.42 s gammaloop-nextest-core> No failing testcases found.
  134. 24.42 s gammaloop-nextest-core> =========================================
  135. 24.45 s gammaloop-nextest-core> Extracting 5 binaries (including 1 non-test binary), 1 build script output directory, and 2 linked paths to /build/nextest-archive-Uqoxf0
  136. 25.26 s gammaloop-nextest-core> Extracted 20 files to /build/nextest-archive-Uqoxf0 in 0.81s
  137. 25.32 s gammaloop-nextest-core> ------------
  138. 25.32 s gammaloop-nextest-core> Nextest run ID 76e21a52-1d4a-47da-b88d-0cac71ecfab2 with nextest profile: ci_gammaloop
  139. 25.32 s gammaloop-nextest-core> Starting 457 tests across 4 binaries (61 tests skipped, including 60 tests via profile.ci_gammaloop.default-filter)
  140. 46.05 s gammaloop-nextest-core> ------------
  141. 46.05 s gammaloop-nextest-core> Summary [ 20.742s] 457 tests run: 457 passed, 61 skipped
  142. 46.19 s gammaloop-nextest-core>
  143. 46.19 s gammaloop-nextest-core> ========== nextest test summary ==========
  144. 46.19 s gammaloop-nextest-core> report: target/nextest/ci_gammaloop/junit.xml
  145. 46.19 s gammaloop-nextest-core> tests: 457, failures: 0, errors: 0
  146. 46.19 s gammaloop-nextest-core> No failing testcases found.
  147. 46.19 s gammaloop-nextest-core> =========================================
  148. 46.28 s [0 built (1 failed)]error: Cannot build '/nix/store/dqj1sqrcfxmqf14fv5ym0nk1rih9zpzm-gammaloop-nextest-core.drv'.
  149. 46.28 s Reason: builder failed with exit code 100.
  150. 46.28 s Output paths:
  151. 46.28 s /nix/store/vxcznnsaxgfisfjz8g2rl8wr4c2bkfi1-gammaloop-nextest-core
  152. 46.28 s Last 130 log lines:
  153. 46.28 s > Extracting 4 binaries (including 2 non-test binaries), 1 build script output directory, and 2 linked paths to /build/nextest-archive-hGAAcX
  154. 46.28 s > Extracted 20 files to /build/nextest-archive-hGAAcX in 0.73s
  155. 46.28 s > ------------
  156. 46.28 s > Nextest run ID 60576fd2-9c6d-43e3-8f28-e47f829f2be7 with nextest profile: ci_gammaloop
  157. 46.28 s > Starting 339 tests across 2 binaries
  158. 46.28 s > FAIL [ 0.047s] (245/339) gammaloop-api repl::tests::completion_shows_type_hint_for_non_boolean_settings_leaf
  159. 46.28 s > stdout ---
  160. 46.28 s >
  161. 46.28 s > running 1 test
  162. 46.28 s > test repl::tests::completion_shows_type_hint_for_non_boolean_settings_leaf ... FAILED
  163. 46.28 s >
  164. 46.28 s > failures:
  165. 46.28 s >
  166. 46.28 s > failures:
  167. 46.28 s > repl::tests::completion_shows_type_hint_for_non_boolean_settings_leaf
  168. 46.28 s >
  169. 46.28 s > test result: FAILED. 0 passed; 1 failed; 0 ignored; 0 measured; 338 filtered out; finished in 0.02s
  170. 46.28 s >
  171. 46.28 s > stderr ---
  172. 46.28 s >
  173. 46.28 s > thread 'repl::tests::completion_shows_type_hint_for_non_boolean_settings_leaf' (761) panicked at crates/gammaloop-api/src/repl.rs:5778:9:
  174. 46.28 s > [Suggestion { value: "", description: Some("Number of samples in the first Monte Carlo iteration."), style: None, extra: None, span: Span { start: 42, end: 42 }, append_whitespace: false }]
  175. 46.28 s > stack backtrace:
  176. 46.28 s > 0: __rustc::rust_begin_unwind
  177. 46.28 s > 1: core::panicking::panic_fmt
  178. 46.28 s > 2: gammaloop_api::repl::tests::completion_shows_type_hint_for_non_boolean_settings_leaf
  179. 46.28 s > 3: <gammaloop_api::repl::tests::completion_shows_type_hint_for_non_boolean_settings_leaf::{closure#0} as core::ops::function::FnOnce<()>>::call_once
  180. 46.28 s > note: Some details are omitted, run with `RUST_BACKTRACE=full` for a verbose backtrace.
  181. 46.28 s >
  182. 46.28 s > ------------
  183. 46.28 s > Summary [ 1.256s] 339 tests run: 338 passed, 1 failed, 0 skipped
  184. 46.28 s > FAIL [ 0.047s] (245/339) gammaloop-api repl::tests::completion_shows_type_hint_for_non_boolean_settings_leaf
  185. 46.28 s > stdout ---
  186. 46.28 s >
  187. 46.28 s > running 1 test
  188. 46.28 s > test repl::tests::completion_shows_type_hint_for_non_boolean_settings_leaf ... FAILED
  189. 46.28 s >
  190. 46.28 s > failures:
  191. 46.28 s >
  192. 46.28 s > failures:
  193. 46.28 s > repl::tests::completion_shows_type_hint_for_non_boolean_settings_leaf
  194. 46.28 s >
  195. 46.28 s > test result: FAILED. 0 passed; 1 failed; 0 ignored; 0 measured; 338 filtered out; finished in 0.02s
  196. 46.28 s >
  197. 46.28 s > stderr ---
  198. 46.28 s >
  199. 46.28 s > thread 'repl::tests::completion_shows_type_hint_for_non_boolean_settings_leaf' (761) panicked at crates/gammaloop-api/src/repl.rs:5778:9:
  200. 46.28 s > [Suggestion { value: "", description: Some("Number of samples in the first Monte Carlo iteration."), style: None, extra: None, span: Span { start: 42, end: 42 }, append_whitespace: false }]
  201. 46.28 s > stack backtrace:
  202. 46.28 s > 0: __rustc::rust_begin_unwind
  203. 46.28 s > 1: core::panicking::panic_fmt
  204. 46.28 s > 2: gammaloop_api::repl::tests::completion_shows_type_hint_for_non_boolean_settings_leaf
  205. 46.28 s > 3: <gammaloop_api::repl::tests::completion_shows_type_hint_for_non_boolean_settings_leaf::{closure#0} as core::ops::function::FnOnce<()>>::call_once
  206. 46.28 s > note: Some details are omitted, run with `RUST_BACKTRACE=full` for a verbose backtrace.
  207. 46.28 s >
  208. 46.28 s > error: test run failed
  209. 46.28 s >
  210. 46.28 s > ========== nextest test summary ==========
  211. 46.28 s > report: target/nextest/ci_gammaloop/junit.xml
  212. 46.28 s > tests: 339, failures: 1, errors: 0
  213. 46.28 s >
  214. 46.28 s > 1. gammaloop-api::repl::tests::completion_shows_type_hint_for_non_boolean_settings_leaf
  215. 46.28 s > failure: test failure with exit code 101
  216. 46.28 s > thread 'repl::tests::completion_shows_type_hint_for_non_boolean_settings_leaf' (761) panicked at crates/gammaloop-api/src/repl.rs:5778:9:
  217. 46.28 s > [Suggestion { value: "", description: Some("Number of samples in the first Monte Carlo iteration."), style: None, extra: None, span: Span { start: 42, end: 42 }, append_whitespace: false }]
  218. 46.28 s > stack backtrace:
  219. 46.28 s > 0: __rustc::rust_begin_unwind
  220. 46.28 s > 1: core::panicking::panic_fmt
  221. 46.28 s > 2: gammaloop_api::repl::tests::completion_shows_type_hint_for_non_boolean_settings_leaf
  222. 46.28 s > 3: <gammaloop_api::repl::tests::completion_shows_type_hint_for_non_boolean_settings_leaf::{closure#0} as core::ops::function::FnOnce<()>>::call_once
  223. 46.28 s > note: Some details are omitted, run with `RUST_BACKTRACE=full` for a verbose backtrace.
  224. 46.28 s > system-out
  225. 46.28 s > running 1 test
  226. 46.28 s > test repl::tests::completion_shows_type_hint_for_non_boolean_settings_leaf ... FAILED
  227. 46.28 s >
  228. 46.28 s > failures:
  229. 46.28 s >
  230. 46.28 s > failures:
  231. 46.28 s > repl::tests::completion_shows_type_hint_for_non_boolean_settings_leaf
  232. 46.28 s >
  233. 46.28 s > test result: FAILED. 0 passed; 1 failed; 0 ignored; 0 measured; 338 filtered out; finished in 0.02s
  234. 46.28 s > system-err
  235. 46.28 s > thread 'repl::tests::completion_shows_type_hint_for_non_boolean_settings_leaf' (761) panicked at crates/gammaloop-api/src/repl.rs:5778:9:
  236. 46.28 s > [Suggestion { value: "", description: Some("Number of samples in the first Monte Carlo iteration."), style: None, extra: None, span: Span { start: 42, end: 42 }, append_whitespace: false }]
  237. 46.28 s > stack backtrace:
  238. 46.28 s > 0: __rustc::rust_begin_unwind
  239. 46.28 s > 1: core::panicking::panic_fmt
  240. 46.28 s > 2: gammaloop_api::repl::tests::completion_shows_type_hint_for_non_boolean_settings_leaf
  241. 46.28 s > 3: <gammaloop_api::repl::tests::completion_shows_type_hint_for_non_boolean_settings_leaf::{closure#0} as core::ops::function::FnOnce<()>>::call_once
  242. 46.28 s > note: Some details are omitted, run with `RUST_BACKTRACE=full` for a verbose backtrace.
  243. 46.28 s > =========================================
  244. 46.28 s > Extracting 1 binary and 1 linked path to /build/nextest-archive-lZOpOt
  245. 46.28 s > Extracted 7 files to /build/nextest-archive-lZOpOt in 0.13s
  246. 46.28 s > ------------
  247. 46.28 s > Nextest run ID 568a6c66-498f-4785-8d66-a10590858b5d with nextest profile: ci_gammaloop
  248. 46.28 s > Starting 19 tests across 1 binary
  249. 46.28 s > ------------
  250. 46.28 s > Summary [ 0.039s] 19 tests run: 19 passed, 0 skipped
  251. 46.28 s >
  252. 46.28 s > ========== nextest test summary ==========
  253. 46.28 s > report: target/nextest/ci_gammaloop/junit.xml
  254. 46.28 s > tests: 19, failures: 0, errors: 0
  255. 46.28 s > No failing testcases found.
  256. 46.28 s > =========================================
  257. 46.28 s > Extracting 1 binary to /build/nextest-archive-tyWR7I
  258. 46.28 s > Extracted 4 files to /build/nextest-archive-tyWR7I in 0.07s
  259. 46.28 s > ------------
  260. 46.28 s > Nextest run ID ad049845-8c05-4cfb-af57-979f741d129b with nextest profile: ci_gammaloop
  261. 46.28 s > Starting 0 tests across 1 binary
  262. 46.28 s > ------------
  263. 46.28 s > Summary [ 0.006s] 0 tests run: 0 passed, 0 skipped
  264. 46.28 s >
  265. 46.28 s > ========== nextest test summary ==========
  266. 46.28 s > report: target/nextest/ci_gammaloop/junit.xml
  267. 46.28 s > tests: 0, failures: 0, errors: 0
  268. 46.28 s > No failing testcases found.
  269. 46.28 s > =========================================
  270. 46.28 s > Extracting 5 binaries (including 1 non-test binary), 1 build script output directory, and 2 linked paths to /build/nextest-archive-Uqoxf0
  271. 46.28 s > Extracted 20 files to /build/nextest-archive-Uqoxf0 in 0.81s
  272. 46.28 s > ------------
  273. 46.28 s > Nextest run ID 76e21a52-1d4a-47da-b88d-0cac71ecfab2 with nextest profile: ci_gammaloop
  274. 46.28 s > Starting 457 tests across 4 binaries (61 tests skipped, including 60 tests via profile.ci_gammaloop.default-filter)
  275. 46.28 s > ------------
  276. 46.28 s > Summary [ 20.742s] 457 tests run: 457 passed, 61 skipped
  277. 46.28 s >
  278. 46.28 s > ========== nextest test summary ==========
  279. 46.28 s > report: target/nextest/ci_gammaloop/junit.xml
  280. 46.28 s > tests: 457, failures: 0, errors: 0
  281. 46.28 s > No failing testcases found.
  282. 46.28 s > =========================================
  283. 46.28 s For full logs, run:
  284. 46.28 s nix log /nix/store/dqj1sqrcfxmqf14fv5ym0nk1rih9zpzm-gammaloop-nextest-core.drv
  285. 46.42 s Run failed.