test packages.x86_64-linux.nix-ci-check-gammaloop-nextest-core

Reproduce this run
Retry Run
  1. 0.29 s $ /nix/store/9ypz3flqsrl5xl495mm8h645gadjsxi1-coreutils-9.11/bin/timeout --kill-after=15s 7200s /nix/store/23zk8sgzamrbmj1fday15szf7f2279s8-nix-2.34.7/bin/nix --extra-experimental-features nix-command --extra-experimental-features flakes flake clone git+https://github.com/alphal00p/gammaloop --dest /tmp/nix-ci-worker/stable-pwd/repo/
  2. 0.33 s Cloning into '/tmp/nix-ci-worker/stable-pwd/repo'...
  3. 1.83 s remote: Enumerating objects: 72729, done.
  4. 1.94 s remote: Counting objects: 0% (1/8551) remote: Counting objects: 1% (86/8551) remote: Counting objects: 2% (172/8551) remote: Counting objects: 3% (257/8551) remote: Counting objects: 4% (343/8551) remote: Counting objects: 5% (428/8551) remote: Counting objects: 6% (514/8551) remote: Counting objects: 7% (599/8551) remote: Counting objects: 8% (685/8551) remote: Counting objects: 9% (770/8551) remote: Counting objects: 10% (856/8551) remote: Counting objects: 11% (941/8551) remote: Counting objects: 12% (1027/8551) remote: Counting objects: 13% (1112/8551) remote: Counting objects: 14% (1198/8551) remote: Counting objects: 15% (1283/8551) remote: Counting objects: 16% (1369/8551) remote: Counting objects: 17% (1454/8551) remote: Counting objects: 18% (1540/8551) remote: Counting objects: 19% (1625/8551) remote: Counting objects: 20% (1711/8551) remote: Counting objects: 21% (1796/8551) remote: Counting objects: 22% (1882/8551) remote: Counting objects: 23% (1967/8551) remote: Counting objects: 24% (2053/8551) remote: Counting objects: 25% (2138/8551) remote: Counting objects: 26% (2224/8551) remote: Counting objects: 27% (2309/8551) remote: Counting objects: 28% (2395/8551) remote: Counting objects: 29% (2480/8551) remote: Counting objects: 30% (2566/8551) remote: Counting objects: 31% (2651/8551) remote: Counting objects: 32% (2737/8551) remote: Counting objects: 33% (2822/8551) remote: Counting objects: 34% (2908/8551) remote: Counting objects: 35% (2993/8551) remote: Counting objects: 36% (3079/8551) remote: Counting objects: 37% (3164/8551) remote: Counting objects: 38% (3250/8551) remote: Counting objects: 39% (3335/8551) remote: Counting objects: 40% (3421/8551) remote: Counting objects: 41% (3506/8551) remote: Counting objects: 42% (3592/8551) remote: Counting objects: 43% (3677/8551) remote: Counting objects: 44% (3763/8551) remote: Counting objects: 45% (3848/8551) remote: Counting objects: 46% (3934/8551) remote: Counting objects: 47% (4019/8551) remote: Counting objects: 48% (4105/8551) remote: Counting objects: 49% (4190/8551) remote: Counting objects: 50% (4276/8551) remote: Counting objects: 51% (4362/8551) remote: Counting objects: 52% (4447/8551) remote: Counting objects: 53% (4533/8551) remote: Counting objects: 54% (4618/8551) remote: Counting objects: 55% (4704/8551) remote: Counting objects: 56% (4789/8551) remote: Counting objects: 57% (4875/8551) remote: Counting objects: 58% (4960/8551) remote: Counting objects: 59% (5046/8551) remote: Counting objects: 60% (5131/8551) remote: Counting objects: 61% (5217/8551) remote: Counting objects: 62% (5302/8551) remote: Counting objects: 63% (5388/8551) remote: Counting objects: 64% (5473/8551) remote: Counting objects: 65% (5559/8551) remote: Counting objects: 66% (5644/8551) remote: Counting objects: 67% (5730/8551) remote: Counting objects: 68% (5815/8551) remote: Counting objects: 69% (5901/8551) remote: Counting objects: 70% (5986/8551) remote: Counting objects: 71% (6072/8551) remote: Counting objects: 72% (6157/8551) remote: Counting objects: 73% (6243/8551) remote: Counting objects: 74% (6328/8551) remote: Counting objects: 75% (6414/8551) remote: Counting objects: 76% (6499/8551) remote: Counting objects: 77% (6585/8551) remote: Counting objects: 78% (6670/8551) remote: Counting objects: 79% (6756/8551) remote: Counting objects: 80% (6841/8551) remote: Counting objects: 81% (6927/8551) remote: Counting objects: 82% (7012/8551) remote: Counting objects: 83% (7098/8551) remote: Counting objects: 84% (7183/8551) remote: Counting objects: 85% (7269/8551) remote: Counting objects: 86% (7354/8551) remote: Counting objects: 87% (7440/8551) remote: Counting objects: 88% (7525/8551) remote: Counting objects: 89% (7611/8551) remote: Counting objects: 90% (7696/8551) remote: Counting objects: 91% (7782/8551) remote: Counting objects: 92% (7867/8551) remote: Counting objects: 93% (7953/8551) remote: Counting objects: 94% (8038/8551) remote: Counting objects: 95% (8124/8551) remote: Counting objects: 96% (8209/8551) remote: Counting objects: 97% (8295/8551) remote: Counting objects: 98% (8380/8551) remote: Counting objects: 99% (8466/8551) remote: Counting objects: 100% (8551/8551) remote: Counting objects: 100% (8551/8551), done.
  5. 4.27 s remote: Compressing objects: 0% (1/1759) remote: Compressing objects: 1% (18/1759) remote: Compressing objects: 2% (36/1759) remote: Compressing objects: 3% (53/1759) remote: Compressing objects: 4% (71/1759) remote: Compressing objects: 5% (88/1759) remote: Compressing objects: 6% (106/1759) remote: Compressing objects: 7% (124/1759) remote: Compressing objects: 8% (141/1759) remote: Compressing objects: 9% (159/1759) remote: Compressing objects: 10% (176/1759) remote: Compressing objects: 11% (194/1759) remote: Compressing objects: 12% (212/1759) remote: Compressing objects: 13% (229/1759) remote: Compressing objects: 14% (247/1759) remote: Compressing objects: 14% (254/1759) remote: Compressing objects: 15% (264/1759) remote: Compressing objects: 16% (282/1759) remote: Compressing objects: 17% (300/1759) remote: Compressing objects: 18% (317/1759) remote: Compressing objects: 19% (335/1759) remote: Compressing objects: 20% (352/1759) remote: Compressing objects: 21% (370/1759) remote: Compressing objects: 22% (387/1759) remote: Compressing objects: 23% (405/1759) remote: Compressing objects: 24% (423/1759) remote: Compressing objects: 24% (429/1759) remote: Compressing objects: 25% (440/1759) remote: Compressing objects: 26% (458/1759) remote: Compressing objects: 27% (475/1759) remote: Compressing objects: 28% (493/1759) remote: Compressing objects: 29% (511/1759) remote: Compressing objects: 30% (528/1759) remote: Compressing objects: 31% (546/1759) remote: Compressing objects: 32% (563/1759) remote: Compressing objects: 33% (581/1759) remote: Compressing objects: 34% (599/1759) remote: Compressing objects: 35% (616/1759) remote: Compressing objects: 36% (634/1759) remote: Compressing objects: 37% (651/1759) remote: Compressing objects: 38% (669/1759) remote: Compressing objects: 39% (687/1759) remote: Compressing objects: 40% (704/1759) remote: Compressing objects: 41% (722/1759) remote: Compressing objects: 42% (739/1759) remote: Compressing objects: 43% (757/1759) remote: Compressing objects: 44% (774/1759) remote: Compressing objects: 45% (792/1759) remote: Compressing objects: 46% (810/1759) remote: Compressing objects: 47% (827/1759) remote: Compressing objects: 48% (845/1759) remote: Compressing objects: 49% (862/1759) remote: Compressing objects: 50% (880/1759) remote: Compressing objects: 51% (898/1759) remote: Compressing objects: 52% (915/1759) remote: Compressing objects: 53% (933/1759) remote: Compressing objects: 54% (950/1759) remote: Compressing objects: 55% (968/1759) remote: Compressing objects: 56% (986/1759) remote: Compressing objects: 57% (1003/1759) remote: Compressing objects: 58% (1021/1759) remote: Compressing objects: 59% (1038/1759) remote: Compressing objects: 60% (1056/1759) remote: Compressing objects: 61% (1073/1759) remote: Compressing objects: 62% (1091/1759) remote: Compressing objects: 63% (1109/1759) remote: Compressing objects: 64% (1126/1759) remote: Compressing objects: 65% (1144/1759) remote: Compressing objects: 66% (1161/1759) remote: Compressing objects: 67% (1179/1759) remote: Compressing objects: 68% (1197/1759) remote: Compressing objects: 69% (1214/1759) remote: Compressing objects: 70% (1232/1759) remote: Compressing objects: 71% (1249/1759) remote: Compressing objects: 72% (1267/1759) remote: Compressing objects: 73% (1285/1759) remote: Compressing objects: 74% (1302/1759) remote: Compressing objects: 75% (1320/1759) remote: Compressing objects: 76% (1337/1759) remote: Compressing objects: 77% (1355/1759) remote: Compressing objects: 78% (1373/1759) remote: Compressing objects: 79% (1390/1759) remote: Compressing objects: 80% (1408/1759) remote: Compressing objects: 81% (1425/1759) remote: Compressing objects: 82% (1443/1759) remote: Compressing objects: 83% (1460/1759) remote: Compressing objects: 84% (1478/1759) remote: Compressing objects: 85% (1496/1759) remote: Compressing objects: 86% (1513/1759) remote: Compressing objects: 87% (1531/1759) remote: Compressing objects: 88% (1548/1759) remote: Compressing objects: 89% (1566/1759) remote: Compressing objects: 90% (1584/1759) remote: Compressing objects: 91% (1601/1759) remote: Compressing objects: 92% (1619/1759) remote: Compressing objects: 93% (1636/1759) remote: Compressing objects: 94% (1654/1759) remote: Compressing objects: 95% (1672/1759) remote: Compressing objects: 96% (1689/1759) remote: Compressing objects: 97% (1707/1759) remote: Compressing objects: 98% (1724/1759) remote: Compressing objects: 99% (1742/1759) remote: Compressing objects: 100% (1759/1759) remote: Compressing objects: 100% (1759/1759), done.
  6. 7.93 s Receiving objects: 0% (1/72729) Receiving objects: 1% (728/72729) Receiving objects: 2% (1455/72729) Receiving objects: 3% (2182/72729) Receiving objects: 4% (2910/72729) Receiving objects: 5% (3637/72729) Receiving objects: 6% (4364/72729) Receiving objects: 7% (5092/72729), 8.96 MiB | 17.90 MiB/s Receiving objects: 8% (5819/72729), 8.96 MiB | 17.90 MiB/s Receiving objects: 9% (6546/72729), 8.96 MiB | 17.90 MiB/s Receiving objects: 10% (7273/72729), 8.96 MiB | 17.90 MiB/s Receiving objects: 11% (8001/72729), 8.96 MiB | 17.90 MiB/s Receiving objects: 11% (8389/72729), 18.16 MiB | 18.16 MiB/s Receiving objects: 12% (8728/72729), 18.16 MiB | 18.16 MiB/s Receiving objects: 13% (9455/72729), 18.16 MiB | 18.16 MiB/s Receiving objects: 14% (10183/72729), 18.16 MiB | 18.16 MiB/s Receiving objects: 15% (10910/72729), 18.16 MiB | 18.16 MiB/s Receiving objects: 16% (11637/72729), 18.16 MiB | 18.16 MiB/s Receiving objects: 17% (12364/72729), 18.16 MiB | 18.16 MiB/s Receiving objects: 18% (13092/72729), 18.16 MiB | 18.16 MiB/s Receiving objects: 19% (13819/72729), 18.16 MiB | 18.16 MiB/s Receiving objects: 20% (14546/72729), 18.16 MiB | 18.16 MiB/s Receiving objects: 21% (15274/72729), 18.16 MiB | 18.16 MiB/s Receiving objects: 22% (16001/72729), 18.16 MiB | 18.16 MiB/s Receiving objects: 23% (16728/72729), 18.16 MiB | 18.16 MiB/s Receiving objects: 24% (17455/72729), 18.16 MiB | 18.16 MiB/s Receiving objects: 25% (18183/72729), 18.16 MiB | 18.16 MiB/s Receiving objects: 26% (18910/72729), 18.16 MiB | 18.16 MiB/s Receiving objects: 27% (19637/72729), 18.16 MiB | 18.16 MiB/s Receiving objects: 28% (20365/72729), 18.16 MiB | 18.16 MiB/s Receiving objects: 29% (21092/72729), 18.16 MiB | 18.16 MiB/s Receiving objects: 30% (21819/72729), 18.16 MiB | 18.16 MiB/s Receiving objects: 31% (22546/72729), 18.16 MiB | 18.16 MiB/s Receiving objects: 32% (23274/72729), 18.16 MiB | 18.16 MiB/s Receiving objects: 33% (24001/72729), 18.16 MiB | 18.16 MiB/s Receiving objects: 34% (24728/72729), 18.16 MiB | 18.16 MiB/s Receiving objects: 35% (25456/72729), 18.16 MiB | 18.16 MiB/s Receiving objects: 36% (26183/72729), 18.16 MiB | 18.16 MiB/s Receiving objects: 37% (26910/72729), 18.16 MiB | 18.16 MiB/s Receiving objects: 38% (27638/72729), 18.16 MiB | 18.16 MiB/s Receiving objects: 39% (28365/72729), 18.16 MiB | 18.16 MiB/s Receiving objects: 40% (29092/72729), 18.16 MiB | 18.16 MiB/s Receiving objects: 41% (29819/72729), 18.16 MiB | 18.16 MiB/s Receiving objects: 42% (30547/72729), 18.16 MiB | 18.16 MiB/s Receiving objects: 43% (31274/72729), 18.16 MiB | 18.16 MiB/s Receiving objects: 44% (32001/72729), 18.16 MiB | 18.16 MiB/s Receiving objects: 45% (32729/72729), 18.16 MiB | 18.16 MiB/s Receiving objects: 46% (33456/72729), 18.16 MiB | 18.16 MiB/s Receiving objects: 47% (34183/72729), 18.16 MiB | 18.16 MiB/s Receiving objects: 48% (34910/72729), 18.16 MiB | 18.16 MiB/s Receiving objects: 49% (35638/72729), 35.67 MiB | 23.78 MiB/s Receiving objects: 50% (36365/72729), 35.67 MiB | 23.78 MiB/s Receiving objects: 51% (37092/72729), 35.67 MiB | 23.78 MiB/s Receiving objects: 52% (37820/72729), 35.67 MiB | 23.78 MiB/s Receiving objects: 53% (38547/72729), 35.67 MiB | 23.78 MiB/s Receiving objects: 54% (39274/72729), 35.67 MiB | 23.78 MiB/s Receiving objects: 55% (40001/72729), 35.67 MiB | 23.78 MiB/s Receiving objects: 56% (40729/72729), 35.67 MiB | 23.78 MiB/s Receiving objects: 57% (41456/72729), 35.67 MiB | 23.78 MiB/s Receiving objects: 58% (42183/72729), 35.67 MiB | 23.78 MiB/s Receiving objects: 59% (42911/72729), 35.67 MiB | 23.78 MiB/s Receiving objects: 60% (43638/72729), 35.67 MiB | 23.78 MiB/s Receiving objects: 61% (44365/72729), 35.67 MiB | 23.78 MiB/s Receiving objects: 62% (45092/72729), 35.67 MiB | 23.78 MiB/s Receiving objects: 63% (45820/72729), 35.67 MiB | 23.78 MiB/s Receiving objects: 64% (46547/72729), 35.67 MiB | 23.78 MiB/s Receiving objects: 65% (47274/72729), 35.67 MiB | 23.78 MiB/s Receiving objects: 65% (47653/72729), 35.67 MiB | 23.78 MiB/s Receiving objects: 66% (48002/72729), 60.26 MiB | 30.13 MiB/s Receiving objects: 67% (48729/72729), 60.26 MiB | 30.13 MiB/s Receiving objects: 68% (49456/72729), 60.26 MiB | 30.13 MiB/s Receiving objects: 69% (50184/72729), 60.26 MiB | 30.13 MiB/s Receiving objects: 70% (50911/72729), 60.26 MiB | 30.13 MiB/s Receiving objects: 71% (51638/72729), 60.26 MiB | 30.13 MiB/s Receiving objects: 72% (52365/72729), 60.26 MiB | 30.13 MiB/s Receiving objects: 73% (53093/72729), 60.26 MiB | 30.13 MiB/s Receiving objects: 74% (53820/72729), 60.26 MiB | 30.13 MiB/s Receiving objects: 75% (54547/72729), 78.22 MiB | 31.26 MiB/s Receiving objects: 76% (55275/72729), 78.22 MiB | 31.26 MiB/s Receiving objects: 77% (56002/72729), 78.22 MiB | 31.26 MiB/s Receiving objects: 78% (56729/72729), 78.22 MiB | 31.26 MiB/s Receiving objects: 79% (57456/72729), 78.22 MiB | 31.26 MiB/s Receiving objects: 80% (58184/72729), 78.22 MiB | 31.26 MiB/s Receiving objects: 81% (58911/72729), 78.22 MiB | 31.26 MiB/s Receiving objects: 82% (59638/72729), 78.22 MiB | 31.26 MiB/s Receiving objects: 83% (60366/72729), 78.22 MiB | 31.26 MiB/s Receiving objects: 84% (61093/72729), 78.22 MiB | 31.26 MiB/s Receiving objects: 85% (61820/72729), 78.22 MiB | 31.26 MiB/s Receiving objects: 86% (62547/72729), 78.22 MiB | 31.26 MiB/s Receiving objects: 86% (62647/72729), 94.82 MiB | 31.58 MiB/s Receiving objects: 87% (63275/72729), 94.82 MiB | 31.58 MiB/s Receiving objects: 88% (64002/72729), 94.82 MiB | 31.58 MiB/s Receiving objects: 89% (64729/72729), 94.82 MiB | 31.58 MiB/s Receiving objects: 90% (65457/72729), 94.82 MiB | 31.58 MiB/s Receiving objects: 91% (66184/72729), 94.82 MiB | 31.58 MiB/s Receiving objects: 92% (66911/72729), 94.82 MiB | 31.58 MiB/s Receiving objects: 93% (67638/72729), 94.82 MiB | 31.58 MiB/s Receiving objects: 94% (68366/72729), 94.82 MiB | 31.58 MiB/s Receiving objects: 95% (69093/72729), 94.82 MiB | 31.58 MiB/s Receiving objects: 96% (69820/72729), 94.82 MiB | 31.58 MiB/s Receiving objects: 97% (70548/72729), 94.82 MiB | 31.58 MiB/s Receiving objects: 98% (71275/72729), 94.82 MiB | 31.58 MiB/s Receiving objects: 99% (72002/72729), 112.65 MiB | 32.16 MiB/s remote: Total 72729 (delta 7152), reused 6971 (delta 6530), pack-reused 64178 (from 2)
  7. 8.04 s Receiving objects: 100% (72729/72729), 112.65 MiB | 32.16 MiB/s Receiving objects: 100% (72729/72729), 116.72 MiB | 32.10 MiB/s, done.
  8. 9.74 s Resolving deltas: 0% (0/50471) Resolving deltas: 1% (505/50471) Resolving deltas: 2% (1012/50471) Resolving deltas: 3% (1515/50471) Resolving deltas: 4% (2019/50471) Resolving deltas: 5% (2524/50471) Resolving deltas: 6% (3029/50471) Resolving deltas: 7% (3533/50471) Resolving deltas: 8% (4038/50471) Resolving deltas: 9% (4543/50471) Resolving deltas: 10% (5048/50471) Resolving deltas: 11% (5552/50471) Resolving deltas: 12% (6057/50471) Resolving deltas: 13% (6562/50471) Resolving deltas: 14% (7067/50471) Resolving deltas: 15% (7571/50471) Resolving deltas: 16% (8076/50471) Resolving deltas: 17% (8582/50471) Resolving deltas: 18% (9085/50471) Resolving deltas: 19% (9590/50471) Resolving deltas: 20% (10095/50471) Resolving deltas: 21% (10599/50471) Resolving deltas: 22% (11104/50471) Resolving deltas: 23% (11609/50471) Resolving deltas: 24% (12114/50471) Resolving deltas: 25% (12618/50471) Resolving deltas: 26% (13123/50471) Resolving deltas: 27% (13628/50471) Resolving deltas: 28% (14132/50471) Resolving deltas: 29% (14637/50471) Resolving deltas: 30% (15142/50471) Resolving deltas: 31% (15647/50471) Resolving deltas: 32% (16151/50471) Resolving deltas: 33% (16656/50471) Resolving deltas: 34% (17161/50471) Resolving deltas: 35% (17666/50471) Resolving deltas: 36% (18170/50471) Resolving deltas: 37% (18676/50471) Resolving deltas: 38% (19179/50471) Resolving deltas: 39% (19684/50471) Resolving deltas: 40% (20189/50471) Resolving deltas: 41% (20694/50471) Resolving deltas: 42% (21198/50471) Resolving deltas: 43% (21703/50471) Resolving deltas: 44% (22208/50471) Resolving deltas: 45% (22712/50471) Resolving deltas: 46% (23217/50471) Resolving deltas: 47% (23722/50471) Resolving deltas: 48% (24227/50471) Resolving deltas: 49% (24731/50471) Resolving deltas: 50% (25236/50471) Resolving deltas: 51% (25741/50471) Resolving deltas: 52% (26245/50471) Resolving deltas: 53% (26750/50471) Resolving deltas: 54% (27255/50471) Resolving deltas: 55% (27760/50471) Resolving deltas: 56% (28264/50471) Resolving deltas: 57% (28769/50471) Resolving deltas: 58% (29275/50471) Resolving deltas: 59% (29778/50471) Resolving deltas: 60% (30283/50471) Resolving deltas: 61% (30788/50471) Resolving deltas: 62% (31293/50471) Resolving deltas: 63% (31797/50471) Resolving deltas: 64% (32302/50471) Resolving deltas: 65% (32809/50471) Resolving deltas: 65% (33247/50471) Resolving deltas: 66% (33312/50471) Resolving deltas: 67% (33816/50471) Resolving deltas: 68% (34321/50471) Resolving deltas: 69% (34825/50471) Resolving deltas: 70% (35330/50471) Resolving deltas: 71% (35835/50471) Resolving deltas: 72% (36340/50471) Resolving deltas: 73% (36844/50471) Resolving deltas: 74% (37349/50471) Resolving deltas: 75% (37854/50471) Resolving deltas: 76% (38358/50471) Resolving deltas: 77% (38863/50471) Resolving deltas: 78% (39368/50471) Resolving deltas: 79% (39873/50471) Resolving deltas: 80% (40378/50471) Resolving deltas: 81% (40883/50471) Resolving deltas: 82% (41387/50471) Resolving deltas: 83% (41891/50471) Resolving deltas: 84% (42398/50471) Resolving deltas: 85% (42901/50471) Resolving deltas: 86% (43406/50471) Resolving deltas: 87% (43910/50471) Resolving deltas: 88% (44415/50471) Resolving deltas: 89% (44920/50471) Resolving deltas: 90% (45424/50471) Resolving deltas: 91% (45929/50471) Resolving deltas: 92% (46434/50471) Resolving deltas: 93% (46939/50471) Resolving deltas: 94% (47443/50471) Resolving deltas: 95% (47948/50471) Resolving deltas: 96% (48453/50471) Resolving deltas: 97% (48957/50471) Resolving deltas: 98% (49462/50471) Resolving deltas: 99% (49967/50471) Resolving deltas: 100% (50471/50471) Resolving deltas: 100% (50471/50471), done.
  9. 10.31 s Fetching commit addf846a86d5a791511c2064b2a5cac7c6e6e211 for docs ...
  10. 10.31 s $ /nix/store/bcnisk3ydfgv26v2gw3zlky24g00yww2-git-2.54.0/bin/git fetch origin addf846a86d5a791511c2064b2a5cac7c6e6e211
  11. 10.88 s From https://github.com/alphal00p/gammaloop
  12. 10.88 s * branch addf846a86d5a791511c2064b2a5cac7c6e6e211 -> FETCH_HEAD
  13. 10.93 s $ /nix/store/9ypz3flqsrl5xl495mm8h645gadjsxi1-coreutils-9.11/bin/timeout --kill-after=15s 7200s /nix/store/bcnisk3ydfgv26v2gw3zlky24g00yww2-git-2.54.0/bin/git -c advice.detachedHead=false checkout addf846a86d5a791511c2064b2a5cac7c6e6e211
  14. 11.27 s HEAD is now at addf846a8 speed up incremental documentation watches
  15. 11.28 s $ /nix/store/9ypz3flqsrl5xl495mm8h645gadjsxi1-coreutils-9.11/bin/timeout --kill-after=15s 7200s /nix/store/23zk8sgzamrbmj1fday15szf7f2279s8-nix-2.34.7/bin/nix --extra-experimental-features nix-command --extra-experimental-features flakes --log-format internal-json run .#packages.x86_64-linux.nix-ci-check-gammaloop-nextest-core --print-build-logs
  16. 11.82 s stdenv.isDarwin is deprecated, use stdenv.hostPlatform.isDarwin instead
  17. 20.69 s
  18. 20.82 s Downloading cached gammaloop-nextest-binaries-core-gammaloop-tracing-filter-macros from https://cache.nix-ci.com
  19. 20.86 s Downloading cached gammaloop-nextest-binaries-core-gammaloop-api from https://cache.nix-ci.com
  20. 20.87 s Downloading cached gammaloop-nextest-binaries-core-gammalooprs from https://cache.nix-ci.com
  21. 20.87 s Downloading cached gammaloop-nextest-binaries-core-gammaloop-tracing-filter from https://cache.nix-ci.com
  22. 21.08 s Downloaded cached gammaloop-nextest-binaries-core-gammaloop-tracing-filter-macros (2.2 MiB) in 258ms
  23. 21.08 s Progress: 0 of 1 built, 1 of 6 downloaded from cache (3 downloading)
  24. 21.39 s Downloaded cached gammaloop-nextest-binaries-core-gammaloop-tracing-filter (8.5 MiB) in 527ms
  25. 21.39 s Progress: 0 of 1 built, 2 of 6 downloaded from cache (2 downloading)
  26. 22.53 s Downloaded cached gammaloop-nextest-binaries-core-gammaloop-api (70.2 MiB) in 1.6s
  27. 22.53 s Progress: 0 of 1 built, 3 of 6 downloaded from cache (1 downloading)
  28. 22.67 s Downloaded cached gammaloop-nextest-binaries-core-gammalooprs (81.2 MiB) in 1.8s
  29. 22.67 s Progress: 0 of 1 built, 4 of 6 downloaded from cache
  30. 22.67 s Downloading cached gammaloop-nextest-binaries-core from https://cache.nix-ci.com
  31. 22.72 s Downloaded cached gammaloop-nextest-binaries-core (1640 B) in 53ms
  32. 22.72 s Progress: 0 of 1 built, 5 of 6 downloaded from cache
  33. 22.72 s Downloading cached nix-ci-check-gammaloop-nextest-core from https://cache.nix-ci.com
  34. 22.79 s Downloaded cached nix-ci-check-gammaloop-nextest-core (1016 B) in 63ms
  35. 22.79 s Progress: 0 of 1 built, 6 of 6 downloaded from cache
  36. 23.15 s evaluating derivation 'gevaluation warning: stdenv.isDarwin is deprecated, use stdenv.hostPlatform.isDarwin instead
  37. 31.64 s copying '/nix/store/f05i evaluating derivation 'g copying '/nix/store/f05i evaluating derivation 'g copying '/nix/store/f05i evaluating derivation 'g copying '/nix/store/f05i evaluating derivation 'g copying '/nix/store/f05i evaluating derivation 'g copying '/nix/store/f05i evaluating derivation 'g copying '/nix/store/f05i evaluating derivation 'g copying '/nix/store/f05i evaluating derivation 'g copying '/nix/store/f05i evaluating derivation 'g copying '/nix/store/f05i evaluating derivation 'g copying '/nix/store/f05i evaluating derivation 'g querying gammaloop-nexte [0/7 built, 0.0 KiB DL] [0/1 built, 0.0 KiB DL] [1/0/1 built, 0.0 KiB DLgammaloop-nextest-core> Extracting 4 binaries (including 2 non-test binaries), 1 build script output directory, and 2 linked paths to /build/nextest-archive-BE1o8x
  38. 32.18 s gammaloop-nextest-core> Extracted 20 files to /build/nextest-archive-BE1o8x in 0.55s
  39. 32.22 s gammaloop-nextest-core> ------------
  40. 32.22 s gammaloop-nextest-core> Nextest run ID 9dee5dcf-fa85-4bd9-bc9c-6a1a25c1154b with nextest profile: ci_gammaloop
  41. 32.22 s gammaloop-nextest-core> Starting 339 tests across 2 binaries
  42. 32.97 s gammaloop-nextest-core> FAIL [ 0.042s] (247/339) gammaloop-api repl::tests::completion_shows_type_hint_for_non_boolean_settings_leaf
  43. 32.97 s gammaloop-nextest-core> stdout ---
  44. 32.97 s gammaloop-nextest-core>
  45. 32.97 s gammaloop-nextest-core> running 1 test
  46. 32.97 s gammaloop-nextest-core> test repl::tests::completion_shows_type_hint_for_non_boolean_settings_leaf ... FAILED
  47. 32.97 s gammaloop-nextest-core>
  48. 32.97 s gammaloop-nextest-core> failures:
  49. 32.97 s gammaloop-nextest-core>
  50. 32.97 s gammaloop-nextest-core> failures:
  51. 32.97 s gammaloop-nextest-core> repl::tests::completion_shows_type_hint_for_non_boolean_settings_leaf
  52. 32.97 s gammaloop-nextest-core>
  53. 32.97 s gammaloop-nextest-core> test result: FAILED. 0 passed; 1 failed; 0 ignored; 0 measured; 338 filtered out; finished in 0.02s
  54. 32.97 s gammaloop-nextest-core>
  55. 32.97 s gammaloop-nextest-core> stderr ---
  56. 32.97 s gammaloop-nextest-core>
  57. 32.97 s gammaloop-nextest-core> thread 'repl::tests::completion_shows_type_hint_for_non_boolean_settings_leaf' (750) panicked at crates/gammaloop-api/src/repl.rs:5778:9:
  58. 32.97 s gammaloop-nextest-core> [Suggestion { value: "", description: Some("Number of samples in the first Monte Carlo iteration."), style: None, extra: None, span: Span { start: 42, end: 42 }, append_whitespace: false }]
  59. 32.97 s gammaloop-nextest-core> stack backtrace:
  60. 32.97 s gammaloop-nextest-core> 0: __rustc::rust_begin_unwind
  61. 32.97 s gammaloop-nextest-core> 1: core::panicking::panic_fmt
  62. 32.97 s gammaloop-nextest-core> 2: gammaloop_api::repl::tests::completion_shows_type_hint_for_non_boolean_settings_leaf
  63. 32.97 s gammaloop-nextest-core> 3: <gammaloop_api::repl::tests::completion_shows_type_hint_for_non_boolean_settings_leaf::{closure#0} as core::ops::function::FnOnce<()>>::call_once
  64. 32.97 s gammaloop-nextest-core> note: Some details are omitted, run with `RUST_BACKTRACE=full` for a verbose backtrace.
  65. 32.97 s gammaloop-nextest-core>
  66. 33.34 s gammaloop-nextest-core> ------------
  67. 33.34 s gammaloop-nextest-core> Summary [ 1.114s] 339 tests run: 338 passed, 1 failed, 0 skipped
  68. 33.34 s gammaloop-nextest-core> FAIL [ 0.042s] (247/339) gammaloop-api repl::tests::completion_shows_type_hint_for_non_boolean_settings_leaf
  69. 33.34 s gammaloop-nextest-core> stdout ---
  70. 33.34 s gammaloop-nextest-core>
  71. 33.34 s gammaloop-nextest-core> running 1 test
  72. 33.34 s gammaloop-nextest-core> test repl::tests::completion_shows_type_hint_for_non_boolean_settings_leaf ... FAILED
  73. 33.34 s gammaloop-nextest-core>
  74. 33.34 s gammaloop-nextest-core> failures:
  75. 33.34 s gammaloop-nextest-core>
  76. 33.34 s gammaloop-nextest-core> failures:
  77. 33.34 s gammaloop-nextest-core> repl::tests::completion_shows_type_hint_for_non_boolean_settings_leaf
  78. 33.34 s gammaloop-nextest-core>
  79. 33.34 s gammaloop-nextest-core> test result: FAILED. 0 passed; 1 failed; 0 ignored; 0 measured; 338 filtered out; finished in 0.02s
  80. 33.34 s gammaloop-nextest-core>
  81. 33.34 s gammaloop-nextest-core> stderr ---
  82. 33.34 s gammaloop-nextest-core>
  83. 33.34 s gammaloop-nextest-core> thread 'repl::tests::completion_shows_type_hint_for_non_boolean_settings_leaf' (750) panicked at crates/gammaloop-api/src/repl.rs:5778:9:
  84. 33.34 s gammaloop-nextest-core> [Suggestion { value: "", description: Some("Number of samples in the first Monte Carlo iteration."), style: None, extra: None, span: Span { start: 42, end: 42 }, append_whitespace: false }]
  85. 33.34 s gammaloop-nextest-core> stack backtrace:
  86. 33.34 s gammaloop-nextest-core> 0: __rustc::rust_begin_unwind
  87. 33.34 s gammaloop-nextest-core> 1: core::panicking::panic_fmt
  88. 33.34 s gammaloop-nextest-core> 2: gammaloop_api::repl::tests::completion_shows_type_hint_for_non_boolean_settings_leaf
  89. 33.34 s gammaloop-nextest-core> 3: <gammaloop_api::repl::tests::completion_shows_type_hint_for_non_boolean_settings_leaf::{closure#0} as core::ops::function::FnOnce<()>>::call_once
  90. 33.34 s gammaloop-nextest-core> note: Some details are omitted, run with `RUST_BACKTRACE=full` for a verbose backtrace.
  91. 33.34 s gammaloop-nextest-core>
  92. 33.41 s gammaloop-nextest-core> error: test run failed
  93. 33.44 s gammaloop-nextest-core>
  94. 33.44 s gammaloop-nextest-core> ========== nextest test summary ==========
  95. 33.44 s gammaloop-nextest-core> report: target/nextest/ci_gammaloop/junit.xml
  96. 33.44 s gammaloop-nextest-core> tests: 339, failures: 1, errors: 0
  97. 33.44 s gammaloop-nextest-core>
  98. 33.44 s gammaloop-nextest-core> 1. gammaloop-api::repl::tests::completion_shows_type_hint_for_non_boolean_settings_leaf
  99. 33.44 s gammaloop-nextest-core> failure: test failure with exit code 101
  100. 33.44 s gammaloop-nextest-core> thread 'repl::tests::completion_shows_type_hint_for_non_boolean_settings_leaf' (750) panicked at crates/gammaloop-api/src/repl.rs:5778:9:
  101. 33.44 s gammaloop-nextest-core> [Suggestion { value: "", description: Some("Number of samples in the first Monte Carlo iteration."), style: None, extra: None, span: Span { start: 42, end: 42 }, append_whitespace: false }]
  102. 33.44 s gammaloop-nextest-core> stack backtrace:
  103. 33.44 s gammaloop-nextest-core> 0: __rustc::rust_begin_unwind
  104. 33.44 s gammaloop-nextest-core> 1: core::panicking::panic_fmt
  105. 33.44 s gammaloop-nextest-core> 2: gammaloop_api::repl::tests::completion_shows_type_hint_for_non_boolean_settings_leaf
  106. 33.44 s gammaloop-nextest-core> 3: <gammaloop_api::repl::tests::completion_shows_type_hint_for_non_boolean_settings_leaf::{closure#0} as core::ops::function::FnOnce<()>>::call_once
  107. 33.44 s gammaloop-nextest-core> note: Some details are omitted, run with `RUST_BACKTRACE=full` for a verbose backtrace.
  108. 33.44 s gammaloop-nextest-core> system-out
  109. 33.44 s gammaloop-nextest-core> running 1 test
  110. 33.44 s gammaloop-nextest-core> test repl::tests::completion_shows_type_hint_for_non_boolean_settings_leaf ... FAILED
  111. 33.44 s gammaloop-nextest-core>
  112. 33.45 s gammaloop-nextest-core> failures:
  113. 33.45 s gammaloop-nextest-core>
  114. 33.45 s gammaloop-nextest-core> failures:
  115. 33.45 s gammaloop-nextest-core> repl::tests::completion_shows_type_hint_for_non_boolean_settings_leaf
  116. 33.45 s gammaloop-nextest-core>
  117. 33.45 s gammaloop-nextest-core> test result: FAILED. 0 passed; 1 failed; 0 ignored; 0 measured; 338 filtered out; finished in 0.02s
  118. 33.45 s gammaloop-nextest-core> system-err
  119. 33.45 s gammaloop-nextest-core> thread 'repl::tests::completion_shows_type_hint_for_non_boolean_settings_leaf' (750) panicked at crates/gammaloop-api/src/repl.rs:5778:9:
  120. 33.45 s gammaloop-nextest-core> [Suggestion { value: "", description: Some("Number of samples in the first Monte Carlo iteration."), style: None, extra: None, span: Span { start: 42, end: 42 }, append_whitespace: false }]
  121. 33.45 s gammaloop-nextest-core> stack backtrace:
  122. 33.45 s gammaloop-nextest-core> 0: __rustc::rust_begin_unwind
  123. 33.45 s gammaloop-nextest-core> 1: core::panicking::panic_fmt
  124. 33.45 s gammaloop-nextest-core> 2: gammaloop_api::repl::tests::completion_shows_type_hint_for_non_boolean_settings_leaf
  125. 33.45 s gammaloop-nextest-core> 3: <gammaloop_api::repl::tests::completion_shows_type_hint_for_non_boolean_settings_leaf::{closure#0} as core::ops::function::FnOnce<()>>::call_once
  126. 33.45 s gammaloop-nextest-core> note: Some details are omitted, run with `RUST_BACKTRACE=full` for a verbose backtrace.
  127. 33.45 s gammaloop-nextest-core> =========================================
  128. 33.47 s gammaloop-nextest-core> Extracting 1 binary and 1 linked path to /build/nextest-archive-ASAL1J
  129. 33.59 s gammaloop-nextest-core> Extracted 7 files to /build/nextest-archive-ASAL1J in 0.12s
  130. 33.63 s gammaloop-nextest-core> ------------
  131. 33.63 s gammaloop-nextest-core> Nextest run ID 255bf931-7867-4860-a90e-4e2e2f705ea7 with nextest profile: ci_gammaloop
  132. 33.63 s gammaloop-nextest-core> Starting 19 tests across 1 binary
  133. 33.68 s gammaloop-nextest-core> ------------
  134. 33.68 s gammaloop-nextest-core> Summary [ 0.055s] 19 tests run: 19 passed, 0 skipped
  135. 33.76 s gammaloop-nextest-core>
  136. 33.76 s gammaloop-nextest-core> ========== nextest test summary ==========
  137. 33.76 s gammaloop-nextest-core> report: target/nextest/ci_gammaloop/junit.xml
  138. 33.76 s gammaloop-nextest-core> tests: 19, failures: 0, errors: 0
  139. 33.76 s gammaloop-nextest-core> No failing testcases found.
  140. 33.76 s gammaloop-nextest-core> =========================================
  141. 33.79 s gammaloop-nextest-core> Extracting 1 binary to /build/nextest-archive-FFNgQ0
  142. 33.86 s gammaloop-nextest-core> Extracted 4 files to /build/nextest-archive-FFNgQ0 in 0.07s
  143. 33.90 s gammaloop-nextest-core> ------------
  144. 33.90 s gammaloop-nextest-core> Nextest run ID 6f90b74b-7036-4561-8968-021b5975c942 with nextest profile: ci_gammaloop
  145. 33.90 s gammaloop-nextest-core> Starting 0 tests across 1 binary
  146. 33.90 s gammaloop-nextest-core> ------------
  147. 33.90 s gammaloop-nextest-core> Summary [ 0.007s] 0 tests run: 0 passed, 0 skipped
  148. 33.98 s gammaloop-nextest-core>
  149. 33.98 s gammaloop-nextest-core> ========== nextest test summary ==========
  150. 33.98 s gammaloop-nextest-core> report: target/nextest/ci_gammaloop/junit.xml
  151. 33.98 s gammaloop-nextest-core> tests: 0, failures: 0, errors: 0
  152. 33.98 s gammaloop-nextest-core> No failing testcases found.
  153. 33.98 s gammaloop-nextest-core> =========================================
  154. 34.02 s gammaloop-nextest-core> Extracting 5 binaries (including 1 non-test binary), 1 build script output directory, and 2 linked paths to /build/nextest-archive-RnK5vs
  155. 34.84 s gammaloop-nextest-core> Extracted 20 files to /build/nextest-archive-RnK5vs in 0.82s
  156. 34.93 s gammaloop-nextest-core> ------------
  157. 34.93 s gammaloop-nextest-core> Nextest run ID af1ef9de-48c3-4c4b-96ef-3504cf8a4c88 with nextest profile: ci_gammaloop
  158. 34.93 s gammaloop-nextest-core> Starting 457 tests across 4 binaries (61 tests skipped, including 60 tests via profile.ci_gammaloop.default-filter)
  159. 57.18 s gammaloop-nextest-core> ------------
  160. 57.18 s gammaloop-nextest-core> Summary [ 22.242s] 457 tests run: 457 passed, 61 skipped
  161. 57.33 s gammaloop-nextest-core>
  162. 57.33 s gammaloop-nextest-core> ========== nextest test summary ==========
  163. 57.33 s gammaloop-nextest-core> report: target/nextest/ci_gammaloop/junit.xml
  164. 57.33 s gammaloop-nextest-core> tests: 457, failures: 0, errors: 0
  165. 57.33 s gammaloop-nextest-core> No failing testcases found.
  166. 57.33 s gammaloop-nextest-core> =========================================
  167. 57.42 s error: Cannot build '/nix/store/dqj1sqrcfxmqf14fv5ym0nk1rih9zpzm-gammaloop-nextest-core.drv'.
  168. 57.42 s Reason: builder failed with exit code 100.
  169. 57.42 s Output paths:
  170. 57.42 s /nix/store/vxcznnsaxgfisfjz8g2rl8wr4c2bkfi1-gammaloop-nextest-core
  171. 57.42 s Last 130 log lines:
  172. 57.42 s > Extracting 4 binaries (including 2 non-test binaries), 1 build script output directory, and 2 linked paths to /build/nextest-archive-BE1o8x
  173. 57.42 s > Extracted 20 files to /build/nextest-archive-BE1o8x in 0.55s
  174. 57.42 s > ------------
  175. 57.42 s > Nextest run ID 9dee5dcf-fa85-4bd9-bc9c-6a1a25c1154b with nextest profile: ci_gammaloop
  176. 57.42 s > Starting 339 tests across 2 binaries
  177. 57.42 s > FAIL [ 0.042s] (247/339) gammaloop-api repl::tests::completion_shows_type_hint_for_non_boolean_settings_leaf
  178. 57.42 s > stdout ---
  179. 57.42 s >
  180. 57.42 s > running 1 test
  181. 57.42 s > test repl::tests::completion_shows_type_hint_for_non_boolean_settings_leaf ... FAILED
  182. 57.42 s >
  183. 57.42 s > failures:
  184. 57.42 s >
  185. 57.42 s > failures:
  186. 57.42 s > repl::tests::completion_shows_type_hint_for_non_boolean_settings_leaf
  187. 57.42 s >
  188. 57.42 s > test result: FAILED. 0 passed; 1 failed; 0 ignored; 0 measured; 338 filtered out; finished in 0.02s
  189. 57.42 s >
  190. 57.42 s > stderr ---
  191. 57.42 s >
  192. 57.42 s > thread 'repl::tests::completion_shows_type_hint_for_non_boolean_settings_leaf' (750) panicked at crates/gammaloop-api/src/repl.rs:5778:9:
  193. 57.42 s > [Suggestion { value: "", description: Some("Number of samples in the first Monte Carlo iteration."), style: None, extra: None, span: Span { start: 42, end: 42 }, append_whitespace: false }]
  194. 57.42 s > stack backtrace:
  195. 57.42 s > 0: __rustc::rust_begin_unwind
  196. 57.42 s > 1: core::panicking::panic_fmt
  197. 57.42 s > 2: gammaloop_api::repl::tests::completion_shows_type_hint_for_non_boolean_settings_leaf
  198. 57.42 s > 3: <gammaloop_api::repl::tests::completion_shows_type_hint_for_non_boolean_settings_leaf::{closure#0} as core::ops::function::FnOnce<()>>::call_once
  199. 57.42 s > note: Some details are omitted, run with `RUST_BACKTRACE=full` for a verbose backtrace.
  200. 57.42 s >
  201. 57.42 s > ------------
  202. 57.42 s > Summary [ 1.114s] 339 tests run: 338 passed, 1 failed, 0 skipped
  203. 57.42 s > FAIL [ 0.042s] (247/339) gammaloop-api repl::tests::completion_shows_type_hint_for_non_boolean_settings_leaf
  204. 57.42 s > stdout ---
  205. 57.42 s >
  206. 57.42 s > running 1 test
  207. 57.42 s > test repl::tests::completion_shows_type_hint_for_non_boolean_settings_leaf ... FAILED
  208. 57.42 s >
  209. 57.42 s > failures:
  210. 57.42 s >
  211. 57.42 s > failures:
  212. 57.42 s > repl::tests::completion_shows_type_hint_for_non_boolean_settings_leaf
  213. 57.42 s >
  214. 57.42 s > test result: FAILED. 0 passed; 1 failed; 0 ignored; 0 measured; 338 filtered out; finished in 0.02s
  215. 57.42 s >
  216. 57.42 s > stderr ---
  217. 57.42 s >
  218. 57.42 s > thread 'repl::tests::completion_shows_type_hint_for_non_boolean_settings_leaf' (750) panicked at crates/gammaloop-api/src/repl.rs:5778:9:
  219. 57.42 s > [Suggestion { value: "", description: Some("Number of samples in the first Monte Carlo iteration."), style: None, extra: None, span: Span { start: 42, end: 42 }, append_whitespace: false }]
  220. 57.42 s > stack backtrace:
  221. 57.42 s > 0: __rustc::rust_begin_unwind
  222. 57.42 s > 1: core::panicking::panic_fmt
  223. 57.42 s > 2: gammaloop_api::repl::tests::completion_shows_type_hint_for_non_boolean_settings_leaf
  224. 57.42 s > 3: <gammaloop_api::repl::tests::completion_shows_type_hint_for_non_boolean_settings_leaf::{closure#0} as core::ops::function::FnOnce<()>>::call_once
  225. 57.42 s > note: Some details are omitted, run with `RUST_BACKTRACE=full` for a verbose backtrace.
  226. 57.42 s >
  227. 57.42 s > error: test run failed
  228. 57.42 s >
  229. 57.42 s > ========== nextest test summary ==========
  230. 57.42 s > report: target/nextest/ci_gammaloop/junit.xml
  231. 57.42 s > tests: 339, failures: 1, errors: 0
  232. 57.42 s >
  233. 57.42 s > 1. gammaloop-api::repl::tests::completion_shows_type_hint_for_non_boolean_settings_leaf
  234. 57.42 s > failure: test failure with exit code 101
  235. 57.42 s > thread 'repl::tests::completion_shows_type_hint_for_non_boolean_settings_leaf' (750) panicked at crates/gammaloop-api/src/repl.rs:5778:9:
  236. 57.42 s > [Suggestion { value: "", description: Some("Number of samples in the first Monte Carlo iteration."), style: None, extra: None, span: Span { start: 42, end: 42 }, append_whitespace: false }]
  237. 57.42 s > stack backtrace:
  238. 57.42 s > 0: __rustc::rust_begin_unwind
  239. 57.42 s > 1: core::panicking::panic_fmt
  240. 57.42 s > 2: gammaloop_api::repl::tests::completion_shows_type_hint_for_non_boolean_settings_leaf
  241. 57.42 s > 3: <gammaloop_api::repl::tests::completion_shows_type_hint_for_non_boolean_settings_leaf::{closure#0} as core::ops::function::FnOnce<()>>::call_once
  242. 57.42 s > note: Some details are omitted, run with `RUST_BACKTRACE=full` for a verbose backtrace.
  243. 57.42 s > system-out
  244. 57.42 s > running 1 test
  245. 57.42 s > test repl::tests::completion_shows_type_hint_for_non_boolean_settings_leaf ... FAILED
  246. 57.42 s >
  247. 57.42 s > failures:
  248. 57.42 s >
  249. 57.42 s > failures:
  250. 57.42 s > repl::tests::completion_shows_type_hint_for_non_boolean_settings_leaf
  251. 57.42 s >
  252. 57.42 s > test result: FAILED. 0 passed; 1 failed; 0 ignored; 0 measured; 338 filtered out; finished in 0.02s
  253. 57.42 s > system-err
  254. 57.42 s > thread 'repl::tests::completion_shows_type_hint_for_non_boolean_settings_leaf' (750) panicked at crates/gammaloop-api/src/repl.rs:5778:9:
  255. 57.42 s > [Suggestion { value: "", description: Some("Number of samples in the first Monte Carlo iteration."), style: None, extra: None, span: Span { start: 42, end: 42 }, append_whitespace: false }]
  256. 57.42 s > stack backtrace:
  257. 57.42 s > 0: __rustc::rust_begin_unwind
  258. 57.42 s > 1: core::panicking::panic_fmt
  259. 57.42 s > 2: gammaloop_api::repl::tests::completion_shows_type_hint_for_non_boolean_settings_leaf
  260. 57.42 s > 3: <gammaloop_api::repl::tests::completion_shows_type_hint_for_non_boolean_settings_leaf::{closure#0} as core::ops::function::FnOnce<()>>::call_once
  261. 57.42 s > note: Some details are omitted, run with `RUST_BACKTRACE=full` for a verbose backtrace.
  262. 57.42 s > =========================================
  263. 57.42 s > Extracting 1 binary and 1 linked path to /build/nextest-archive-ASAL1J
  264. 57.42 s > Extracted 7 files to /build/nextest-archive-ASAL1J in 0.12s
  265. 57.42 s > ------------
  266. 57.42 s > Nextest run ID 255bf931-7867-4860-a90e-4e2e2f705ea7 with nextest profile: ci_gammaloop
  267. 57.42 s > Starting 19 tests across 1 binary
  268. 57.42 s > ------------
  269. 57.42 s > Summary [ 0.055s] 19 tests run: 19 passed, 0 skipped
  270. 57.42 s >
  271. 57.42 s > ========== nextest test summary ==========
  272. 57.42 s > report: target/nextest/ci_gammaloop/junit.xml
  273. 57.42 s > tests: 19, failures: 0, errors: 0
  274. 57.42 s > No failing testcases found.
  275. 57.42 s > =========================================
  276. 57.42 s > Extracting 1 binary to /build/nextest-archive-FFNgQ0
  277. 57.42 s > Extracted 4 files to /build/nextest-archive-FFNgQ0 in 0.07s
  278. 57.42 s > ------------
  279. 57.42 s > Nextest run ID 6f90b74b-7036-4561-8968-021b5975c942 with nextest profile: ci_gammaloop
  280. 57.42 s > Starting 0 tests across 1 binary
  281. 57.42 s > ------------
  282. 57.42 s > Summary [ 0.007s] 0 tests run: 0 passed, 0 skipped
  283. 57.42 s >
  284. 57.42 s > ========== nextest test summary ==========
  285. 57.42 s > report: target/nextest/ci_gammaloop/junit.xml
  286. 57.42 s > tests: 0, failures: 0, errors: 0
  287. 57.42 s > No failing testcases found.
  288. 57.42 s > =========================================
  289. 57.42 s > Extracting 5 binaries (including 1 non-test binary), 1 build script output directory, and 2 linked paths to /build/nextest-archive-RnK5vs
  290. 57.42 s > Extracted 20 files to /build/nextest-archive-RnK5vs in 0.82s
  291. 57.42 s > ------------
  292. 57.42 s > Nextest run ID af1ef9de-48c3-4c4b-96ef-3504cf8a4c88 with nextest profile: ci_gammaloop
  293. 57.42 s > Starting 457 tests across 4 binaries (61 tests skipped, including 60 tests via profile.ci_gammaloop.default-filter)
  294. 57.42 s > ------------
  295. 57.42 s > Summary [ 22.242s] 457 tests run: 457 passed, 61 skipped
  296. 57.42 s >
  297. 57.42 s > ========== nextest test summary ==========
  298. 57.42 s > report: target/nextest/ci_gammaloop/junit.xml
  299. 57.42 s > tests: 457, failures: 0, errors: 0
  300. 57.42 s > No failing testcases found.
  301. 57.42 s > =========================================
  302. 57.42 s For full logs, run:
  303. 57.42 s nix log /nix/store/dqj1sqrcfxmqf14fv5ym0nk1rih9zpzm-gammaloop-nextest-core.drv
  304. 57.62 s [0 built (1 failed), 0.0Run failed.