0.26 s
$ /nix/store/9ypz3flqsrl5xl495mm8h645gadjsxi1-coreutils-9.11/bin/timeout --kill-after=15s 7200s /nix/store/23zk8sgzamrbmj1fday15szf7f2279s8-nix-2.34.7/bin/nix --extra-experimental-features nix-command --extra-experimental-features flakes flake clone git+https://github.com/alphal00p/gammaloop --dest /tmp/nix-ci-worker/stable-pwd/repo/
0.50 s
Cloning into '/tmp/nix-ci-worker/stable-pwd/repo'...
1.59 s
remote: Enumerating objects: 66329, done.
1.69 s
remote: Counting objects: 0% (1/9001)
remote: Counting objects: 1% (91/9001)
remote: Counting objects: 2% (181/9001)
remote: Counting objects: 3% (271/9001)
remote: Counting objects: 4% (361/9001)
remote: Counting objects: 5% (451/9001)
remote: Counting objects: 6% (541/9001)
remote: Counting objects: 7% (631/9001)
remote: Counting objects: 8% (721/9001)
remote: Counting objects: 9% (811/9001)
remote: Counting objects: 10% (901/9001)
remote: Counting objects: 11% (991/9001)
remote: Counting objects: 12% (1081/9001)
remote: Counting objects: 13% (1171/9001)
remote: Counting objects: 14% (1261/9001)
remote: Counting objects: 15% (1351/9001)
remote: Counting objects: 16% (1441/9001)
remote: Counting objects: 17% (1531/9001)
remote: Counting objects: 18% (1621/9001)
remote: Counting objects: 19% (1711/9001)
remote: Counting objects: 20% (1801/9001)
remote: Counting objects: 21% (1891/9001)
remote: Counting objects: 22% (1981/9001)
remote: Counting objects: 23% (2071/9001)
remote: Counting objects: 24% (2161/9001)
remote: Counting objects: 25% (2251/9001)
remote: Counting objects: 26% (2341/9001)
remote: Counting objects: 27% (2431/9001)
remote: Counting objects: 28% (2521/9001)
remote: Counting objects: 29% (2611/9001)
remote: Counting objects: 30% (2701/9001)
remote: Counting objects: 31% (2791/9001)
remote: Counting objects: 32% (2881/9001)
remote: Counting objects: 33% (2971/9001)
remote: Counting objects: 34% (3061/9001)
remote: Counting objects: 35% (3151/9001)
remote: Counting objects: 36% (3241/9001)
remote: Counting objects: 37% (3331/9001)
remote: Counting objects: 38% (3421/9001)
remote: Counting objects: 39% (3511/9001)
remote: Counting objects: 40% (3601/9001)
remote: Counting objects: 41% (3691/9001)
remote: Counting objects: 42% (3781/9001)
remote: Counting objects: 43% (3871/9001)
remote: Counting objects: 44% (3961/9001)
remote: Counting objects: 45% (4051/9001)
remote: Counting objects: 46% (4141/9001)
remote: Counting objects: 47% (4231/9001)
remote: Counting objects: 48% (4321/9001)
remote: Counting objects: 49% (4411/9001)
remote: Counting objects: 50% (4501/9001)
remote: Counting objects: 51% (4591/9001)
remote: Counting objects: 52% (4681/9001)
remote: Counting objects: 53% (4771/9001)
remote: Counting objects: 54% (4861/9001)
remote: Counting objects: 55% (4951/9001)
remote: Counting objects: 56% (5041/9001)
remote: Counting objects: 57% (5131/9001)
remote: Counting objects: 58% (5221/9001)
remote: Counting objects: 59% (5311/9001)
remote: Counting objects: 60% (5401/9001)
remote: Counting objects: 61% (5491/9001)
remote: Counting objects: 62% (5581/9001)
remote: Counting objects: 63% (5671/9001)
remote: Counting objects: 64% (5761/9001)
remote: Counting objects: 65% (5851/9001)
remote: Counting objects: 66% (5941/9001)
remote: Counting objects: 67% (6031/9001)
remote: Counting objects: 68% (6121/9001)
remote: Counting objects: 69% (6211/9001)
remote: Counting objects: 70% (6301/9001)
remote: Counting objects: 71% (6391/9001)
remote: Counting objects: 72% (6481/9001)
remote: Counting objects: 73% (6571/9001)
remote: Counting objects: 74% (6661/9001)
remote: Counting objects: 75% (6751/9001)
remote: Counting objects: 76% (6841/9001)
remote: Counting objects: 77% (6931/9001)
remote: Counting objects: 78% (7021/9001)
remote: Counting objects: 79% (7111/9001)
remote: Counting objects: 80% (7201/9001)
remote: Counting objects: 81% (7291/9001)
remote: Counting objects: 82% (7381/9001)
remote: Counting objects: 83% (7471/9001)
remote: Counting objects: 84% (7561/9001)
remote: Counting objects: 85% (7651/9001)
remote: Counting objects: 86% (7741/9001)
remote: Counting objects: 87% (7831/9001)
remote: Counting objects: 88% (7921/9001)
remote: Counting objects: 89% (8011/9001)
remote: Counting objects: 90% (8101/9001)
remote: Counting objects: 91% (8191/9001)
remote: Counting objects: 92% (8281/9001)
remote: Counting objects: 93% (8371/9001)
remote: Counting objects: 94% (8461/9001)
remote: Counting objects: 95% (8551/9001)
remote: Counting objects: 96% (8641/9001)
remote: Counting objects: 97% (8731/9001)
remote: Counting objects: 98% (8821/9001)
remote: Counting objects: 99% (8911/9001)
remote: Counting objects: 100% (9001/9001)
remote: Counting objects: 100% (9001/9001), done.
4.02 s
remote: Compressing objects: 0% (1/2111)
remote: Compressing objects: 1% (22/2111)
remote: Compressing objects: 2% (43/2111)
remote: Compressing objects: 3% (64/2111)
remote: Compressing objects: 4% (85/2111)
remote: Compressing objects: 5% (106/2111)
remote: Compressing objects: 6% (127/2111)
remote: Compressing objects: 7% (148/2111)
remote: Compressing objects: 8% (169/2111)
remote: Compressing objects: 9% (190/2111)
remote: Compressing objects: 10% (212/2111)
remote: Compressing objects: 11% (233/2111)
remote: Compressing objects: 12% (254/2111)
remote: Compressing objects: 13% (275/2111)
remote: Compressing objects: 14% (296/2111)
remote: Compressing objects: 15% (317/2111)
remote: Compressing objects: 16% (338/2111)
remote: Compressing objects: 17% (359/2111)
remote: Compressing objects: 18% (380/2111)
remote: Compressing objects: 19% (402/2111)
remote: Compressing objects: 20% (423/2111)
remote: Compressing objects: 20% (443/2111)
remote: Compressing objects: 21% (444/2111)
remote: Compressing objects: 22% (465/2111)
remote: Compressing objects: 23% (486/2111)
remote: Compressing objects: 24% (507/2111)
remote: Compressing objects: 25% (528/2111)
remote: Compressing objects: 26% (549/2111)
remote: Compressing objects: 27% (570/2111)
remote: Compressing objects: 28% (592/2111)
remote: Compressing objects: 29% (613/2111)
remote: Compressing objects: 29% (631/2111)
remote: Compressing objects: 30% (634/2111)
remote: Compressing objects: 31% (655/2111)
remote: Compressing objects: 32% (676/2111)
remote: Compressing objects: 33% (697/2111)
remote: Compressing objects: 34% (718/2111)
remote: Compressing objects: 35% (739/2111)
remote: Compressing objects: 36% (760/2111)
remote: Compressing objects: 37% (782/2111)
remote: Compressing objects: 38% (803/2111)
remote: Compressing objects: 39% (824/2111)
remote: Compressing objects: 40% (845/2111)
remote: Compressing objects: 41% (866/2111)
remote: Compressing objects: 42% (887/2111)
remote: Compressing objects: 43% (908/2111)
remote: Compressing objects: 44% (929/2111)
remote: Compressing objects: 45% (950/2111)
remote: Compressing objects: 46% (972/2111)
remote: Compressing objects: 47% (993/2111)
remote: Compressing objects: 48% (1014/2111)
remote: Compressing objects: 49% (1035/2111)
remote: Compressing objects: 50% (1056/2111)
remote: Compressing objects: 51% (1077/2111)
remote: Compressing objects: 52% (1098/2111)
remote: Compressing objects: 53% (1119/2111)
remote: Compressing objects: 54% (1140/2111)
remote: Compressing objects: 55% (1162/2111)
remote: Compressing objects: 56% (1183/2111)
remote: Compressing objects: 57% (1204/2111)
remote: Compressing objects: 58% (1225/2111)
remote: Compressing objects: 59% (1246/2111)
remote: Compressing objects: 60% (1267/2111)
remote: Compressing objects: 61% (1288/2111)
remote: Compressing objects: 62% (1309/2111)
remote: Compressing objects: 63% (1330/2111)
remote: Compressing objects: 64% (1352/2111)
remote: Compressing objects: 65% (1373/2111)
remote: Compressing objects: 66% (1394/2111)
remote: Compressing objects: 67% (1415/2111)
remote: Compressing objects: 68% (1436/2111)
remote: Compressing objects: 69% (1457/2111)
remote: Compressing objects: 70% (1478/2111)
remote: Compressing objects: 71% (1499/2111)
remote: Compressing objects: 72% (1520/2111)
remote: Compressing objects: 73% (1542/2111)
remote: Compressing objects: 74% (1563/2111)
remote: Compressing objects: 75% (1584/2111)
remote: Compressing objects: 76% (1605/2111)
remote: Compressing objects: 77% (1626/2111)
remote: Compressing objects: 78% (1647/2111)
remote: Compressing objects: 79% (1668/2111)
remote: Compressing objects: 80% (1689/2111)
remote: Compressing objects: 81% (1710/2111)
remote: Compressing objects: 82% (1732/2111)
remote: Compressing objects: 83% (1753/2111)
remote: Compressing objects: 84% (1774/2111)
remote: Compressing objects: 85% (1795/2111)
remote: Compressing objects: 86% (1816/2111)
remote: Compressing objects: 87% (1837/2111)
remote: Compressing objects: 88% (1858/2111)
remote: Compressing objects: 89% (1879/2111)
remote: Compressing objects: 90% (1900/2111)
remote: Compressing objects: 91% (1922/2111)
remote: Compressing objects: 92% (1943/2111)
remote: Compressing objects: 93% (1964/2111)
remote: Compressing objects: 94% (1985/2111)
remote: Compressing objects: 95% (2006/2111)
remote: Compressing objects: 96% (2027/2111)
remote: Compressing objects: 97% (2048/2111)
remote: Compressing objects: 98% (2069/2111)
remote: Compressing objects: 99% (2090/2111)
remote: Compressing objects: 100% (2111/2111)
remote: Compressing objects: 100% (2111/2111), done.
7.26 s
Receiving objects: 0% (1/66329)
Receiving objects: 1% (664/66329)
Receiving objects: 2% (1327/66329)
Receiving objects: 3% (1990/66329)
Receiving objects: 4% (2654/66329)
Receiving objects: 5% (3317/66329)
Receiving objects: 6% (3980/66329)
Receiving objects: 7% (4644/66329)
Receiving objects: 8% (5307/66329), 9.30 MiB | 18.58 MiB/s
Receiving objects: 9% (5970/66329), 9.30 MiB | 18.58 MiB/s
Receiving objects: 10% (6633/66329), 9.30 MiB | 18.58 MiB/s
Receiving objects: 11% (7297/66329), 9.30 MiB | 18.58 MiB/s
Receiving objects: 12% (7960/66329), 9.30 MiB | 18.58 MiB/s
Receiving objects: 13% (8623/66329), 9.30 MiB | 18.58 MiB/s
Receiving objects: 14% (9287/66329), 9.30 MiB | 18.58 MiB/s
Receiving objects: 15% (9950/66329), 9.30 MiB | 18.58 MiB/s
Receiving objects: 16% (10613/66329), 9.30 MiB | 18.58 MiB/s
Receiving objects: 17% (11276/66329), 9.30 MiB | 18.58 MiB/s
Receiving objects: 18% (11940/66329), 9.30 MiB | 18.58 MiB/s
Receiving objects: 19% (12603/66329), 9.30 MiB | 18.58 MiB/s
Receiving objects: 20% (13266/66329), 9.30 MiB | 18.58 MiB/s
Receiving objects: 21% (13930/66329), 9.30 MiB | 18.58 MiB/s
Receiving objects: 22% (14593/66329), 9.30 MiB | 18.58 MiB/s
Receiving objects: 23% (15256/66329), 9.30 MiB | 18.58 MiB/s
Receiving objects: 24% (15919/66329), 9.30 MiB | 18.58 MiB/s
Receiving objects: 25% (16583/66329), 9.30 MiB | 18.58 MiB/s
Receiving objects: 26% (17246/66329), 9.30 MiB | 18.58 MiB/s
Receiving objects: 27% (17909/66329), 9.30 MiB | 18.58 MiB/s
Receiving objects: 28% (18573/66329), 9.30 MiB | 18.58 MiB/s
Receiving objects: 29% (19236/66329), 9.30 MiB | 18.58 MiB/s
Receiving objects: 29% (19664/66329), 9.30 MiB | 18.58 MiB/s
Receiving objects: 30% (19899/66329), 22.09 MiB | 22.08 MiB/s
Receiving objects: 31% (20562/66329), 22.09 MiB | 22.08 MiB/s
Receiving objects: 32% (21226/66329), 22.09 MiB | 22.08 MiB/s
Receiving objects: 33% (21889/66329), 22.09 MiB | 22.08 MiB/s
Receiving objects: 34% (22552/66329), 22.09 MiB | 22.08 MiB/s
Receiving objects: 35% (23216/66329), 22.09 MiB | 22.08 MiB/s
Receiving objects: 36% (23879/66329), 22.09 MiB | 22.08 MiB/s
Receiving objects: 37% (24542/66329), 22.09 MiB | 22.08 MiB/s
Receiving objects: 38% (25206/66329), 22.09 MiB | 22.08 MiB/s
Receiving objects: 39% (25869/66329), 22.09 MiB | 22.08 MiB/s
Receiving objects: 40% (26532/66329), 22.09 MiB | 22.08 MiB/s
Receiving objects: 41% (27195/66329), 22.09 MiB | 22.08 MiB/s
Receiving objects: 42% (27859/66329), 22.09 MiB | 22.08 MiB/s
Receiving objects: 43% (28522/66329), 22.09 MiB | 22.08 MiB/s
Receiving objects: 44% (29185/66329), 22.09 MiB | 22.08 MiB/s
Receiving objects: 45% (29849/66329), 22.09 MiB | 22.08 MiB/s
Receiving objects: 46% (30512/66329), 22.09 MiB | 22.08 MiB/s
Receiving objects: 47% (31175/66329), 22.09 MiB | 22.08 MiB/s
Receiving objects: 48% (31838/66329), 22.09 MiB | 22.08 MiB/s
Receiving objects: 49% (32502/66329), 22.09 MiB | 22.08 MiB/s
Receiving objects: 50% (33165/66329), 22.09 MiB | 22.08 MiB/s
Receiving objects: 51% (33828/66329), 22.09 MiB | 22.08 MiB/s
Receiving objects: 52% (34492/66329), 22.09 MiB | 22.08 MiB/s
Receiving objects: 53% (35155/66329), 22.09 MiB | 22.08 MiB/s
Receiving objects: 54% (35818/66329), 22.09 MiB | 22.08 MiB/s
Receiving objects: 55% (36481/66329), 22.09 MiB | 22.08 MiB/s
Receiving objects: 56% (37145/66329), 22.09 MiB | 22.08 MiB/s
Receiving objects: 57% (37808/66329), 40.85 MiB | 27.23 MiB/s
Receiving objects: 58% (38471/66329), 40.85 MiB | 27.23 MiB/s
Receiving objects: 59% (39135/66329), 40.85 MiB | 27.23 MiB/s
Receiving objects: 60% (39798/66329), 40.85 MiB | 27.23 MiB/s
Receiving objects: 61% (40461/66329), 40.85 MiB | 27.23 MiB/s
Receiving objects: 62% (41124/66329), 40.85 MiB | 27.23 MiB/s
Receiving objects: 63% (41788/66329), 40.85 MiB | 27.23 MiB/s
Receiving objects: 64% (42451/66329), 40.85 MiB | 27.23 MiB/s
Receiving objects: 65% (43114/66329), 40.85 MiB | 27.23 MiB/s
Receiving objects: 66% (43778/66329), 40.85 MiB | 27.23 MiB/s
Receiving objects: 67% (44441/66329), 40.85 MiB | 27.23 MiB/s
Receiving objects: 67% (44940/66329), 54.18 MiB | 27.06 MiB/s
Receiving objects: 68% (45104/66329), 54.18 MiB | 27.06 MiB/s
Receiving objects: 69% (45768/66329), 54.18 MiB | 27.06 MiB/s
Receiving objects: 70% (46431/66329), 54.18 MiB | 27.06 MiB/s
Receiving objects: 71% (47094/66329), 54.18 MiB | 27.06 MiB/s
Receiving objects: 72% (47757/66329), 54.18 MiB | 27.06 MiB/s
Receiving objects: 73% (48421/66329), 54.18 MiB | 27.06 MiB/s
Receiving objects: 74% (49084/66329), 54.18 MiB | 27.06 MiB/s
Receiving objects: 75% (49747/66329), 54.18 MiB | 27.06 MiB/s
Receiving objects: 76% (50411/66329), 54.18 MiB | 27.06 MiB/s
Receiving objects: 77% (51074/66329), 69.79 MiB | 27.89 MiB/s
Receiving objects: 78% (51737/66329), 69.79 MiB | 27.89 MiB/s
Receiving objects: 79% (52400/66329), 69.79 MiB | 27.89 MiB/s
Receiving objects: 80% (53064/66329), 69.79 MiB | 27.89 MiB/s
Receiving objects: 81% (53727/66329), 69.79 MiB | 27.89 MiB/s
Receiving objects: 82% (54390/66329), 69.79 MiB | 27.89 MiB/s
Receiving objects: 83% (55054/66329), 69.79 MiB | 27.89 MiB/s
Receiving objects: 84% (55717/66329), 69.79 MiB | 27.89 MiB/s
Receiving objects: 85% (56380/66329), 69.79 MiB | 27.89 MiB/s
Receiving objects: 86% (57043/66329), 69.79 MiB | 27.89 MiB/s
Receiving objects: 87% (57707/66329), 69.79 MiB | 27.89 MiB/s
Receiving objects: 88% (58370/66329), 69.79 MiB | 27.89 MiB/s
Receiving objects: 89% (59033/66329), 69.79 MiB | 27.89 MiB/s
Receiving objects: 90% (59697/66329), 69.79 MiB | 27.89 MiB/s
Receiving objects: 91% (60360/66329), 69.79 MiB | 27.89 MiB/s
Receiving objects: 92% (61023/66329), 69.79 MiB | 27.89 MiB/s
Receiving objects: 93% (61686/66329), 69.79 MiB | 27.89 MiB/s
Receiving objects: 94% (62350/66329), 69.79 MiB | 27.89 MiB/s
Receiving objects: 95% (63013/66329), 69.79 MiB | 27.89 MiB/s
Receiving objects: 96% (63676/66329), 69.79 MiB | 27.89 MiB/s
Receiving objects: 97% (64340/66329), 69.79 MiB | 27.89 MiB/s
Receiving objects: 98% (65003/66329), 69.79 MiB | 27.89 MiB/s
Receiving objects: 98% (65579/66329), 89.16 MiB | 29.70 MiB/s
Receiving objects: 99% (65666/66329), 89.16 MiB | 29.70 MiB/s
remote: Total 66329 (delta 7283), reused 7248 (delta 6605), pack-reused 57328 (from 1)
7.28 s
Receiving objects: 100% (66329/66329), 89.16 MiB | 29.70 MiB/s
Receiving objects: 100% (66329/66329), 98.63 MiB | 30.42 MiB/s, done.
9.89 s
Resolving deltas: 0% (0/46380)
Resolving deltas: 1% (464/46380)
Resolving deltas: 2% (928/46380)
Resolving deltas: 3% (1392/46380)
Resolving deltas: 4% (1856/46380)
Resolving deltas: 5% (2319/46380)
Resolving deltas: 6% (2783/46380)
Resolving deltas: 7% (3248/46380)
Resolving deltas: 8% (3711/46380)
Resolving deltas: 9% (4175/46380)
Resolving deltas: 10% (4638/46380)
Resolving deltas: 11% (5102/46380)
Resolving deltas: 12% (5566/46380)
Resolving deltas: 13% (6030/46380)
Resolving deltas: 14% (6494/46380)
Resolving deltas: 15% (6957/46380)
Resolving deltas: 16% (7421/46380)
Resolving deltas: 17% (7885/46380)
Resolving deltas: 18% (8349/46380)
Resolving deltas: 19% (8813/46380)
Resolving deltas: 20% (9276/46380)
Resolving deltas: 21% (9740/46380)
Resolving deltas: 22% (10204/46380)
Resolving deltas: 23% (10668/46380)
Resolving deltas: 24% (11132/46380)
Resolving deltas: 25% (11595/46380)
Resolving deltas: 26% (12059/46380)
Resolving deltas: 27% (12523/46380)
Resolving deltas: 28% (12987/46380)
Resolving deltas: 29% (13451/46380)
Resolving deltas: 30% (13914/46380)
Resolving deltas: 31% (14378/46380)
Resolving deltas: 32% (14842/46380)
Resolving deltas: 33% (15306/46380)
Resolving deltas: 34% (15770/46380)
Resolving deltas: 35% (16233/46380)
Resolving deltas: 36% (16697/46380)
Resolving deltas: 37% (17161/46380)
Resolving deltas: 38% (17625/46380)
Resolving deltas: 39% (18089/46380)
Resolving deltas: 40% (18552/46380)
Resolving deltas: 41% (19016/46380)
Resolving deltas: 42% (19480/46380)
Resolving deltas: 43% (19944/46380)
Resolving deltas: 44% (20408/46380)
Resolving deltas: 45% (20871/46380)
Resolving deltas: 46% (21335/46380)
Resolving deltas: 47% (21799/46380)
Resolving deltas: 48% (22263/46380)
Resolving deltas: 49% (22727/46380)
Resolving deltas: 50% (23190/46380)
Resolving deltas: 51% (23654/46380)
Resolving deltas: 52% (24118/46380)
Resolving deltas: 53% (24582/46380)
Resolving deltas: 54% (25046/46380)
Resolving deltas: 55% (25509/46380)
Resolving deltas: 56% (25974/46380)
Resolving deltas: 57% (26437/46380)
Resolving deltas: 58% (26901/46380)
Resolving deltas: 59% (27365/46380)
Resolving deltas: 59% (27687/46380)
Resolving deltas: 60% (27828/46380)
Resolving deltas: 61% (28292/46380)
Resolving deltas: 62% (28756/46380)
Resolving deltas: 63% (29220/46380)
Resolving deltas: 64% (29684/46380)
Resolving deltas: 65% (30147/46380)
Resolving deltas: 66% (30611/46380)
Resolving deltas: 67% (31075/46380)
Resolving deltas: 68% (31539/46380)
Resolving deltas: 69% (32003/46380)
Resolving deltas: 70% (32466/46380)
Resolving deltas: 71% (32931/46380)
Resolving deltas: 72% (33394/46380)
Resolving deltas: 73% (33858/46380)
Resolving deltas: 74% (34322/46380)
Resolving deltas: 75% (34785/46380)
Resolving deltas: 76% (35249/46380)
Resolving deltas: 77% (35713/46380)
Resolving deltas: 78% (36177/46380)
Resolving deltas: 79% (36641/46380)
Resolving deltas: 79% (36665/46380)
Resolving deltas: 80% (37104/46380)
Resolving deltas: 81% (37568/46380)
Resolving deltas: 82% (38032/46380)
Resolving deltas: 83% (38496/46380)
Resolving deltas: 84% (38960/46380)
Resolving deltas: 85% (39423/46380)
Resolving deltas: 86% (39887/46380)
Resolving deltas: 87% (40351/46380)
Resolving deltas: 88% (40815/46380)
Resolving deltas: 89% (41279/46380)
Resolving deltas: 90% (41742/46380)
Resolving deltas: 91% (42206/46380)
Resolving deltas: 92% (42670/46380)
Resolving deltas: 93% (43134/46380)
Resolving deltas: 94% (43598/46380)
Resolving deltas: 95% (44061/46380)
Resolving deltas: 96% (44525/46380)
Resolving deltas: 97% (44989/46380)
Resolving deltas: 98% (45453/46380)
Resolving deltas: 99% (45917/46380)
Resolving deltas: 100% (46380/46380)
Resolving deltas: 100% (46380/46380), done.
10.80 s
Fetching commit b66a9536b21e6c9319a846e70836b6ae01b1e337 for docs ...
10.80 s
$ /nix/store/bcnisk3ydfgv26v2gw3zlky24g00yww2-git-2.54.0/bin/git fetch origin b66a9536b21e6c9319a846e70836b6ae01b1e337
11.50 s
From https://github.com/alphal00p/gammaloop
11.50 s
* branch b66a9536b21e6c9319a846e70836b6ae01b1e337 -> FETCH_HEAD
11.65 s
$ /nix/store/9ypz3flqsrl5xl495mm8h645gadjsxi1-coreutils-9.11/bin/timeout --kill-after=15s 7200s /nix/store/bcnisk3ydfgv26v2gw3zlky24g00yww2-git-2.54.0/bin/git -c advice.detachedHead=false checkout b66a9536b21e6c9319a846e70836b6ae01b1e337
12.17 s
HEAD is now at b66a9536b avoid Rustdoc rebuilds for prose-only documentation edits
12.20 s
$ /nix/store/9ypz3flqsrl5xl495mm8h645gadjsxi1-coreutils-9.11/bin/timeout --kill-after=15s 7200s /nix/store/23zk8sgzamrbmj1fday15szf7f2279s8-nix-2.34.7/bin/nix --extra-experimental-features nix-command --extra-experimental-features flakes --log-format internal-json run .#packages.x86_64-linux.nix-ci-check-gammaloop-doctest --print-build-logs
24.18 s
24.73 s
Downloading cached cargo-git-https-github.com-symbolica-dev-symbolica from https://cache.nix-ci.com
24.74 s
Downloading cached cargo-package-ascii from https://cache.nix-ci.com
24.74 s
Downloading cached cargo-package-by_address from https://cache.nix-ci.com
24.74 s
Downloading cached cargo-package-ar_archive_writer from https://cache.nix-ci.com
24.74 s
Downloading cached cargo-package-bytemuck_derive from https://cache.nix-ci.com
24.74 s
Downloading cached cargo-package-chinese-variant from https://cache.nix-ci.com
24.74 s
Downloading cached cargo-package-byteorder-lite from https://cache.nix-ci.com
24.74 s
Downloading cached cargo-package-biblatex from https://cache.nix-ci.com
24.74 s
Downloading cached cargo-package-chunked_transfer from https://cache.nix-ci.com
24.74 s
Downloading cached cargo-package-citationberg from https://cache.nix-ci.com
24.75 s
Downloading cached cargo-package-cobs from https://cache.nix-ci.com
24.75 s
Downloading cached cargo-package-codex from https://cache.nix-ci.com
24.75 s
Downloading cached cargo-package-codespan-reporting from https://cache.nix-ci.com
24.75 s
Downloading cached cargo-package-color from https://cache.nix-ci.com
24.75 s
Downloading cached cargo-package-color_quant from https://cache.nix-ci.com
24.75 s
Downloading cached cargo-package-chinese-number from https://cache.nix-ci.com
24.76 s
Downloaded cached cargo-package-chunked_transfer (32 KiB) in 15ms
24.76 s
Progress: 0 of 1 built, 1 of 244 downloaded from cache (15 downloading)
24.76 s
Downloaded cached cargo-package-cobs (59 KiB) in 15ms
24.76 s
Progress: 0 of 1 built, 2 of 244 downloaded from cache (15 downloading)
24.76 s
Downloading cached cargo-package-comemo from https://cache.nix-ci.com
24.76 s
Downloading cached cargo-package-comemo-macros from https://cache.nix-ci.com
24.79 s
Downloaded cached cargo-package-byteorder-lite (143 KiB) in 46ms
24.79 s
Progress: 0 of 1 built, 3 of 244 downloaded from cache (15 downloading)
24.79 s
Downloading cached cargo-package-core-foundation from https://cache.nix-ci.com
24.81 s
Downloaded cached cargo-package-ascii (165 KiB) in 61ms
24.81 s
Downloaded cached cargo-package-biblatex (415 KiB) in 70ms
24.81 s
Progress: 0 of 1 built, 4 of 244 downloaded from cache (15 downloading)
24.82 s
Progress: 0 of 1 built, 5 of 244 downloaded from cache (15 downloading)
24.82 s
Downloading cached cargo-package-core_maths from https://cache.nix-ci.com
24.83 s
Downloading cached cargo-package-crc32fast from https://cache.nix-ci.com
24.83 s
Downloaded cached cargo-package-codex (202 KiB) in 81ms
24.83 s
Progress: 0 of 1 built, 6 of 244 downloaded from cache (15 downloading)
24.83 s
Downloaded cached cargo-package-by_address (27 KiB) in 83ms
24.83 s
Downloading cached cargo-package-csv from https://cache.nix-ci.com
24.84 s
Progress: 0 of 1 built, 7 of 244 downloaded from cache (15 downloading)
24.84 s
Downloading cached cargo-package-csv-core from https://cache.nix-ci.com
24.85 s
Downloaded cached cargo-package-ar_archive_writer (365 KiB) in 104ms
24.85 s
Progress: 0 of 1 built, 8 of 244 downloaded from cache (15 downloading)
24.85 s
Downloading cached cargo-package-data-url from https://cache.nix-ci.com
24.85 s
Downloaded cached cargo-package-citationberg (374 KiB) in 108ms
24.85 s
Downloaded cached cargo-package-chinese-variant (8104 B) in 108ms
24.85 s
Downloaded cached cargo-package-comemo-macros (34 KiB) in 90ms
24.85 s
Downloaded cached cargo-package-bytemuck_derive (112 KiB) in 109ms
24.86 s
Downloaded cached cargo-package-comemo (106 KiB) in 93ms
24.86 s
Downloaded cached cargo-package-color_quant (23 KiB) in 110ms
24.86 s
Progress: 0 of 1 built, 9 of 244 downloaded from cache (15 downloading)
24.86 s
Progress: 0 of 1 built, 10 of 244 downloaded from cache (14 downloading)
24.86 s
Progress: 0 of 1 built, 11 of 244 downloaded from cache (13 downloading)
24.86 s
Progress: 0 of 1 built, 12 of 244 downloaded from cache (12 downloading)
24.86 s
Progress: 0 of 1 built, 13 of 244 downloaded from cache (11 downloading)
24.86 s
Downloaded cached cargo-package-codespan-reporting (267 KiB) in 112ms
24.86 s
Downloading cached cargo-package-displaydoc from https://cache.nix-ci.com
24.86 s
Downloading cached cargo-package-ecow from https://cache.nix-ci.com
24.86 s
Downloading cached cargo-package-enum-ordinalize-derive from https://cache.nix-ci.com
24.86 s
Downloaded cached cargo-package-chinese-number (156 KiB) in 114ms
24.86 s
Downloading cached cargo-package-enum-ordinalize from https://cache.nix-ci.com
24.86 s
Progress: 0 of 1 built, 14 of 244 downloaded from cache (15 downloading)
24.86 s
Progress: 0 of 1 built, 15 of 244 downloaded from cache (14 downloading)
24.86 s
Progress: 0 of 1 built, 16 of 244 downloaded from cache (13 downloading)
24.86 s
Downloading cached cargo-package-fdeflate from https://cache.nix-ci.com
24.86 s
Downloading cached cargo-package-env_proxy from https://cache.nix-ci.com
24.87 s
Downloading cached cargo-package-fearless_simd from https://cache.nix-ci.com
24.87 s
Downloading cached cargo-package-fancy-regex from https://cache.nix-ci.com
24.89 s
Downloaded cached cargo-package-core-foundation (137 KiB) in 96ms
24.89 s
Downloaded cached cargo-package-core_maths (34 KiB) in 72ms
24.89 s
Progress: 0 of 1 built, 17 of 244 downloaded from cache (15 downloading)
24.89 s
Progress: 0 of 1 built, 18 of 244 downloaded from cache (14 downloading)
24.89 s
Downloading cached cargo-package-filetime from https://cache.nix-ci.com
24.90 s
Downloading cached cargo-package-flate2 from https://cache.nix-ci.com
24.90 s
Downloaded cached cargo-package-color (338 KiB) in 152ms
24.90 s
Progress: 0 of 1 built, 19 of 244 downloaded from cache (15 downloading)
24.90 s
Downloaded cached cargo-package-csv-core (121 KiB) in 65ms
24.90 s
Downloading cached cargo-package-float-cmp from https://cache.nix-ci.com
24.92 s
Progress: 0 of 1 built, 20 of 244 downloaded from cache (15 downloading)
24.92 s
Downloading cached cargo-package-font-types from https://cache.nix-ci.com
24.92 s
Downloaded cached cargo-package-crc32fast (133 KiB) in 97ms
24.92 s
Progress: 0 of 1 built, 21 of 244 downloaded from cache (15 downloading)
24.92 s
Downloading cached cargo-package-fontconfig-parser from https://cache.nix-ci.com
24.93 s
Downloaded cached cargo-package-data-url (135 KiB) in 73ms
24.93 s
Progress: 0 of 1 built, 22 of 244 downloaded from cache (15 downloading)
24.93 s
Downloading cached cargo-package-fontdb from https://cache.nix-ci.com
24.94 s
Downloaded cached cargo-package-fdeflate (109 KiB) in 76ms
24.94 s
Downloaded cached cargo-package-enum-ordinalize-derive (48 KiB) in 83ms
24.94 s
Progress: 0 of 1 built, 23 of 244 downloaded from cache (15 downloading)
24.94 s
Downloaded cached cargo-package-displaydoc (78 KiB) in 84ms
24.94 s
Downloaded cached cargo-package-enum-ordinalize (25 KiB) in 82ms
24.94 s
Downloading cached cargo-package-foreign-types from https://cache.nix-ci.com
24.95 s
Downloaded cached cargo-package-env_proxy (38 KiB) in 86ms
24.95 s
Progress: 0 of 1 built, 24 of 244 downloaded from cache (15 downloading)
24.95 s
Progress: 0 of 1 built, 25 of 244 downloaded from cache (14 downloading)
24.95 s
Progress: 0 of 1 built, 26 of 244 downloaded from cache (13 downloading)
24.95 s
Progress: 0 of 1 built, 27 of 244 downloaded from cache (12 downloading)
24.95 s
Downloading cached cargo-package-form_urlencoded from https://cache.nix-ci.com
24.95 s
Downloading cached cargo-package-fsevent-sys from https://cache.nix-ci.com
24.95 s
Downloading cached cargo-package-gif from https://cache.nix-ci.com
24.95 s
Downloading cached cargo-package-foreign-types-shared from https://cache.nix-ci.com
24.95 s
Downloaded cached cargo-package-ecow (117 KiB) in 95ms
24.95 s
Progress: 0 of 1 built, 28 of 244 downloaded from cache (15 downloading)
24.95 s
Downloading cached cargo-package-glidesort from https://cache.nix-ci.com
24.98 s
Downloaded cached cargo-package-font-types (104 KiB) in 60ms
24.98 s
Progress: 0 of 1 built, 29 of 244 downloaded from cache (15 downloading)
24.98 s
Downloading cached cargo-package-glifo from https://cache.nix-ci.com
24.98 s
Downloaded cached cargo-package-fearless_simd (2.9 MiB) in 117ms
24.99 s
Downloaded cached cargo-package-fancy-regex (460 KiB) in 119ms
24.99 s
Progress: 0 of 1 built, 30 of 244 downloaded from cache (15 downloading)
24.99 s
Progress: 0 of 1 built, 31 of 244 downloaded from cache (14 downloading)
24.99 s
Downloading cached cargo-package-glob from https://cache.nix-ci.com
24.99 s
Downloading cached cargo-package-guillotiere from https://cache.nix-ci.com
24.99 s
Downloaded cached cargo-git-https-github.com-symbolica-dev-symbolica (6.5 MiB) in 259ms
25.00 s
Downloaded cached cargo-package-fontconfig-parser (255 KiB) in 75ms
25.00 s
Downloaded cached cargo-package-filetime (71 KiB) in 106ms
25.01 s
Progress: 0 of 1 built, 32 of 244 downloaded from cache (15 downloading)
25.01 s
Downloaded cached cargo-package-float-cmp (48 KiB) in 102ms
25.01 s
Progress: 0 of 1 built, 33 of 244 downloaded from cache (14 downloading)
25.01 s
Progress: 0 of 1 built, 34 of 244 downloaded from cache (13 downloading)
25.01 s
Downloading cached cargo-package-hayro from https://cache.nix-ci.com
25.01 s
Downloading cached cargo-package-hashbrown from https://cache.nix-ci.com
25.01 s
Downloading cached cargo-package-hayagriva from https://cache.nix-ci.com
25.01 s
Downloaded cached cargo-package-flate2 (354 KiB) in 109ms
25.01 s
Downloaded cached cargo-package-csv (5.8 MiB) in 181ms
25.01 s
Downloaded cached cargo-package-form_urlencoded (29 KiB) in 60ms
25.01 s
Downloaded cached cargo-package-fsevent-sys (18 KiB) in 61ms
25.01 s
Progress: 0 of 1 built, 35 of 244 downloaded from cache (15 downloading)
25.01 s
Progress: 0 of 1 built, 36 of 244 downloaded from cache (14 downloading)
25.01 s
Progress: 0 of 1 built, 37 of 244 downloaded from cache (13 downloading)
25.01 s
Downloaded cached cargo-package-foreign-types (23 KiB) in 71ms
25.02 s
Downloading cached cargo-package-hayro-interpret from https://cache.nix-ci.com
25.02 s
Downloading cached cargo-package-hayro-ccitt from https://cache.nix-ci.com
25.02 s
Downloading cached cargo-package-hayro-cmap from https://cache.nix-ci.com
25.02 s
Progress: 0 of 1 built, 38 of 244 downloaded from cache (15 downloading)
25.02 s
Progress: 0 of 1 built, 39 of 244 downloaded from cache (14 downloading)
25.02 s
Progress: 0 of 1 built, 40 of 244 downloaded from cache (13 downloading)
25.02 s
Downloaded cached cargo-package-glidesort (142 KiB) in 64ms
25.02 s
Downloading cached cargo-package-hayro-jbig2 from https://cache.nix-ci.com
25.02 s
Downloading cached cargo-package-hayro-jpeg2000 from https://cache.nix-ci.com
25.02 s
Downloading cached cargo-package-hayro-postscript from https://cache.nix-ci.com
25.02 s
Progress: 0 of 1 built, 41 of 244 downloaded from cache (15 downloading)
25.02 s
Downloaded cached cargo-package-fontdb (241 KiB) in 93ms
25.02 s
Downloading cached cargo-package-hayro-svg from https://cache.nix-ci.com
25.02 s
Progress: 0 of 1 built, 42 of 244 downloaded from cache (15 downloading)
25.02 s
Downloading cached cargo-package-hayro-syntax from https://cache.nix-ci.com
25.02 s
Downloaded cached cargo-package-gif (149 KiB) in 69ms
25.02 s
Progress: 0 of 1 built, 43 of 244 downloaded from cache (15 downloading)
25.02 s
Downloading cached cargo-package-hayro-write from https://cache.nix-ci.com
25.04 s
Downloaded cached cargo-package-foreign-types-shared (16 KiB) in 88ms
25.04 s
Progress: 0 of 1 built, 44 of 244 downloaded from cache (15 downloading)
25.05 s
Downloading cached cargo-package-httpdate from https://cache.nix-ci.com
25.06 s
Downloaded cached cargo-package-glob (95 KiB) in 68ms
25.06 s
Progress: 0 of 1 built, 45 of 244 downloaded from cache (15 downloading)
25.06 s
Downloading cached cargo-package-hypher from https://cache.nix-ci.com
25.07 s
Downloaded cached cargo-package-glifo (218 KiB) in 84ms
25.07 s
Progress: 0 of 1 built, 46 of 244 downloaded from cache (15 downloading)
25.07 s
Downloading cached cargo-package-icu_collator from https://cache.nix-ci.com
25.08 s
Downloaded cached cargo-package-guillotiere (90 KiB) in 85ms
25.08 s
Progress: 0 of 1 built, 47 of 244 downloaded from cache (15 downloading)
25.08 s
Downloaded cached cargo-package-hashbrown (879 KiB) in 70ms
25.08 s
Progress: 0 of 1 built, 48 of 244 downloaded from cache (15 downloading)
25.08 s
Downloading cached cargo-package-icu_collections from https://cache.nix-ci.com
25.08 s
Downloading cached cargo-package-icu_collator_data from https://cache.nix-ci.com
25.09 s
Downloaded cached cargo-package-hayro-jbig2 (353 KiB) in 73ms
25.09 s
Progress: 0 of 1 built, 49 of 244 downloaded from cache (15 downloading)
25.09 s
Downloading cached cargo-package-icu_locale from https://cache.nix-ci.com
25.10 s
Downloaded cached cargo-package-hayro-ccitt (50 KiB) in 85ms
25.10 s
Downloaded cached cargo-package-hayro (90 KiB) in 95ms
25.10 s
Progress: 0 of 1 built, 50 of 244 downloaded from cache (15 downloading)
25.11 s
Downloading cached cargo-package-icu_locale_core from https://cache.nix-ci.com
25.11 s
Downloaded cached cargo-package-hayro-cmap (351 KiB) in 92ms
25.11 s
Progress: 0 of 1 built, 51 of 244 downloaded from cache (15 downloading)
25.11 s
Downloading cached cargo-package-icu_locale_data from https://cache.nix-ci.com
25.11 s
Progress: 0 of 1 built, 52 of 244 downloaded from cache (15 downloading)
25.11 s
Downloading cached cargo-package-icu_locale_fallback from https://cache.nix-ci.com
25.12 s
Downloaded cached cargo-package-hayro-interpret (1.1 MiB) in 103ms
25.12 s
Progress: 0 of 1 built, 53 of 244 downloaded from cache (15 downloading)
25.12 s
Downloading cached cargo-package-icu_locale_fallback_data from https://cache.nix-ci.com
25.13 s
Downloaded cached cargo-package-hayro-postscript (62 KiB) in 115ms
25.14 s
Progress: 0 of 1 built, 54 of 244 downloaded from cache (15 downloading)
25.14 s
Downloaded cached cargo-package-hayro-svg (75 KiB) in 116ms
25.14 s
Downloaded cached cargo-package-hayro-jpeg2000 (346 KiB) in 116ms
25.14 s
Downloading cached cargo-package-icu_normalizer from https://cache.nix-ci.com
25.14 s
Downloaded cached cargo-package-httpdate (35 KiB) in 93ms
25.14 s
Progress: 0 of 1 built, 55 of 244 downloaded from cache (15 downloading)
25.14 s
Progress: 0 of 1 built, 56 of 244 downloaded from cache (14 downloading)
25.14 s
Downloading cached cargo-package-icu_normalizer_data from https://cache.nix-ci.com
25.14 s
Downloaded cached cargo-package-hayro-write (42 KiB) in 116ms
25.14 s
Downloading cached cargo-package-icu_properties from https://cache.nix-ci.com
25.14 s
Progress: 0 of 1 built, 57 of 244 downloaded from cache (15 downloading)
25.14 s
Progress: 0 of 1 built, 58 of 244 downloaded from cache (14 downloading)
25.15 s
Downloading cached cargo-package-icu_properties_data from https://cache.nix-ci.com
25.15 s
Downloading cached cargo-package-icu_provider from https://cache.nix-ci.com
25.15 s
Downloaded cached cargo-package-hayro-syntax (471 KiB) in 126ms
25.15 s
Progress: 0 of 1 built, 59 of 244 downloaded from cache (15 downloading)
25.15 s
Downloading cached cargo-package-icu_provider_blob from https://cache.nix-ci.com
25.16 s
Downloaded cached cargo-package-hayagriva (3.9 MiB) in 155ms
25.16 s
Progress: 0 of 1 built, 60 of 244 downloaded from cache (15 downloading)
25.17 s
Downloading cached cargo-package-icu_segmenter from https://cache.nix-ci.com
25.17 s
Downloaded cached cargo-package-icu_collections (691 KiB) in 91ms
25.17 s
Progress: 0 of 1 built, 61 of 244 downloaded from cache (15 downloading)
25.18 s
Downloading cached cargo-package-icu_segmenter_data from https://cache.nix-ci.com
25.22 s
Downloaded cached cargo-package-hypher (1.2 MiB) in 159ms
25.22 s
Progress: 0 of 1 built, 62 of 244 downloaded from cache (15 downloading)
25.22 s
Downloading cached cargo-package-idna from https://cache.nix-ci.com
25.23 s
Downloaded cached cargo-package-icu_locale (300 KiB) in 132ms
25.23 s
Progress: 0 of 1 built, 63 of 244 downloaded from cache (15 downloading)
25.23 s
Downloading cached cargo-package-idna_adapter from https://cache.nix-ci.com
25.24 s
Downloaded cached cargo-package-icu_locale_core (427 KiB) in 133ms
25.24 s
Progress: 0 of 1 built, 64 of 244 downloaded from cache (15 downloading)
25.26 s
Downloaded cached cargo-package-icu_normalizer_data (412 KiB) in 115ms
25.26 s
Downloading cached cargo-package-image from https://cache.nix-ci.com
25.26 s
Progress: 0 of 1 built, 65 of 244 downloaded from cache (15 downloading)
25.26 s
Downloading cached cargo-package-image-webp from https://cache.nix-ci.com
25.26 s
Downloaded cached cargo-package-icu_provider (233 KiB) in 118ms
25.27 s
Progress: 0 of 1 built, 66 of 244 downloaded from cache (15 downloading)
25.27 s
Downloading cached cargo-package-imagesize from https://cache.nix-ci.com
25.28 s
Downloaded cached cargo-package-icu_collator (5.6 MiB) in 202ms
25.28 s
Progress: 0 of 1 built, 67 of 244 downloaded from cache (15 downloading)
25.28 s
Downloading cached cargo-package-infer from https://cache.nix-ci.com
25.28 s
Downloaded cached cargo-package-icu_collator_data (3.1 MiB) in 202ms
25.28 s
Downloaded cached cargo-package-icu_properties_data (1.5 MiB) in 137ms
25.28 s
Progress: 0 of 1 built, 68 of 244 downloaded from cache (15 downloading)
25.29 s
Progress: 0 of 1 built, 69 of 244 downloaded from cache (15 downloading)
25.29 s
Downloading cached cargo-package-inotify from https://cache.nix-ci.com
25.29 s
Downloading cached cargo-package-inotify-sys from https://cache.nix-ci.com
25.30 s
Downloaded cached cargo-package-icu_locale_fallback (67 KiB) in 191ms
25.31 s
Progress: 0 of 1 built, 70 of 244 downloaded from cache (15 downloading)
25.31 s
Downloading cached cargo-package-kamadak-exif from https://cache.nix-ci.com
25.31 s
Downloaded cached cargo-package-icu_properties (593 KiB) in 169ms
25.31 s
Progress: 0 of 1 built, 71 of 244 downloaded from cache (15 downloading)
25.31 s
Downloading cached cargo-package-kqueue from https://cache.nix-ci.com
25.32 s
Downloaded cached cargo-package-icu_locale_fallback_data (27 KiB) in 192ms
25.32 s
Downloaded cached cargo-package-icu_provider_blob (83 KiB) in 168ms
25.32 s
Progress: 0 of 1 built, 72 of 244 downloaded from cache (15 downloading)
25.32 s
Progress: 0 of 1 built, 73 of 244 downloaded from cache (15 downloading)
25.32 s
Downloading cached cargo-package-kqueue-sys from https://cache.nix-ci.com
25.32 s
Downloading cached cargo-package-krilla from https://cache.nix-ci.com
25.37 s
Downloaded cached cargo-package-icu_normalizer (3.1 MiB) in 229ms
25.37 s
Progress: 0 of 1 built, 74 of 244 downloaded from cache (15 downloading)
25.37 s
Downloading cached cargo-package-krilla-svg from https://cache.nix-ci.com
25.38 s
Downloaded cached cargo-package-idna (947 KiB) in 161ms
25.38 s
Progress: 0 of 1 built, 75 of 244 downloaded from cache (15 downloading)
25.39 s
Downloading cached cargo-package-kurbo from https://cache.nix-ci.com
25.41 s
Downloaded cached cargo-package-image-webp (318 KiB) in 147ms
25.41 s
Downloaded cached cargo-package-idna_adapter (36 KiB) in 171ms
25.41 s
Progress: 0 of 1 built, 76 of 244 downloaded from cache (15 downloading)
25.41 s
Downloading cached cargo-package-linebender_resource_handle from https://cache.nix-ci.com
25.41 s
Progress: 0 of 1 built, 77 of 244 downloaded from cache (15 downloading)
25.41 s
Downloading cached cargo-package-linked-hash-map from https://cache.nix-ci.com
25.43 s
Downloaded cached cargo-package-kamadak-exif (265 KiB) in 126ms
25.44 s
Downloaded cached cargo-package-kqueue (133 KiB) in 127ms
25.44 s
Progress: 0 of 1 built, 78 of 244 downloaded from cache (15 downloading)
25.44 s
Downloading cached cargo-package-lipsum from https://cache.nix-ci.com
25.44 s
Progress: 0 of 1 built, 79 of 244 downloaded from cache (15 downloading)
25.44 s
Downloading cached cargo-package-litemap from https://cache.nix-ci.com
25.44 s
Downloaded cached cargo-package-imagesize (89 KiB) in 172ms
25.44 s
Downloaded cached cargo-package-inotify (119 KiB) in 158ms
25.45 s
Progress: 0 of 1 built, 80 of 244 downloaded from cache (15 downloading)
25.45 s
Progress: 0 of 1 built, 81 of 244 downloaded from cache (14 downloading)
25.45 s
Downloading cached cargo-package-miniz_oxide from https://cache.nix-ci.com
25.45 s
Downloading cached cargo-package-memmap2 from https://cache.nix-ci.com
25.46 s
Downloaded cached cargo-package-icu_locale_data (8.9 MiB) in 351ms
25.46 s
Downloaded cached cargo-package-image (1.4 MiB) in 204ms
25.46 s
Downloaded cached cargo-package-kqueue-sys (40 KiB) in 138ms
25.47 s
Progress: 0 of 1 built, 82 of 244 downloaded from cache (15 downloading)
25.47 s
Progress: 0 of 1 built, 83 of 244 downloaded from cache (14 downloading)
25.47 s
Progress: 0 of 1 built, 84 of 244 downloaded from cache (13 downloading)
25.47 s
Downloading cached cargo-package-moxcms from https://cache.nix-ci.com
25.47 s
Downloading cached cargo-package-mutate_once from https://cache.nix-ci.com
25.47 s
Downloading cached cargo-package-native-tls from https://cache.nix-ci.com
25.47 s
Downloaded cached cargo-package-krilla (943 KiB) in 150ms
25.47 s
Progress: 0 of 1 built, 85 of 244 downloaded from cache (15 downloading)
25.47 s
Downloaded cached cargo-package-infer (91 KiB) in 194ms
25.47 s
Progress: 0 of 1 built, 86 of 244 downloaded from cache (15 downloading)
25.47 s
Downloaded cached cargo-package-inotify-sys (39 KiB) in 182ms
25.47 s
Downloading cached cargo-package-notify from https://cache.nix-ci.com
25.47 s
Downloading cached cargo-package-notify-types from https://cache.nix-ci.com
25.47 s
Progress: 0 of 1 built, 87 of 244 downloaded from cache (15 downloading)
25.47 s
Downloading cached cargo-package-object from https://cache.nix-ci.com
25.50 s
Downloaded cached cargo-package-krilla-svg (69 KiB) in 130ms
25.50 s
Progress: 0 of 1 built, 88 of 244 downloaded from cache (15 downloading)
25.50 s
Downloading cached cargo-package-openssl from https://cache.nix-ci.com
25.53 s
Downloaded cached cargo-package-linked-hash-map (64 KiB) in 113ms
25.53 s
Progress: 0 of 1 built, 89 of 244 downloaded from cache (15 downloading)
25.53 s
Downloading cached cargo-package-openssl-macros from https://cache.nix-ci.com
25.53 s
Downloaded cached cargo-package-kurbo (692 KiB) in 144ms
25.54 s
Progress: 0 of 1 built, 90 of 244 downloaded from cache (15 downloading)
25.54 s
Downloading cached cargo-package-openssl-probe from https://cache.nix-ci.com
25.55 s
Downloaded cached cargo-package-linebender_resource_handle (33 KiB) in 137ms
25.55 s
Progress: 0 of 1 built, 91 of 244 downloaded from cache (15 downloading)
25.55 s
Downloading cached cargo-package-openssl-sys from https://cache.nix-ci.com
25.56 s
Downloaded cached cargo-package-memmap2 (166 KiB) in 105ms
25.56 s
Progress: 0 of 1 built, 92 of 244 downloaded from cache (15 downloading)
25.56 s
Downloading cached cargo-package-palette from https://cache.nix-ci.com
25.58 s
Downloaded cached cargo-package-miniz_oxide (294 KiB) in 121ms
25.58 s
Progress: 0 of 1 built, 93 of 244 downloaded from cache (15 downloading)
25.58 s
Downloaded cached cargo-package-litemap (162 KiB) in 138ms
25.58 s
Downloaded cached cargo-package-lipsum (100 KiB) in 141ms
25.58 s
Downloading cached cargo-package-palette_derive from https://cache.nix-ci.com
25.58 s
Progress: 0 of 1 built, 94 of 244 downloaded from cache (15 downloading)
25.58 s
Progress: 0 of 1 built, 95 of 244 downloaded from cache (14 downloading)
25.58 s
Downloading cached cargo-package-palette_math from https://cache.nix-ci.com
25.58 s
Downloading cached cargo-package-pdf-writer from https://cache.nix-ci.com
25.59 s
Downloaded cached cargo-package-notify (161 KiB) in 118ms
25.59 s
Progress: 0 of 1 built, 96 of 244 downloaded from cache (15 downloading)
25.59 s
Downloading cached cargo-package-peniko from https://cache.nix-ci.com
25.60 s
Downloaded cached cargo-package-native-tls (138 KiB) in 130ms
25.60 s
Progress: 0 of 1 built, 97 of 244 downloaded from cache (15 downloading)
25.60 s
Downloading cached cargo-package-percent-encoding from https://cache.nix-ci.com
25.65 s
Downloaded cached cargo-package-moxcms (1.5 MiB) in 181ms
25.65 s
Progress: 0 of 1 built, 98 of 244 downloaded from cache (15 downloading)
25.65 s
Downloading cached cargo-package-pic-scale from https://cache.nix-ci.com
25.65 s
Downloaded cached cargo-package-notify-types (97 KiB) in 177ms
25.65 s
Progress: 0 of 1 built, 99 of 244 downloaded from cache (15 downloading)
25.65 s
Downloaded cached cargo-package-openssl-probe (28 KiB) in 109ms
25.65 s
Downloading cached cargo-package-pico-args from https://cache.nix-ci.com
25.65 s
Downloaded cached cargo-package-mutate_once (18 KiB) in 188ms
25.66 s
Progress: 0 of 1 built, 100 of 244 downloaded from cache (15 downloading)
25.66 s
Progress: 0 of 1 built, 101 of 244 downloaded from cache (14 downloading)
25.66 s
Downloading cached cargo-package-pkg-config from https://cache.nix-ci.com
25.66 s
Downloaded cached cargo-package-openssl-macros (15 KiB) in 128ms
25.66 s
Downloading cached cargo-package-pixglyph from https://cache.nix-ci.com
25.66 s
Progress: 0 of 1 built, 102 of 244 downloaded from cache (15 downloading)
25.66 s
Downloading cached cargo-package-plist from https://cache.nix-ci.com
25.68 s
Downloaded cached cargo-package-openssl-sys (408 KiB) in 135ms
25.68 s
Downloaded cached cargo-package-object (1.9 MiB) in 209ms
25.69 s
Downloaded cached cargo-package-openssl (1.4 MiB) in 187ms
25.69 s
Progress: 0 of 1 built, 103 of 244 downloaded from cache (15 downloading)
25.69 s
Downloading cached cargo-package-png from https://cache.nix-ci.com
25.69 s
Progress: 0 of 1 built, 104 of 244 downloaded from cache (15 downloading)
25.69 s
Progress: 0 of 1 built, 105 of 244 downloaded from cache (14 downloading)
25.69 s
Downloading cached cargo-package-polycool from https://cache.nix-ci.com
25.69 s
Downloading cached cargo-package-postcard from https://cache.nix-ci.com
25.71 s
Downloaded cached cargo-package-palette_derive (86 KiB) in 132ms
25.71 s
Progress: 0 of 1 built, 106 of 244 downloaded from cache (15 downloading)
25.71 s
Downloading cached cargo-package-potential_utf from https://cache.nix-ci.com
25.71 s
Downloaded cached cargo-package-peniko (93 KiB) in 121ms
25.71 s
Progress: 0 of 1 built, 107 of 244 downloaded from cache (15 downloading)
25.71 s
Downloading cached cargo-package-proc-macro-hack from https://cache.nix-ci.com
25.72 s
Downloaded cached cargo-package-palette_math (57 KiB) in 140ms
25.72 s
Progress: 0 of 1 built, 108 of 244 downloaded from cache (15 downloading)
25.72 s
Downloaded cached cargo-package-percent-encoding (36 KiB) in 121ms
25.72 s
Downloading cached cargo-package-psm from https://cache.nix-ci.com
25.72 s
Progress: 0 of 1 built, 109 of 244 downloaded from cache (15 downloading)
25.72 s
Downloaded cached cargo-package-palette (1.5 MiB) in 163ms
25.72 s
Downloading cached cargo-package-pxfm from https://cache.nix-ci.com
25.72 s
Progress: 0 of 1 built, 110 of 244 downloaded from cache (15 downloading)
25.72 s
Downloading cached cargo-package-quick-error from https://cache.nix-ci.com
25.73 s
Downloaded cached cargo-package-icu_segmenter_data (11.7 MiB) in 549ms
25.73 s
Progress: 0 of 1 built, 111 of 244 downloaded from cache (15 downloading)
25.73 s
Downloading cached cargo-package-quick-xml from https://cache.nix-ci.com
25.74 s
Downloaded cached cargo-package-pixglyph (213 KiB) in 83ms
25.74 s
Downloaded cached cargo-package-pico-args (57 KiB) in 88ms
25.74 s
Progress: 0 of 1 built, 112 of 244 downloaded from cache (15 downloading)
25.74 s
Progress: 0 of 1 built, 113 of 244 downloaded from cache (14 downloading)
25.74 s
Downloading cached cargo-package-read-fonts from https://cache.nix-ci.com
25.74 s
Downloaded cached cargo-package-pdf-writer (2.4 MiB) in 162ms
25.74 s
Downloading cached cargo-package-quick-xml from https://cache.nix-ci.com
25.74 s
Downloaded cached cargo-package-pkg-config (79 KiB) in 85ms
25.75 s
Downloaded cached cargo-package-plist (296 KiB) in 88ms
25.75 s
Progress: 0 of 1 built, 114 of 244 downloaded from cache (15 downloading)
25.75 s
Progress: 0 of 1 built, 115 of 244 downloaded from cache (14 downloading)
25.75 s
Downloading cached cargo-package-rgb from https://cache.nix-ci.com
25.75 s
Downloading cached cargo-package-resvg from https://cache.nix-ci.com
25.75 s
Progress: 0 of 1 built, 116 of 244 downloaded from cache (15 downloading)
25.75 s
Downloading cached cargo-package-roman-numerals-rs from https://cache.nix-ci.com
25.77 s
Downloaded cached cargo-package-postcard (206 KiB) in 82ms
25.77 s
Progress: 0 of 1 built, 117 of 244 downloaded from cache (15 downloading)
25.77 s
Downloading cached cargo-package-roxmltree from https://cache.nix-ci.com
25.77 s
Downloaded cached cargo-package-polycool (81 KiB) in 83ms
25.77 s
Progress: 0 of 1 built, 118 of 244 downloaded from cache (15 downloading)
25.77 s
Downloading cached cargo-package-roxmltree from https://cache.nix-ci.com
25.78 s
Downloaded cached cargo-package-proc-macro-hack (60 KiB) in 61ms
25.78 s
Downloaded cached cargo-package-psm (111 KiB) in 55ms
25.78 s
Progress: 0 of 1 built, 119 of 244 downloaded from cache (15 downloading)
25.78 s
Downloading cached cargo-package-rust_decimal from https://cache.nix-ci.com
25.78 s
Progress: 0 of 1 built, 120 of 244 downloaded from cache (15 downloading)
25.78 s
Downloading cached cargo-package-rustybuzz from https://cache.nix-ci.com
25.78 s
Downloaded cached cargo-package-png (561 KiB) in 94ms
25.78 s
Progress: 0 of 1 built, 121 of 244 downloaded from cache (15 downloading)
25.78 s
Downloading cached cargo-package-safe_arch from https://cache.nix-ci.com
25.79 s
Downloaded cached cargo-package-icu_segmenter (18.6 MiB) in 621ms
25.79 s
Downloaded cached cargo-package-rgb (96 KiB) in 44ms
25.80 s
Progress: 0 of 1 built, 122 of 244 downloaded from cache (15 downloading)
25.80 s
Progress: 0 of 1 built, 123 of 244 downloaded from cache (14 downloading)
25.80 s
Downloaded cached cargo-package-potential_utf (38 KiB) in 82ms
25.80 s
Downloaded cached cargo-package-quick-error (65 KiB) in 72ms
25.80 s
Progress: 0 of 1 built, 124 of 244 downloaded from cache (15 downloading)
25.80 s
Downloading cached cargo-package-schannel from https://cache.nix-ci.com
25.80 s
Progress: 0 of 1 built, 125 of 244 downloaded from cache (14 downloading)
25.80 s
Downloading cached cargo-package-serde_path_to_error from https://cache.nix-ci.com
25.80 s
Downloading cached cargo-package-security-framework-sys from https://cache.nix-ci.com
25.80 s
Downloading cached cargo-package-security-framework from https://cache.nix-ci.com
25.81 s
Downloaded cached cargo-package-quick-xml (1.2 MiB) in 87ms
25.81 s
Progress: 0 of 1 built, 126 of 244 downloaded from cache (15 downloading)
25.81 s
Downloaded cached cargo-package-pic-scale (2.3 MiB) in 163ms
25.82 s
Downloading cached cargo-package-simd-adler32 from https://cache.nix-ci.com
25.82 s
Progress: 0 of 1 built, 127 of 244 downloaded from cache (15 downloading)
25.82 s
Downloading cached cargo-package-simplecss from https://cache.nix-ci.com
25.82 s
Downloaded cached cargo-package-roman-numerals-rs (28 KiB) in 71ms
25.82 s
Progress: 0 of 1 built, 128 of 244 downloaded from cache (15 downloading)
25.83 s
Downloading cached cargo-package-skrifa from https://cache.nix-ci.com
25.83 s
Downloaded cached cargo-package-resvg (221 KiB) in 77ms
25.83 s
Progress: 0 of 1 built, 129 of 244 downloaded from cache (15 downloading)
25.83 s
Downloading cached cargo-package-spin from https://cache.nix-ci.com
25.89 s
Downloaded cached cargo-package-security-framework-sys (109 KiB) in 90ms
25.89 s
Progress: 0 of 1 built, 130 of 244 downloaded from cache (15 downloading)
25.89 s
Downloading cached cargo-package-stable_deref_trait from https://cache.nix-ci.com
25.89 s
Downloaded cached cargo-package-quick-xml (1.3 MiB) in 146ms
25.89 s
Downloaded cached cargo-package-schannel (168 KiB) in 97ms
25.89 s
Progress: 0 of 1 built, 131 of 244 downloaded from cache (15 downloading)
25.89 s
Downloading cached cargo-package-stacker from https://cache.nix-ci.com
25.90 s
Downloaded cached cargo-package-serde_path_to_error (108 KiB) in 101ms
25.90 s
Progress: 0 of 1 built, 132 of 244 downloaded from cache (15 downloading)
25.90 s
Progress: 0 of 1 built, 133 of 244 downloaded from cache (14 downloading)
25.90 s
Downloading cached cargo-package-strict-num from https://cache.nix-ci.com
25.90 s
Downloaded cached cargo-package-security-framework (419 KiB) in 101ms
25.90 s
Downloading cached cargo-package-subsetter from https://cache.nix-ci.com
25.90 s
Downloaded cached cargo-package-simplecss (100 KiB) in 82ms
25.90 s
Progress: 0 of 1 built, 134 of 244 downloaded from cache (15 downloading)
25.90 s
Downloading cached cargo-package-svgtypes from https://cache.nix-ci.com
25.90 s
Progress: 0 of 1 built, 135 of 244 downloaded from cache (15 downloading)
25.90 s
Downloading cached cargo-package-symjit from https://cache.nix-ci.com
25.91 s
Downloaded cached cargo-package-roxmltree (281 KiB) in 137ms
25.91 s
Downloaded cached cargo-package-roxmltree (290 KiB) in 141ms
25.91 s
Downloaded cached cargo-package-pxfm (3.7 MiB) in 189ms
25.91 s
Progress: 0 of 1 built, 136 of 244 downloaded from cache (15 downloading)
25.91 s
Progress: 0 of 1 built, 137 of 244 downloaded from cache (15 downloading)
25.91 s
Progress: 0 of 1 built, 138 of 244 downloaded from cache (14 downloading)
25.91 s
Downloading cached cargo-package-syn from https://cache.nix-ci.com
25.92 s
Downloading cached cargo-package-synstructure from https://cache.nix-ci.com
25.92 s
Downloading cached cargo-package-syntect from https://cache.nix-ci.com
25.92 s
Downloaded cached cargo-package-safe_arch (714 KiB) in 135ms
25.92 s
Progress: 0 of 1 built, 139 of 244 downloaded from cache (15 downloading)
25.92 s
Downloading cached cargo-package-tar from https://cache.nix-ci.com
25.92 s
Downloaded cached cargo-package-spin (188 KiB) in 92ms
25.92 s
Progress: 0 of 1 built, 140 of 244 downloaded from cache (15 downloading)
25.92 s
Downloaded cached cargo-package-rust_decimal (793 KiB) in 144ms
25.92 s
Downloaded cached cargo-package-simd-adler32 (85 KiB) in 106ms
25.92 s
Downloaded cached cargo-package-read-fonts (3.4 MiB) in 178ms
25.92 s
Progress: 0 of 1 built, 141 of 244 downloaded from cache (15 downloading)
25.92 s
Downloading cached cargo-package-target-triple from https://cache.nix-ci.com
25.92 s
Progress: 0 of 1 built, 142 of 244 downloaded from cache (14 downloading)
25.92 s
Progress: 0 of 1 built, 143 of 244 downloaded from cache (13 downloading)
25.93 s
Downloading cached cargo-package-termcolor from https://cache.nix-ci.com
25.93 s
Downloading cached cargo-package-thin-vec from https://cache.nix-ci.com
25.93 s
Downloading cached cargo-package-tiny-skia from https://cache.nix-ci.com
25.93 s
Downloaded cached cargo-package-rustybuzz (1.3 MiB) in 151ms
25.93 s
Progress: 0 of 1 built, 144 of 244 downloaded from cache (15 downloading)
25.93 s
Downloaded cached cargo-package-strict-num (27 KiB) in 35ms
25.94 s
Downloaded cached cargo-package-stable_deref_trait (26 KiB) in 47ms
25.94 s
Progress: 0 of 1 built, 145 of 244 downloaded from cache (15 downloading)
25.94 s
Progress: 0 of 1 built, 146 of 244 downloaded from cache (14 downloading)
25.94 s
Downloading cached cargo-package-tiny_http from https://cache.nix-ci.com
25.94 s
Downloading cached cargo-package-tinystr from https://cache.nix-ci.com
25.94 s
Downloading cached cargo-package-tiny-skia-path from https://cache.nix-ci.com
25.94 s
Downloaded cached cargo-package-skrifa (1.4 MiB) in 112ms
25.94 s
Downloaded cached cargo-package-subsetter (202 KiB) in 38ms
25.94 s
Progress: 0 of 1 built, 147 of 244 downloaded from cache (15 downloading)
25.94 s
Progress: 0 of 1 built, 148 of 244 downloaded from cache (15 downloading)
25.94 s
Downloading cached cargo-package-ttf-parser from https://cache.nix-ci.com
25.94 s
Downloading cached cargo-package-trybuild from https://cache.nix-ci.com
25.95 s
Downloaded cached cargo-package-svgtypes (221 KiB) in 44ms
25.95 s
Progress: 0 of 1 built, 149 of 244 downloaded from cache (15 downloading)
25.95 s
Downloading cached cargo-package-two-face from https://cache.nix-ci.com
25.95 s
Downloaded cached cargo-package-stacker (63 KiB) in 58ms
25.95 s
Progress: 0 of 1 built, 150 of 244 downloaded from cache (15 downloading)
25.95 s
Downloading cached cargo-package-typed-arena from https://cache.nix-ci.com
25.96 s
Downloaded cached cargo-package-symjit (831 KiB) in 53ms
25.96 s
Progress: 0 of 1 built, 151 of 244 downloaded from cache (15 downloading)
25.96 s
Downloading cached cargo-package-typst from https://cache.nix-ci.com
25.98 s
Downloaded cached cargo-package-syn (2.3 MiB) in 68ms
25.98 s
Progress: 0 of 1 built, 152 of 244 downloaded from cache (15 downloading)
25.98 s
Downloaded cached cargo-package-synstructure (101 KiB) in 65ms
25.98 s
Progress: 0 of 1 built, 153 of 244 downloaded from cache (15 downloading)
25.98 s
Downloading cached cargo-package-typst-bundle from https://cache.nix-ci.com
25.98 s
Downloading cached cargo-package-typst-assets from https://cache.nix-ci.com
25.99 s
Downloaded cached cargo-package-tar (322 KiB) in 67ms
25.99 s
Progress: 0 of 1 built, 154 of 244 downloaded from cache (15 downloading)
25.99 s
Downloading cached cargo-package-typst-eval from https://cache.nix-ci.com
25.99 s
Downloaded cached cargo-package-target-triple (22 KiB) in 65ms
25.99 s
Progress: 0 of 1 built, 155 of 244 downloaded from cache (15 downloading)
25.99 s
Downloading cached cargo-package-typst-html from https://cache.nix-ci.com
26.01 s
Downloaded cached cargo-package-termcolor (92 KiB) in 78ms
26.01 s
Progress: 0 of 1 built, 156 of 244 downloaded from cache (15 downloading)
26.01 s
Downloading cached cargo-package-typst-kit from https://cache.nix-ci.com
26.01 s
Downloaded cached cargo-package-thin-vec (170 KiB) in 84ms
26.01 s
Progress: 0 of 1 built, 157 of 244 downloaded from cache (15 downloading)
26.01 s
Downloading cached cargo-package-typst-layout from https://cache.nix-ci.com
26.02 s
Downloaded cached cargo-package-syntect (1.4 MiB) in 98ms
26.02 s
Progress: 0 of 1 built, 158 of 244 downloaded from cache (15 downloading)
26.02 s
Downloading cached cargo-package-typst-library from https://cache.nix-ci.com
26.02 s
Downloaded cached cargo-package-tiny_http (197 KiB) in 84ms
26.02 s
Progress: 0 of 1 built, 159 of 244 downloaded from cache (15 downloading)
26.02 s
Downloading cached cargo-package-typst-macros from https://cache.nix-ci.com
26.03 s
Downloaded cached cargo-package-tinystr (118 KiB) in 91ms
26.03 s
Progress: 0 of 1 built, 160 of 244 downloaded from cache (15 downloading)
26.03 s
Downloading cached cargo-package-typst-pdf from https://cache.nix-ci.com
26.04 s
Downloaded cached cargo-package-trybuild (191 KiB) in 99ms
26.04 s
Progress: 0 of 1 built, 161 of 244 downloaded from cache (15 downloading)
26.04 s
Downloading cached cargo-package-typst-realize from https://cache.nix-ci.com
26.05 s
Downloaded cached cargo-package-typed-arena (45 KiB) in 93ms
26.05 s
Progress: 0 of 1 built, 162 of 244 downloaded from cache (15 downloading)
26.05 s
Downloading cached cargo-package-typst-render from https://cache.nix-ci.com
26.05 s
Downloaded cached cargo-package-typst (93 KiB) in 91ms
26.05 s
Progress: 0 of 1 built, 163 of 244 downloaded from cache (15 downloading)
26.05 s
Downloading cached cargo-package-typst-svg from https://cache.nix-ci.com
26.05 s
Downloaded cached cargo-package-tiny-skia-path (220 KiB) in 115ms
26.05 s
Downloaded cached cargo-package-tiny-skia (823 KiB) in 127ms
26.05 s
Progress: 0 of 1 built, 164 of 244 downloaded from cache (15 downloading)
26.06 s
Downloading cached cargo-package-typst-syntax from https://cache.nix-ci.com
26.06 s
Progress: 0 of 1 built, 165 of 244 downloaded from cache (15 downloading)
26.06 s
Downloading cached cargo-package-typst-timing from https://cache.nix-ci.com
26.08 s
Downloaded cached cargo-package-ttf-parser (1 MiB) in 141ms
26.08 s
Downloaded cached cargo-package-typst-eval (185 KiB) in 93ms
26.08 s
Progress: 0 of 1 built, 166 of 244 downloaded from cache (15 downloading)
26.08 s
Downloading cached cargo-package-typst-utils from https://cache.nix-ci.com
26.08 s
Downloaded cached cargo-package-typst-html (328 KiB) in 95ms
26.09 s
Progress: 0 of 1 built, 167 of 244 downloaded from cache (15 downloading)
26.09 s
Progress: 0 of 1 built, 168 of 244 downloaded from cache (14 downloading)
26.09 s
Downloading cached cargo-package-unic-langid-impl from https://cache.nix-ci.com
26.09 s
Downloading cached cargo-package-unic-langid from https://cache.nix-ci.com
26.10 s
Downloaded cached cargo-package-typst-bundle (113 KiB) in 112ms
26.10 s
Progress: 0 of 1 built, 169 of 244 downloaded from cache (15 downloading)
26.10 s
Downloading cached cargo-package-unic-langid-macros from https://cache.nix-ci.com
26.12 s
Downloaded cached cargo-package-typst-kit (199 KiB) in 110ms
26.12 s
Progress: 0 of 1 built, 170 of 244 downloaded from cache (15 downloading)
26.12 s
Downloading cached cargo-package-unic-langid-macros-impl from https://cache.nix-ci.com
26.13 s
Downloaded cached cargo-package-typst-macros (99 KiB) in 108ms
26.13 s
Progress: 0 of 1 built, 171 of 244 downloaded from cache (15 downloading)
26.13 s
Downloading cached cargo-package-unicode-bidi from https://cache.nix-ci.com
26.15 s
Downloaded cached cargo-package-typst-syntax (434 KiB) in 95ms
26.15 s
Progress: 0 of 1 built, 172 of 244 downloaded from cache (15 downloading)
26.16 s
Downloading cached cargo-package-unicode-bidi-mirroring from https://cache.nix-ci.com
26.16 s
Downloaded cached cargo-package-typst-timing (33 KiB) in 100ms
26.16 s
Downloaded cached cargo-package-typst-layout (869 KiB) in 144ms
26.16 s
Progress: 0 of 1 built, 173 of 244 downloaded from cache (15 downloading)
26.16 s
Progress: 0 of 1 built, 174 of 244 downloaded from cache (15 downloading)
26.16 s
Downloading cached cargo-package-unicode-ccc from https://cache.nix-ci.com
26.16 s
Downloading cached cargo-package-unicode-math-class from https://cache.nix-ci.com
26.16 s
Downloaded cached cargo-package-typst-render (121 KiB) in 116ms
26.16 s
Progress: 0 of 1 built, 175 of 244 downloaded from cache (15 downloading)
26.16 s
Downloading cached cargo-package-unicode-normalization from https://cache.nix-ci.com
26.17 s
Downloaded cached cargo-package-typst-realize (139 KiB) in 131ms
26.17 s
Progress: 0 of 1 built, 176 of 244 downloaded from cache (15 downloading)
26.17 s
Downloading cached cargo-package-unicode-properties from https://cache.nix-ci.com
26.17 s
Downloaded cached cargo-package-typst-pdf (352 KiB) in 139ms
26.17 s
Progress: 0 of 1 built, 177 of 244 downloaded from cache (15 downloading)
26.18 s
Downloading cached cargo-package-unicode-script from https://cache.nix-ci.com
26.18 s
Downloaded cached cargo-package-two-face (3.7 MiB) in 230ms
26.18 s
Downloaded cached cargo-package-typst-svg (152 KiB) in 131ms
26.18 s
Progress: 0 of 1 built, 178 of 244 downloaded from cache (15 downloading)
26.18 s
Progress: 0 of 1 built, 179 of 244 downloaded from cache (14 downloading)
26.18 s
Downloading cached cargo-package-unicode-vo from https://cache.nix-ci.com
26.18 s
Downloading cached cargo-package-unicode-width from https://cache.nix-ci.com
26.20 s
Downloaded cached cargo-package-unic-langid-impl (634 KiB) in 108ms
26.20 s
Progress: 0 of 1 built, 180 of 244 downloaded from cache (15 downloading)
26.20 s
Downloaded cached cargo-package-typst-utils (93 KiB) in 111ms
26.20 s
Downloading cached cargo-package-unscanny from https://cache.nix-ci.com
26.20 s
Downloaded cached cargo-package-unic-langid (27 KiB) in 109ms
26.20 s
Progress: 0 of 1 built, 181 of 244 downloaded from cache (15 downloading)
26.20 s
Downloading cached cargo-package-ureq from https://cache.nix-ci.com
26.20 s
Progress: 0 of 1 built, 182 of 244 downloaded from cache (15 downloading)
26.20 s
Downloading cached cargo-package-url from https://cache.nix-ci.com
26.21 s
Downloaded cached cargo-package-unic-langid-macros (18 KiB) in 106ms
26.21 s
Downloaded cached cargo-package-typst-library (2.3 MiB) in 188ms
26.21 s
Progress: 0 of 1 built, 183 of 244 downloaded from cache (15 downloading)
26.21 s
Progress: 0 of 1 built, 184 of 244 downloaded from cache (15 downloading)
26.21 s
Downloading cached cargo-package-usvg from https://cache.nix-ci.com
26.21 s
Downloading cached cargo-package-utf16_iter from https://cache.nix-ci.com
26.22 s
Downloaded cached cargo-package-unic-langid-macros-impl (21 KiB) in 98ms
26.22 s
Progress: 0 of 1 built, 185 of 244 downloaded from cache (15 downloading)
26.22 s
Downloading cached cargo-package-utf8_iter from https://cache.nix-ci.com
26.24 s
Downloaded cached cargo-package-unicode-bidi (264 KiB) in 111ms
26.24 s
Downloaded cached cargo-package-unicode-ccc (31 KiB) in 85ms
26.24 s
Downloaded cached cargo-package-unicode-normalization (719 KiB) in 79ms
26.24 s
Progress: 0 of 1 built, 186 of 244 downloaded from cache (15 downloading)
26.24 s
Progress: 0 of 1 built, 187 of 244 downloaded from cache (14 downloading)
26.24 s
Progress: 0 of 1 built, 188 of 244 downloaded from cache (13 downloading)
26.24 s
Downloaded cached cargo-package-unicode-math-class (95 KiB) in 85ms
26.24 s
Downloading cached cargo-package-vcpkg from https://cache.nix-ci.com
26.24 s
Downloading cached cargo-package-vello_common from https://cache.nix-ci.com
26.24 s
Progress: 0 of 1 built, 189 of 244 downloaded from cache (15 downloading)
26.25 s
Downloading cached cargo-package-vello_common from https://cache.nix-ci.com
26.25 s
Downloading cached cargo-package-vello_cpu from https://cache.nix-ci.com
26.25 s
Downloaded cached cargo-package-unicode-bidi-mirroring (27 KiB) in 90ms
26.25 s
Progress: 0 of 1 built, 190 of 244 downloaded from cache (15 downloading)
26.25 s
Downloading cached cargo-package-wasmi from https://cache.nix-ci.com
26.26 s
Downloaded cached cargo-package-unscanny (38 KiB) in 63ms
26.26 s
Progress: 0 of 1 built, 191 of 244 downloaded from cache (15 downloading)
26.26 s
Downloading cached cargo-package-wasmi_collections from https://cache.nix-ci.com
26.26 s
Downloaded cached cargo-package-unicode-properties (310 KiB) in 90ms
26.26 s
Progress: 0 of 1 built, 192 of 244 downloaded from cache (15 downloading)
26.27 s
Downloading cached cargo-package-wasmi_core from https://cache.nix-ci.com
26.27 s
Downloaded cached cargo-package-unicode-vo (29 KiB) in 89ms
26.27 s
Progress: 0 of 1 built, 193 of 244 downloaded from cache (15 downloading)
26.27 s
Downloading cached cargo-package-wasmi_ir from https://cache.nix-ci.com
26.28 s
Downloaded cached cargo-package-ureq (452 KiB) in 84ms
26.28 s
Downloaded cached cargo-package-url (582 KiB) in 84ms
26.28 s
Progress: 0 of 1 built, 194 of 244 downloaded from cache (15 downloading)
26.28 s
Downloading cached cargo-package-wasmparser from https://cache.nix-ci.com
26.28 s
Downloaded cached cargo-package-unicode-script (264 KiB) in 107ms
26.28 s
Progress: 0 of 1 built, 195 of 244 downloaded from cache (15 downloading)
26.28 s
Progress: 0 of 1 built, 196 of 244 downloaded from cache (14 downloading)
26.28 s
Downloading cached cargo-package-wide from https://cache.nix-ci.com
26.28 s
Downloading cached cargo-package-weezl from https://cache.nix-ci.com
26.29 s
Downloaded cached cargo-package-utf16_iter (38 KiB) in 78ms
26.29 s
Progress: 0 of 1 built, 197 of 244 downloaded from cache (15 downloading)
26.29 s
Downloading cached cargo-package-windows-sys from https://cache.nix-ci.com
26.31 s
Downloaded cached cargo-package-usvg (649 KiB) in 97ms
26.31 s
Progress: 0 of 1 built, 198 of 244 downloaded from cache (15 downloading)
26.31 s
Downloading cached cargo-package-windows-targets from https://cache.nix-ci.com
26.31 s
Downloaded cached cargo-package-unicode-width (2.2 MiB) in 130ms
26.31 s
Progress: 0 of 1 built, 199 of 244 downloaded from cache (15 downloading)
26.31 s
Downloading cached cargo-package-windows_aarch64_gnullvm from https://cache.nix-ci.com
26.32 s
Downloaded cached cargo-package-utf8_iter (42 KiB) in 101ms
26.32 s
Progress: 0 of 1 built, 200 of 244 downloaded from cache (15 downloading)
26.33 s
Downloading cached cargo-package-windows_aarch64_msvc from https://cache.nix-ci.com
26.33 s
Downloaded cached cargo-package-vello_common (577 KiB) in 86ms
26.33 s
Progress: 0 of 1 built, 201 of 244 downloaded from cache (15 downloading)
26.33 s
Downloading cached cargo-package-windows_i686_gnu from https://cache.nix-ci.com
26.35 s
Downloaded cached cargo-package-vello_cpu (462 KiB) in 106ms
26.35 s
Progress: 0 of 1 built, 202 of 244 downloaded from cache (15 downloading)
26.35 s
Downloading cached cargo-package-windows_i686_gnullvm from https://cache.nix-ci.com
26.36 s
Downloaded cached cargo-package-vello_common (582 KiB) in 112ms
26.36 s
Progress: 0 of 1 built, 203 of 244 downloaded from cache (15 downloading)
26.36 s
Downloading cached cargo-package-windows_i686_msvc from https://cache.nix-ci.com
26.37 s
Downloaded cached cargo-package-wasmi_collections (98 KiB) in 110ms
26.37 s
Progress: 0 of 1 built, 204 of 244 downloaded from cache (15 downloading)
26.37 s
Downloading cached cargo-package-windows_x86_64_gnu from https://cache.nix-ci.com
26.38 s
Downloaded cached cargo-package-windows-targets (22 KiB) in 67ms
26.38 s
Progress: 0 of 1 built, 205 of 244 downloaded from cache (15 downloading)
26.38 s
Downloading cached cargo-package-windows_x86_64_gnullvm from https://cache.nix-ci.com
26.38 s
Downloaded cached cargo-package-wasmi_ir (424 KiB) in 109ms
26.39 s
Downloaded cached cargo-package-wasmi_core (264 KiB) in 120ms
26.39 s
Downloaded cached cargo-package-weezl (177 KiB) in 101ms
26.39 s
Progress: 0 of 1 built, 206 of 244 downloaded from cache (15 downloading)
26.39 s
Progress: 0 of 1 built, 207 of 244 downloaded from cache (15 downloading)
26.39 s
Downloading cached cargo-package-windows_x86_64_msvc from https://cache.nix-ci.com
26.39 s
Progress: 0 of 1 built, 208 of 244 downloaded from cache (14 downloading)
26.39 s
Downloading cached cargo-package-write-fonts from https://cache.nix-ci.com
26.39 s
Downloading cached cargo-package-write16 from https://cache.nix-ci.com
26.39 s
Downloaded cached cargo-package-wasmi (1.4 MiB) in 141ms
26.39 s
Progress: 0 of 1 built, 209 of 244 downloaded from cache (15 downloading)
26.39 s
Downloading cached cargo-package-writeable from https://cache.nix-ci.com
26.40 s
Downloaded cached cargo-package-wide (1.1 MiB) in 119ms
26.41 s
Progress: 0 of 1 built, 210 of 244 downloaded from cache (15 downloading)
26.41 s
Downloaded cached cargo-package-typst-assets (9.7 MiB) in 422ms
26.41 s
Progress: 0 of 1 built, 211 of 244 downloaded from cache (15 downloading)
26.41 s
Downloading cached cargo-package-xattr from https://cache.nix-ci.com
26.41 s
Downloading cached cargo-package-xmlwriter from https://cache.nix-ci.com
26.42 s
Downloaded cached cargo-package-wasmparser (1.4 MiB) in 132ms
26.42 s
Progress: 0 of 1 built, 212 of 244 downloaded from cache (15 downloading)
26.42 s
Downloading cached cargo-package-xmp-writer from https://cache.nix-ci.com
26.46 s
Downloaded cached cargo-package-windows_aarch64_gnullvm (4.9 MiB) in 148ms
26.46 s
Progress: 0 of 1 built, 213 of 244 downloaded from cache (15 downloading)
26.46 s
Downloading cached cargo-package-yaml-rust from https://cache.nix-ci.com
26.47 s
Downloaded cached cargo-package-vcpkg (2.5 MiB) in 229ms
26.47 s
Progress: 0 of 1 built, 214 of 244 downloaded from cache (15 downloading)
26.47 s
Downloading cached cargo-package-yoke from https://cache.nix-ci.com
26.49 s
Downloaded cached cargo-package-windows_aarch64_msvc (5 MiB) in 166ms
26.49 s
Progress: 0 of 1 built, 215 of 244 downloaded from cache (15 downloading)
26.49 s
Downloading cached cargo-package-yoke-derive from https://cache.nix-ci.com
26.54 s
Downloaded cached cargo-package-writeable (134 KiB) in 153ms
26.55 s
Progress: 0 of 1 built, 216 of 244 downloaded from cache (15 downloading)
26.55 s
Downloading cached cargo-package-zerofrom from https://cache.nix-ci.com
26.56 s
Downloaded cached cargo-package-xmlwriter (31 KiB) in 149ms
26.56 s
Progress: 0 of 1 built, 217 of 244 downloaded from cache (15 downloading)
26.56 s
Downloading cached cargo-package-zerofrom-derive from https://cache.nix-ci.com
26.56 s
Downloaded cached cargo-package-yaml-rust (302 KiB) in 99ms
26.56 s
Progress: 0 of 1 built, 218 of 244 downloaded from cache (15 downloading)
26.56 s
Downloaded cached cargo-package-xmp-writer (117 KiB) in 146ms
26.56 s
Progress: 0 of 1 built, 219 of 244 downloaded from cache (15 downloading)
26.56 s
Downloading cached cargo-package-zerotrie from https://cache.nix-ci.com
26.56 s
Downloaded cached cargo-package-write16 (24 KiB) in 175ms
26.56 s
Downloading cached cargo-package-zerovec from https://cache.nix-ci.com
26.56 s
Progress: 0 of 1 built, 220 of 244 downloaded from cache (15 downloading)
26.56 s
Downloaded cached cargo-package-windows_i686_gnullvm (5.2 MiB) in 212ms
26.56 s
Progress: 0 of 1 built, 221 of 244 downloaded from cache (15 downloading)
26.56 s
Downloading cached cargo-package-zerovec-derive from https://cache.nix-ci.com
26.57 s
Downloading cached cargo-package-zlib-rs from https://cache.nix-ci.com
26.57 s
Downloaded cached cargo-package-zerofrom (18 KiB) in 23ms
26.57 s
Progress: 0 of 1 built, 222 of 244 downloaded from cache (15 downloading)
26.57 s
Downloading cached cargo-package-zune-core from https://cache.nix-ci.com
26.57 s
Downloaded cached cargo-package-windows_x86_64_gnullvm (4.9 MiB) in 196ms
26.57 s
Progress: 0 of 1 built, 223 of 244 downloaded from cache (15 downloading)
26.57 s
Downloading cached cargo-package-zune-jpeg from https://cache.nix-ci.com
26.57 s
Downloaded cached cargo-package-xattr (60 KiB) in 166ms
26.57 s
Progress: 0 of 1 built, 224 of 244 downloaded from cache (15 downloading)
26.57 s
Downloading cached linkLockedDeps from https://cache.nix-ci.com
26.58 s
Downloaded cached cargo-package-yoke-derive (62 KiB) in 88ms
26.58 s
Progress: 0 of 1 built, 225 of 244 downloaded from cache (15 downloading)
26.58 s
Downloaded cached cargo-package-yoke (147 KiB) in 106ms
26.58 s
Progress: 0 of 1 built, 226 of 244 downloaded from cache (14 downloading)
26.59 s
Downloaded cached cargo-package-write-fonts (1.6 MiB) in 203ms
26.59 s
Progress: 0 of 1 built, 227 of 244 downloaded from cache (13 downloading)
26.59 s
Downloaded cached cargo-package-windows_i686_gnu (12.6 MiB) in 260ms
26.60 s
Progress: 0 of 1 built, 228 of 244 downloaded from cache (12 downloading)
26.60 s
Downloaded cached cargo-package-zerofrom-derive (28 KiB) in 40ms
26.60 s
Progress: 0 of 1 built, 229 of 244 downloaded from cache (11 downloading)
26.60 s
Downloaded cached cargo-package-zerovec-derive (102 KiB) in 38ms
26.60 s
Progress: 0 of 1 built, 230 of 244 downloaded from cache (10 downloading)
26.61 s
Downloaded cached cargo-package-windows_i686_msvc (5.3 MiB) in 246ms
26.61 s
Progress: 0 of 1 built, 231 of 244 downloaded from cache (9 downloading)
26.61 s
Downloaded cached cargo-package-zerovec (634 KiB) in 47ms
26.61 s
Progress: 0 of 1 built, 232 of 244 downloaded from cache (8 downloading)
26.61 s
Downloaded cached cargo-package-zlib-rs (779 KiB) in 48ms
26.61 s
Progress: 0 of 1 built, 233 of 244 downloaded from cache (7 downloading)
26.61 s
Downloaded cached cargo-package-zune-core (125 KiB) in 44ms
26.62 s
Progress: 0 of 1 built, 234 of 244 downloaded from cache (6 downloading)
26.62 s
Downloaded cached cargo-package-windows_x86_64_msvc (5 MiB) in 230ms
26.62 s
Progress: 0 of 1 built, 235 of 244 downloaded from cache (5 downloading)
26.62 s
Downloaded cached cargo-package-zune-jpeg (372 KiB) in 45ms
26.62 s
Downloaded cached linkLockedDeps (1128 B) in 44ms
26.62 s
Downloaded cached cargo-package-zerotrie (414 KiB) in 54ms
26.62 s
Progress: 0 of 1 built, 236 of 244 downloaded from cache (4 downloading)
26.62 s
Progress: 0 of 1 built, 237 of 244 downloaded from cache (3 downloading)
26.62 s
Progress: 0 of 1 built, 238 of 244 downloaded from cache (2 downloading)
26.63 s
Downloaded cached cargo-package-windows_x86_64_gnu (12.1 MiB) in 254ms
26.63 s
Progress: 0 of 1 built, 239 of 244 downloaded from cache (1 downloading)
26.69 s
Downloaded cached cargo-package-windows-sys (17.5 MiB) in 401ms
26.69 s
Progress: 0 of 1 built, 240 of 244 downloaded from cache
26.70 s
Downloading cached vendor-registry from https://cache.nix-ci.com
26.76 s
Downloaded cached vendor-registry (218 KiB) in 64ms
26.76 s
Progress: 0 of 1 built, 241 of 244 downloaded from cache
26.76 s
Downloading cached vendor-cargo-deps from https://cache.nix-ci.com
26.77 s
Downloaded cached vendor-cargo-deps (1752 B) in 7ms
26.77 s
Progress: 0 of 1 built, 242 of 244 downloaded from cache
26.77 s
Downloading cached gammaloop-workspace-deps-deps from https://cache.nix-ci.com
33.51 s
Downloaded cached gammaloop-workspace-deps-deps (388.9 MiB) in 6.7s
33.66 s
Progress: 0 of 1 built, 243 of 244 downloaded from cache
33.66 s
Downloading cached nix-ci-check-gammaloop-doctest from https://cache.nix-ci.com
33.66 s
Downloaded cached nix-ci-check-gammaloop-doctest (1000 B) in 0ms
33.66 s
Progress: 0 of 1 built, 244 of 244 downloaded from cache
38.03 s
evaluating derivation 'g
copying '/nix/store/913l
evaluating derivation 'g
querying gammaloop-works
[0 /1 built, 0.0 KiB DL]
[1 /0 /1 built, 0.0 KiB DLgammaloop-workspace-doctest> Running phase: unpackPhase
38.04 s
gammaloop-workspace-doctest> unpacking source archive /nix/store/5afz06g4vsphrihpxicbxvm3sk5psnll-source
38.21 s
gammaloop-workspace-doctest> source root is source
38.24 s
gammaloop-workspace-doctest> Running phase: patchPhase
38.25 s
gammaloop-workspace-doctest> Executing configureCargoCommonVars
38.25 s
gammaloop-workspace-doctest> decompressing cargo artifacts from /nix/store/9q03j4h8yyxwgigikinn0j17963s9lwf-gammaloop-workspace-deps-deps-0.1.0/target.tar.zst to target
40.76 s
gammaloop-workspace-doctest> Running phase: updateAutotoolsGnuConfigScriptsPhase
40.81 s
gammaloop-workspace-doctest> Running phase: configurePhase
40.82 s
gammaloop-workspace-doctest> will append /build/source/.cargo-home/config.toml with contents of /nix/store/4vj0f29myggx0gdynf7fwm2wfzgqnk61-vendor-cargo-deps/config.toml
40.82 s
gammaloop-workspace-doctest> default configurePhase, nothing to do
40.83 s
gammaloop-workspace-doctest> Running phase: buildPhase
40.84 s
gammaloop-workspace-doctest> +++ command cargo --version
40.84 s
gammaloop-workspace-doctest> cargo 1.97.0 (c980f4866 2026-06-30)
40.89 s
gammaloop-workspace-doctest> +++ command cargo test --profile ci-optim --doc --locked --workspace --features gammaloop-api/cli,gammaloop-tracing-filter/clap,gammaloop-tracing-filter/symbolica,idenso/bincode,idenso/reference-cases,linnet/bincode,linnet/drawing,linnet/nodestore-vec,linnet/rkyv,linnet/serde,linnet/symbolica,spenso-macros/shadowing,spenso/shadowing,symbolica/tracing_max_level_info
41.64 s
gammaloop-workspace-doctest> Compiling target-lexicon v0.13.5
41.65 s
gammaloop-workspace-doctest> Compiling symbolica v2.2.0 (https://github.com/symbolica-dev/symbolica?branch=dev#0441bd7a)
41.65 s
gammaloop-workspace-doctest> Compiling maplit v1.0.2
41.67 s
gammaloop-workspace-doctest> Compiling gammaloop-tracing-filter-macros v0.1.0 (/build/source/crates/gammaloop-tracing-filter-macros)
41.67 s
gammaloop-workspace-doctest> Compiling vakint v0.1.2 (/build/source/crates/vakint)
41.69 s
gammaloop-workspace-doctest> Compiling gammalooprs v0.3.4 (/build/source/crates/gammalooprs)
41.70 s
gammaloop-workspace-doctest> Compiling alphal00p-docs-macros v0.1.0 (/build/source/crates/alphal00p-docs-macros)
41.70 s
gammaloop-workspace-doctest> Compiling alphal00p-docs-schema v0.1.0 (/build/source/crates/alphal00p-docs-schema)
41.70 s
gammaloop-workspace-doctest> Compiling rustc_version v0.4.1
41.72 s
gammaloop-workspace-doctest> Compiling bincode v1.3.3
41.72 s
gammaloop-workspace-doctest> Compiling gungraun-runner v0.18.2
41.73 s
gammaloop-workspace-doctest> Compiling target-triple v1.0.1
41.74 s
gammaloop-workspace-doctest> Compiling iai-callgrind-runner v0.14.2
41.75 s
gammaloop-workspace-doctest> Compiling gammaloop-integration-tests v0.1.0 (/build/source/tests)
41.75 s
gammaloop-workspace-doctest> Compiling test-log-core v0.2.20
42.08 s
gammaloop-workspace-doctest> Compiling wait-timeout v0.2.1
42.09 s
gammaloop-workspace-doctest> Compiling bit-vec v0.8.0
42.10 s
gammaloop-workspace-doctest> Compiling quick-error v1.2.3
42.22 s
gammaloop-workspace-doctest> Compiling iai-callgrind v0.14.2
42.49 s
gammaloop-workspace-doctest> Compiling bit-set v0.8.0
42.52 s
gammaloop-workspace-doctest> Compiling rusty-fork v0.3.1
42.55 s
gammaloop-workspace-doctest> Compiling iai-callgrind-macros v0.5.1
42.66 s
gammaloop-workspace-doctest> Compiling gungraun-macros v0.8.0
42.75 s
gammaloop-workspace-doctest> Compiling rand_xorshift v0.4.0
42.77 s
gammaloop-workspace-doctest> Compiling console v0.15.11
42.81 s
gammaloop-workspace-doctest> Compiling base64 v0.21.7
42.92 s
gammaloop-workspace-doctest> Compiling glob v0.3.4
43.03 s
gammaloop-workspace-doctest> Compiling unarray v0.1.4
43.26 s
gammaloop-workspace-doctest> Compiling termcolor v1.4.1
43.27 s
gammaloop-workspace-doctest> Compiling proptest v1.11.0
43.52 s
gammaloop-workspace-doctest> Compiling alphal00p-docs-builder v0.1.0 (/build/source/crates/alphal00p-docs-builder)
44.05 s
gammaloop-workspace-doctest> Compiling trybuild v1.0.120
44.35 s
gammaloop-workspace-doctest> Compiling similar-asserts v1.7.0
44.37 s
gammaloop-workspace-doctest> Compiling ron v0.8.1
44.44 s
gammaloop-workspace-doctest> Compiling pyo3-build-config v0.28.3
44.48 s
gammaloop-workspace-doctest> Compiling alphal00p-docs-catalogs v0.1.0 (/build/source/crates/alphal00p-docs-catalogs)
44.53 s
gammaloop-workspace-doctest> Compiling kurvst v0.1.0 (/build/source/crates/kurvst)
44.83 s
gammaloop-workspace-doctest> Compiling test-log-macros v0.2.20
48.01 s
gammaloop-workspace-doctest> Compiling test-log v0.2.20
50.45 s
gammaloop-workspace-doctest> Compiling alphal00p-docs-examples v0.1.0 (/build/source/crates/alphal00p-docs-examples)
54.22 s
gammaloop-workspace-doctest> Compiling pyo3-macros-backend v0.28.3
54.64 s
gammaloop-workspace-doctest> Compiling pyo3-ffi v0.28.3
54.75 s
gammaloop-workspace-doctest> Compiling pyo3 v0.28.3
54.82 s
gammaloop-workspace-doctest> Compiling numpy v0.28.0
54.90 s
gammaloop-workspace-doctest> Compiling gammaloop-api v0.1.0 (/build/source/crates/gammaloop-api)
54.93 s
gammaloop-workspace-doctest> Compiling gungraun v0.18.2
64.42 s
gammaloop-workspace-doctest> Compiling pyo3-macros v0.28.3
73.40 s
gammaloop-workspace-doctest> Compiling pyo3-stub-gen v0.17.2
74.91 s
gammaloop-workspace-doctest> Compiling numerica v2.2.0 (https://github.com/symbolica-dev/symbolica?branch=dev#0441bd7a)
79.44 s
gammaloop-workspace-doctest> Compiling graphica v2.1.0 (https://github.com/symbolica-dev/symbolica?branch=dev#0441bd7a)
86.87 s
gammaloop-workspace-doctest> Compiling symbolica-utils v0.1.0 (/build/source/crates/symbolica-utils)
350.28 s
gammaloop-workspace-doctest> Compiling gammaloop-workspace-hack v0.1.0 (/build/source/crates/gammaloop-workspace-hack)
350.30 s
gammaloop-workspace-doctest> Compiling spenso-macros v0.3.2 (/build/source/crates/spenso-macros)
350.59 s
gammaloop-workspace-doctest> Compiling linnet v0.17.0 (/build/source/crates/linnet)
356.08 s
gammaloop-workspace-doctest> Compiling spenso v0.6.0 (/build/source/crates/spenso)
366.21 s
gammaloop-workspace-doctest> Compiling idenso v0.3.0 (/build/source/crates/idenso)
366.22 s
gammaloop-workspace-doctest> Compiling gammaloop-tracing-filter v0.1.0 (/build/source/crates/gammaloop-tracing-filter)
372.77 s
gammaloop-workspace-doctest> Compiling spenso-hep-lib v0.1.7 (/build/source/crates/spenso-hep-lib)
373.16 s
gammaloop-workspace-doctest> Compiling spynso3 v0.1.2 (/build/source/crates/spynso3)
435.01 s
gammaloop-workspace-doctest> Compiling linnest v0.1.0 (/build/source/crates/linnest)
435.03 s
gammaloop-workspace-doctest> Compiling linnet-py v0.1.0 (/build/source/crates/linnet-py)
735.48 s
gammaloop-workspace-doctest> Finished `ci-optim` profile [optimized] target(s) in 11m 34s
735.65 s
gammaloop-workspace-doctest> warning : the following packages contain code that will be rejected by a future version of Rust: proc-macro-error2 v2.0.1
735.65 s
gammaloop-workspace-doctest> note : to see what the problems were, use the option `--future-incompat-report`, or run `cargo report future-incompatibilities --id 1`
735.69 s
gammaloop-workspace-doctest> Doc-tests alphal00p_docs_builder
735.89 s
gammaloop-workspace-doctest>
735.89 s
gammaloop-workspace-doctest> running 0 tests
735.89 s
gammaloop-workspace-doctest>
735.89 s
gammaloop-workspace-doctest> test result: ok. 0 passed; 0 failed; 0 ignored; 0 measured; 0 filtered out; finished in 0.00s
735.89 s
gammaloop-workspace-doctest>
735.89 s
gammaloop-workspace-doctest> Doc-tests alphal00p_docs_catalogs
737.36 s
gammaloop-workspace-doctest>
737.36 s
gammaloop-workspace-doctest> running 0 tests
737.36 s
gammaloop-workspace-doctest>
737.36 s
gammaloop-workspace-doctest> test result: ok. 0 passed; 0 failed; 0 ignored; 0 measured; 0 filtered out; finished in 0.00s
737.36 s
gammaloop-workspace-doctest>
737.36 s
gammaloop-workspace-doctest> Doc-tests alphal00p_docs_examples
737.38 s
gammaloop-workspace-doctest>
737.38 s
gammaloop-workspace-doctest> running 0 tests
737.38 s
gammaloop-workspace-doctest>
737.38 s
gammaloop-workspace-doctest> test result: ok. 0 passed; 0 failed; 0 ignored; 0 measured; 0 filtered out; finished in 0.00s
737.38 s
gammaloop-workspace-doctest>
737.38 s
gammaloop-workspace-doctest> Doc-tests alphal00p_docs
737.45 s
gammaloop-workspace-doctest>
737.45 s
gammaloop-workspace-doctest> running 0 tests
737.45 s
gammaloop-workspace-doctest>
737.45 s
gammaloop-workspace-doctest> test result: ok. 0 passed; 0 failed; 0 ignored; 0 measured; 0 filtered out; finished in 0.00s
737.45 s
gammaloop-workspace-doctest>
737.45 s
gammaloop-workspace-doctest> Doc-tests alphal00p_docs_schema
737.55 s
gammaloop-workspace-doctest>
737.55 s
gammaloop-workspace-doctest> running 0 tests
737.55 s
gammaloop-workspace-doctest>
737.55 s
gammaloop-workspace-doctest> test result: ok. 0 passed; 0 failed; 0 ignored; 0 measured; 0 filtered out; finished in 0.00s
737.55 s
gammaloop-workspace-doctest>
737.55 s
gammaloop-workspace-doctest> Doc-tests gammaloop_api
738.76 s
gammaloop-workspace-doctest>
738.76 s
gammaloop-workspace-doctest> running 16 tests
738.79 s
gammaloop-workspace-doctest> test crates/gammaloop-api/src/python.rs - python::GammaLoopAPI::get_integrand_settings (line 3647) ... FAILED
738.79 s
gammaloop-workspace-doctest> test crates/gammaloop-api/src/python.rs - python::GammaLoopAPI::get_active_command_blocks (line 3760) ... FAILED
738.79 s
gammaloop-workspace-doctest> test crates/gammaloop-api/src/python.rs - python::GammaLoopAPI::evaluate_samples (line 3108) ... FAILED
738.80 s
gammaloop-workspace-doctest> test crates/gammaloop-api/src/python.rs - python::GammaLoopAPI::evaluate_sample (line 2967) ... FAILED
738.80 s
gammaloop-workspace-doctest> test crates/gammaloop-api/src/python.rs - python::PyHistogramAccumulator (line 871) ... FAILED
738.80 s
gammaloop-workspace-doctest> test crates/gammaloop-api/src/python.rs - python::GammaLoopAPI::get_default_runtime_settings (line 3796) ... FAILED
738.80 s
gammaloop-workspace-doctest> test crates/gammaloop-api/src/python.rs - python::GammaLoopAPI::get_integrand_info (line 3585) ... FAILED
738.87 s
gammaloop-workspace-doctest> test crates/gammaloop-api/src/lib.rs - (line 18) - compile ... ok
738.94 s
gammaloop-workspace-doctest> test crates/gammaloop-api/src/python.rs - python::atom_to_dots (line 157) ... FAILED
738.94 s
gammaloop-workspace-doctest> test crates/gammaloop-api/src/python.rs - python::GammaLoopAPI::get_global_settings (line 3739) ... FAILED
738.95 s
gammaloop-workspace-doctest> test crates/gammaloop-api/src/python.rs - python::evaluate_graph_overall_factor (line 95) ... FAILED
738.96 s
gammaloop-workspace-doctest> test crates/gammaloop-api/src/python.rs - python::GammaLoopAPI::run_command (line 3901) ... FAILED
738.97 s
gammaloop-workspace-doctest> test crates/gammaloop-api/src/python.rs - python::GammaLoopAPI::get_run_history (line 3711) ... FAILED
738.97 s
gammaloop-workspace-doctest> test crates/gammaloop-api/src/python.rs - python::GammaLoopAPI::new_python (line 2834) ... FAILED
739.00 s
gammaloop-workspace-doctest> test crates/gammaloop-api/src/python.rs - python::atom_to_canonical_string (line 128) ... FAILED
743.03 s
gammaloop-workspace-doctest> test crates/gammaloop-api/src/commands/evaluate_samples.rs - commands::evaluate_samples::EvaluateSamples (line 50) ... ok
743.06 s
gammaloop-workspace-doctest>
743.06 s
gammaloop-workspace-doctest> failures:
743.06 s
gammaloop-workspace-doctest>
743.06 s
gammaloop-workspace-doctest> ---- crates/gammaloop-api/src/python.rs - python::GammaLoopAPI::get_integrand_settings (line 3647) stdout ----
743.06 s
gammaloop-workspace-doctest> error: expected one of `!` or `::`, found `=`
743.06 s
gammaloop-workspace-doctest> --> crates/gammaloop-api/src/python.rs:3648:10
743.06 s
gammaloop-workspace-doctest> |
743.06 s
gammaloop-workspace-doctest> 3648 | settings = api.get_integrand_settings(process_id=0)
743.06 s
gammaloop-workspace-doctest> | ^ expected one of `!` or `::`
743.06 s
gammaloop-workspace-doctest>
743.06 s
gammaloop-workspace-doctest> error: aborting due to 1 previous error
743.06 s
gammaloop-workspace-doctest>
743.06 s
gammaloop-workspace-doctest> Couldn't compile the test.
743.06 s
gammaloop-workspace-doctest> ---- crates/gammaloop-api/src/python.rs - python::GammaLoopAPI::get_active_command_blocks (line 3760) stdout ----
743.06 s
gammaloop-workspace-doctest> error: expected item, found keyword `for`
743.06 s
gammaloop-workspace-doctest> --> crates/gammaloop-api/src/python.rs:3761:1
743.06 s
gammaloop-workspace-doctest> |
743.06 s
gammaloop-workspace-doctest> 3761 | for name, commands in api.get_active_command_blocks().items():
743.06 s
gammaloop-workspace-doctest> | ^^^ expected item
743.06 s
gammaloop-workspace-doctest> |
743.06 s
gammaloop-workspace-doctest> = note: for a full list of items that can appear in modules, see <https://doc.rust-lang.org/reference/items.html>
743.06 s
gammaloop-workspace-doctest>
743.06 s
gammaloop-workspace-doctest> error: aborting due to 1 previous error
743.06 s
gammaloop-workspace-doctest>
743.06 s
gammaloop-workspace-doctest> Couldn't compile the test.
743.06 s
gammaloop-workspace-doctest> ---- crates/gammaloop-api/src/python.rs - python::GammaLoopAPI::evaluate_samples (line 3108) stdout ----
743.06 s
gammaloop-workspace-doctest> error: expected one of `!` or `::`, found `pathlib`
743.06 s
gammaloop-workspace-doctest> --> crates/gammaloop-api/src/python.rs:3109:6
743.06 s
gammaloop-workspace-doctest> |
743.06 s
gammaloop-workspace-doctest> 3109 | from pathlib import Path
743.06 s
gammaloop-workspace-doctest> | ^^^^^^^ expected one of `!` or `::`
743.06 s
gammaloop-workspace-doctest>
743.06 s
gammaloop-workspace-doctest> error: aborting due to 1 previous error
743.06 s
gammaloop-workspace-doctest>
743.06 s
gammaloop-workspace-doctest> Couldn't compile the test.
743.06 s
gammaloop-workspace-doctest> ---- crates/gammaloop-api/src/python.rs - python::GammaLoopAPI::evaluate_sample (line 2967) stdout ----
743.06 s
gammaloop-workspace-doctest> error: expected one of `!` or `::`, found `pathlib`
743.06 s
gammaloop-workspace-doctest> --> crates/gammaloop-api/src/python.rs:2968:6
743.06 s
gammaloop-workspace-doctest> |
743.06 s
gammaloop-workspace-doctest> 2968 | from pathlib import Path
743.06 s
gammaloop-workspace-doctest> | ^^^^^^^ expected one of `!` or `::`
743.06 s
gammaloop-workspace-doctest>
743.06 s
gammaloop-workspace-doctest> error: aborting due to 1 previous error
743.06 s
gammaloop-workspace-doctest>
743.06 s
gammaloop-workspace-doctest> Couldn't compile the test.
743.06 s
gammaloop-workspace-doctest> ---- crates/gammaloop-api/src/python.rs - python::PyHistogramAccumulator (line 871) stdout ----
743.06 s
gammaloop-workspace-doctest> error: expected one of `!` or `::`, found `gammaloop`
743.06 s
gammaloop-workspace-doctest> --> crates/gammaloop-api/src/python.rs:872:6
743.06 s
gammaloop-workspace-doctest> |
743.06 s
gammaloop-workspace-doctest> 872 | from gammaloop import HistogramAccumulator
743.06 s
gammaloop-workspace-doctest> | ^^^^^^^^^ expected one of `!` or `::`
743.06 s
gammaloop-workspace-doctest>
743.06 s
gammaloop-workspace-doctest> error: aborting due to 1 previous error
743.06 s
gammaloop-workspace-doctest>
743.06 s
gammaloop-workspace-doctest> Couldn't compile the test.
743.06 s
gammaloop-workspace-doctest> ---- crates/gammaloop-api/src/python.rs - python::GammaLoopAPI::get_default_runtime_settings (line 3796) stdout ----
743.06 s
gammaloop-workspace-doctest> error: expected one of `!` or `::`, found `=`
743.06 s
gammaloop-workspace-doctest> --> crates/gammaloop-api/src/python.rs:3797:9
743.06 s
gammaloop-workspace-doctest> |
743.06 s
gammaloop-workspace-doctest> 3797 | runtime = api.get_default_runtime_settings()
743.06 s
gammaloop-workspace-doctest> | ^ expected one of `!` or `::`
743.06 s
gammaloop-workspace-doctest>
743.06 s
gammaloop-workspace-doctest> error: aborting due to 1 previous error
743.06 s
gammaloop-workspace-doctest>
743.06 s
gammaloop-workspace-doctest> Couldn't compile the test.
743.06 s
gammaloop-workspace-doctest> ---- crates/gammaloop-api/src/python.rs - python::GammaLoopAPI::get_integrand_info (line 3585) stdout ----
743.06 s
gammaloop-workspace-doctest> error: expected one of `!` or `::`, found `pathlib`
743.06 s
gammaloop-workspace-doctest> --> crates/gammaloop-api/src/python.rs:3586:6
743.06 s
gammaloop-workspace-doctest> |
743.06 s
gammaloop-workspace-doctest> 3586 | from pathlib import Path
743.06 s
gammaloop-workspace-doctest> | ^^^^^^^ expected one of `!` or `::`
743.06 s
gammaloop-workspace-doctest>
743.06 s
gammaloop-workspace-doctest> error: aborting due to 1 previous error
743.06 s
gammaloop-workspace-doctest>
743.06 s
gammaloop-workspace-doctest> Couldn't compile the test.
743.06 s
gammaloop-workspace-doctest> ---- crates/gammaloop-api/src/python.rs - python::atom_to_dots (line 157) stdout ----
743.06 s
gammaloop-workspace-doctest> error[E0425] : cannot find function `to_dots` in this scope
743.06 s
gammaloop-workspace-doctest> --> crates/gammaloop-api/src/python.rs:158:1
743.06 s
gammaloop-workspace-doctest> |
743.06 s
gammaloop-workspace-doctest> 158 | to_dots("p(mu) * q(mu)")
743.06 s
gammaloop-workspace-doctest> | ^^^^^^^ not found in this scope
743.06 s
gammaloop-workspace-doctest>
743.06 s
gammaloop-workspace-doctest> error : aborting due to 1 previous error
743.06 s
gammaloop-workspace-doctest>
743.06 s
gammaloop-workspace-doctest> For more information about this error, try `rustc --explain E0425`.
743.06 s
gammaloop-workspace-doctest> Couldn't compile the test.
743.06 s
gammaloop-workspace-doctest> ---- crates/gammaloop-api/src/python.rs - python::GammaLoopAPI::get_global_settings (line 3739) stdout ----
743.06 s
gammaloop-workspace-doctest> error[E0425] : cannot find value `settings_toml` in this scope
743.06 s
gammaloop-workspace-doctest> --> crates/gammaloop-api/src/python.rs:3740:1
743.06 s
gammaloop-workspace-doctest> |
743.06 s
gammaloop-workspace-doctest> 3740 | settings_toml = api.get_global_settings()
743.06 s
gammaloop-workspace-doctest> | ^^^^^^^^^^^^^
743.06 s
gammaloop-workspace-doctest> |
743.06 s
gammaloop-workspace-doctest> help : you might have meant to introduce a new binding
743.06 s
gammaloop-workspace-doctest> |
743.06 s
gammaloop-workspace-doctest> 3740 | let settings_toml = api.get_global_settings()
743.06 s
gammaloop-workspace-doctest> | +++
743.06 s
gammaloop-workspace-doctest>
743.06 s
gammaloop-workspace-doctest> error[E0425] : cannot find value `api` in this scope
743.06 s
gammaloop-workspace-doctest> --> crates/gammaloop-api/src/python.rs:3740:17
743.06 s
gammaloop-workspace-doctest> |
743.06 s
gammaloop-workspace-doctest> 3740 | settings_toml = api.get_global_settings()
743.06 s
gammaloop-workspace-doctest> | ^^^ not found in this scope
743.06 s
gammaloop-workspace-doctest>
743.06 s
gammaloop-workspace-doctest> error : aborting due to 2 previous errors
743.06 s
gammaloop-workspace-doctest>
743.06 s
gammaloop-workspace-doctest> For more information about this error, try `rustc --explain E0425`.
743.06 s
gammaloop-workspace-doctest> Couldn't compile the test.
743.06 s
gammaloop-workspace-doctest> ---- crates/gammaloop-api/src/python.rs - python::evaluate_graph_overall_factor (line 95) stdout ----
743.06 s
gammaloop-workspace-doctest> error[E0425] : cannot find function `evaluate_graph_overall_factor` in this scope
743.06 s
gammaloop-workspace-doctest> --> crates/gammaloop-api/src/python.rs:96:1
743.06 s
gammaloop-workspace-doctest> |
743.06 s
gammaloop-workspace-doctest> 96 | evaluate_graph_overall_factor(
743.06 s
gammaloop-workspace-doctest> | ^^^^^^^^^^^^^^^^^^^^^^^^^^^^^ not found in this scope
743.06 s
gammaloop-workspace-doctest>
743.06 s
gammaloop-workspace-doctest> error : aborting due to 1 previous error
743.06 s
gammaloop-workspace-doctest>
743.06 s
gammaloop-workspace-doctest> For more information about this error, try `rustc --explain E0425`.
743.06 s
gammaloop-workspace-doctest> Couldn't compile the test.
743.06 s
gammaloop-workspace-doctest> ---- crates/gammaloop-api/src/python.rs - python::GammaLoopAPI::run_command (line 3901) stdout ----
743.06 s
gammaloop-workspace-doctest> error[E0425] : cannot find value `api` in this scope
743.06 s
gammaloop-workspace-doctest> --> crates/gammaloop-api/src/python.rs:3902:1
743.06 s
gammaloop-workspace-doctest> |
743.06 s
gammaloop-workspace-doctest> 3902 | api.run("display processes")
743.06 s
gammaloop-workspace-doctest> | ^^^ not found in this scope
743.06 s
gammaloop-workspace-doctest>
743.06 s
gammaloop-workspace-doctest> error : aborting due to 1 previous error
743.06 s
gammaloop-workspace-doctest>
743.06 s
gammaloop-workspace-doctest> For more information about this error, try `rustc --explain E0425`.
743.06 s
gammaloop-workspace-doctest> Couldn't compile the test.
743.06 s
gammaloop-workspace-doctest> ---- crates/gammaloop-api/src/python.rs - python::GammaLoopAPI::get_run_history (line 3711) stdout ----
743.06 s
gammaloop-workspace-doctest> error[E0425] : cannot find value `run_card_toml` in this scope
743.06 s
gammaloop-workspace-doctest> --> crates/gammaloop-api/src/python.rs:3712:1
743.06 s
gammaloop-workspace-doctest> |
743.06 s
gammaloop-workspace-doctest> 3712 | run_card_toml = api.get_run_history()
743.06 s
gammaloop-workspace-doctest> | ^^^^^^^^^^^^^
743.06 s
gammaloop-workspace-doctest> |
743.06 s
gammaloop-workspace-doctest> help : you might have meant to introduce a new binding
743.06 s
gammaloop-workspace-doctest> |
743.06 s
gammaloop-workspace-doctest> 3712 | let run_card_toml = api.get_run_history()
743.06 s
gammaloop-workspace-doctest> | +++
743.06 s
gammaloop-workspace-doctest>
743.06 s
gammaloop-workspace-doctest> error[E0425] : cannot find value `api` in this scope
743.06 s
gammaloop-workspace-doctest> --> crates/gammaloop-api/src/python.rs:3712:17
743.06 s
gammaloop-workspace-doctest> |
743.06 s
gammaloop-workspace-doctest> 3712 | run_card_toml = api.get_run_history()
743.06 s
gammaloop-workspace-doctest> | ^^^ not found in this scope
743.06 s
gammaloop-workspace-doctest>
743.06 s
gammaloop-workspace-doctest> error : aborting due to 2 previous errors
743.06 s
gammaloop-workspace-doctest>
743.06 s
gammaloop-workspace-doctest> For more information about this error, try `rustc --explain E0425`.
743.06 s
gammaloop-workspace-doctest> Couldn't compile the test.
743.06 s
gammaloop-workspace-doctest> ---- crates/gammaloop-api/src/python.rs - python::GammaLoopAPI::new_python (line 2834) stdout ----
743.06 s
gammaloop-workspace-doctest> error[E0425] : cannot find value `api` in this scope
743.06 s
gammaloop-workspace-doctest> --> crates/gammaloop-api/src/python.rs:2835:1
743.06 s
gammaloop-workspace-doctest> |
743.06 s
gammaloop-workspace-doctest> 2835 | api = GammaLoopAPI(state_folder="./state", read_only_state=True)
743.06 s
gammaloop-workspace-doctest> | ^^^
743.06 s
gammaloop-workspace-doctest> |
743.06 s
gammaloop-workspace-doctest> help : you might have meant to introduce a new binding
743.06 s
gammaloop-workspace-doctest> |
743.06 s
gammaloop-workspace-doctest> 2835 | let api = GammaLoopAPI(state_folder="./state", read_only_state=True)
743.06 s
gammaloop-workspace-doctest> | +++
743.06 s
gammaloop-workspace-doctest>
743.06 s
gammaloop-workspace-doctest> error[E0425] : cannot find value `state_folder` in this scope
743.06 s
gammaloop-workspace-doctest> --> crates/gammaloop-api/src/python.rs:2835:20
743.06 s
gammaloop-workspace-doctest> |
743.06 s
gammaloop-workspace-doctest> 2835 | api = GammaLoopAPI(state_folder="./state", read_only_state=True)
743.06 s
gammaloop-workspace-doctest> | ^^^^^^^^^^^^ not found in this scope
743.06 s
gammaloop-workspace-doctest>
743.06 s
gammaloop-workspace-doctest> error[E0425] : cannot find value `read_only_state` in this scope
743.06 s
gammaloop-workspace-doctest> --> crates/gammaloop-api/src/python.rs:2835:44
743.06 s
gammaloop-workspace-doctest> |
743.06 s
gammaloop-workspace-doctest> 2835 | api = GammaLoopAPI(state_folder="./state", read_only_state=True)
743.06 s
gammaloop-workspace-doctest> | ^^^^^^^^^^^^^^^ not found in this scope
743.06 s
gammaloop-workspace-doctest>
743.06 s
gammaloop-workspace-doctest> error[E0425] : cannot find value `True` in this scope
743.06 s
gammaloop-workspace-doctest> --> crates/gammaloop-api/src/python.rs:2835:60
743.06 s
gammaloop-workspace-doctest> |
743.06 s
gammaloop-workspace-doctest> 2835 | api = GammaLoopAPI(state_folder="./state", read_only_state=True)
743.06 s
gammaloop-workspace-doctest> | ^^^^ not found in this scope
743.06 s
gammaloop-workspace-doctest> |
743.06 s
gammaloop-workspace-doctest> help : you may want to use a bool value instead
743.06 s
gammaloop-workspace-doctest> |
743.06 s
gammaloop-workspace-doctest> 2835 - api = GammaLoopAPI(state_folder="./state", read_only_state=True )
743.06 s
gammaloop-workspace-doctest> 2835 + api = GammaLoopAPI(state_folder="./state", read_only_state=true )
743.06 s
gammaloop-workspace-doctest> |
743.06 s
gammaloop-workspace-doctest>
743.06 s
gammaloop-workspace-doctest> error[E0425] : cannot find function, tuple struct or tuple variant `GammaLoopAPI` in this scope
743.06 s
gammaloop-workspace-doctest> --> crates/gammaloop-api/src/python.rs:2835:7
743.06 s
gammaloop-workspace-doctest> |
743.06 s
gammaloop-workspace-doctest> 2835 | api = GammaLoopAPI(state_folder="./state", read_only_state=True)
743.06 s
gammaloop-workspace-doctest> | ^^^^^^^^^^^^ not found in this scope
743.06 s
gammaloop-workspace-doctest>
743.06 s
gammaloop-workspace-doctest> error : aborting due to 5 previous errors
743.06 s
gammaloop-workspace-doctest>
743.06 s
gammaloop-workspace-doctest> For more information about this error, try `rustc --explain E0425`.
743.06 s
gammaloop-workspace-doctest> Couldn't compile the test.
743.06 s
gammaloop-workspace-doctest> ---- crates/gammaloop-api/src/python.rs - python::atom_to_canonical_string (line 128) stdout ----
743.06 s
gammaloop-workspace-doctest> error[E0425] : cannot find function `atom_to_canonical_string` in this scope
743.06 s
gammaloop-workspace-doctest> --> crates/gammaloop-api/src/python.rs:129:1
743.06 s
gammaloop-workspace-doctest> |
743.06 s
gammaloop-workspace-doctest> 129 | atom_to_canonical_string("x + x")
743.06 s
gammaloop-workspace-doctest> | ^^^^^^^^^^^^^^^^^^^^^^^^ not found in this scope
743.06 s
gammaloop-workspace-doctest>
743.06 s
gammaloop-workspace-doctest> error : aborting due to 1 previous error
743.06 s
gammaloop-workspace-doctest>
743.06 s
gammaloop-workspace-doctest> For more information about this error, try `rustc --explain E0425`.
743.06 s
gammaloop-workspace-doctest> Couldn't compile the test.
743.06 s
gammaloop-workspace-doctest>
743.06 s
gammaloop-workspace-doctest> failures:
743.06 s
gammaloop-workspace-doctest> crates/gammaloop-api/src/python.rs - python::GammaLoopAPI::evaluate_sample (line 2967)
743.06 s
gammaloop-workspace-doctest> crates/gammaloop-api/src/python.rs - python::GammaLoopAPI::evaluate_samples (line 3108)
743.06 s
gammaloop-workspace-doctest> crates/gammaloop-api/src/python.rs - python::GammaLoopAPI::get_active_command_blocks (line 3760)
743.06 s
gammaloop-workspace-doctest> crates/gammaloop-api/src/python.rs - python::GammaLoopAPI::get_default_runtime_settings (line 3796)
743.06 s
gammaloop-workspace-doctest> crates/gammaloop-api/src/python.rs - python::GammaLoopAPI::get_global_settings (line 3739)
743.06 s
gammaloop-workspace-doctest> crates/gammaloop-api/src/python.rs - python::GammaLoopAPI::get_integrand_info (line 3585)
743.06 s
gammaloop-workspace-doctest> crates/gammaloop-api/src/python.rs - python::GammaLoopAPI::get_integrand_settings (line 3647)
743.06 s
gammaloop-workspace-doctest> crates/gammaloop-api/src/python.rs - python::GammaLoopAPI::get_run_history (line 3711)
743.06 s
gammaloop-workspace-doctest> crates/gammaloop-api/src/python.rs - python::GammaLoopAPI::new_python (line 2834)
743.06 s
gammaloop-workspace-doctest> crates/gammaloop-api/src/python.rs - python::GammaLoopAPI::run_command (line 3901)
743.06 s
gammaloop-workspace-doctest> crates/gammaloop-api/src/python.rs - python::PyHistogramAccumulator (line 871)
743.06 s
gammaloop-workspace-doctest> crates/gammaloop-api/src/python.rs - python::atom_to_canonical_string (line 128)
743.06 s
gammaloop-workspace-doctest> crates/gammaloop-api/src/python.rs - python::atom_to_dots (line 157)
743.06 s
gammaloop-workspace-doctest> crates/gammaloop-api/src/python.rs - python::evaluate_graph_overall_factor (line 95)
743.06 s
gammaloop-workspace-doctest>
743.06 s
gammaloop-workspace-doctest> test result: FAILED. 2 passed; 14 failed; 0 ignored; 0 measured; 0 filtered out; finished in 4.27s
743.06 s
gammaloop-workspace-doctest>
743.06 s
gammaloop-workspace-doctest> error : doctest failed, to rerun pass `-p gammaloop-api --doc`
743.92 s
[0 built (1 failed ), 0.0 error: Cannot build '/nix/store/gfqf16jiri54v362qzgvkmdlmf27gab4-gammaloop-workspace-doctest-0.1.0.drv '.
743.92 s
Reason: builder failed with exit code 101 .
743.92 s
Output paths:
743.92 s
/nix/store/2ap3qnbflc67an3cixg5kwcmqkvrk4iw-gammaloop-workspace-doctest-0.1.0
743.92 s
Last 356 log lines:
743.92 s
> Running phase: unpackPhase
743.92 s
> unpacking source archive /nix/store/5afz06g4vsphrihpxicbxvm3sk5psnll-source
743.92 s
> source root is source
743.92 s
> Running phase: patchPhase
743.92 s
> Executing configureCargoCommonVars
743.92 s
> decompressing cargo artifacts from /nix/store/9q03j4h8yyxwgigikinn0j17963s9lwf-gammaloop-workspace-deps-deps-0.1.0/target.tar.zst to target
743.92 s
> Running phase: updateAutotoolsGnuConfigScriptsPhase
743.92 s
> Running phase: configurePhase
743.92 s
> will append /build/source/.cargo-home/config.toml with contents of /nix/store/4vj0f29myggx0gdynf7fwm2wfzgqnk61-vendor-cargo-deps/config.toml
743.92 s
> default configurePhase, nothing to do
743.92 s
> Running phase: buildPhase
743.92 s
> +++ command cargo --version
743.92 s
> cargo 1.97.0 (c980f4866 2026-06-30)
743.92 s
> +++ command cargo test --profile ci-optim --doc --locked --workspace --features gammaloop-api/cli,gammaloop-tracing-filter/clap,gammaloop-tracing-filter/symbolica,idenso/bincode,idenso/reference-cases,linnet/bincode,linnet/drawing,linnet/nodestore-vec,linnet/rkyv,linnet/serde,linnet/symbolica,spenso-macros/shadowing,spenso/shadowing,symbolica/tracing_max_level_info
743.92 s
> Compiling target-lexicon v0.13.5
743.92 s
> Compiling symbolica v2.2.0 (https://github.com/symbolica-dev/symbolica?branch=dev#0441bd7a)
743.92 s
> Compiling maplit v1.0.2
743.92 s
> Compiling gammaloop-tracing-filter-macros v0.1.0 (/build/source/crates/gammaloop-tracing-filter-macros)
743.92 s
> Compiling vakint v0.1.2 (/build/source/crates/vakint)
743.92 s
> Compiling gammalooprs v0.3.4 (/build/source/crates/gammalooprs)
743.92 s
> Compiling alphal00p-docs-macros v0.1.0 (/build/source/crates/alphal00p-docs-macros)
743.92 s
> Compiling alphal00p-docs-schema v0.1.0 (/build/source/crates/alphal00p-docs-schema)
743.92 s
> Compiling rustc_version v0.4.1
743.92 s
> Compiling bincode v1.3.3
743.92 s
> Compiling gungraun-runner v0.18.2
743.92 s
> Compiling target-triple v1.0.1
743.92 s
> Compiling iai-callgrind-runner v0.14.2
743.92 s
> Compiling gammaloop-integration-tests v0.1.0 (/build/source/tests)
743.92 s
> Compiling test-log-core v0.2.20
743.92 s
> Compiling wait-timeout v0.2.1
743.92 s
> Compiling bit-vec v0.8.0
743.92 s
> Compiling quick-error v1.2.3
743.92 s
> Compiling iai-callgrind v0.14.2
743.92 s
> Compiling bit-set v0.8.0
743.92 s
> Compiling rusty-fork v0.3.1
743.92 s
> Compiling iai-callgrind-macros v0.5.1
743.92 s
> Compiling gungraun-macros v0.8.0
743.92 s
> Compiling rand_xorshift v0.4.0
743.92 s
> Compiling console v0.15.11
743.92 s
> Compiling base64 v0.21.7
743.92 s
> Compiling glob v0.3.4
743.92 s
> Compiling unarray v0.1.4
743.92 s
> Compiling termcolor v1.4.1
743.92 s
> Compiling proptest v1.11.0
743.92 s
> Compiling alphal00p-docs-builder v0.1.0 (/build/source/crates/alphal00p-docs-builder)
743.92 s
> Compiling trybuild v1.0.120
743.92 s
> Compiling similar-asserts v1.7.0
743.92 s
> Compiling ron v0.8.1
743.92 s
> Compiling pyo3-build-config v0.28.3
743.92 s
> Compiling alphal00p-docs-catalogs v0.1.0 (/build/source/crates/alphal00p-docs-catalogs)
743.92 s
> Compiling kurvst v0.1.0 (/build/source/crates/kurvst)
743.92 s
> Compiling test-log-macros v0.2.20
743.92 s
> Compiling test-log v0.2.20
743.92 s
> Compiling alphal00p-docs-examples v0.1.0 (/build/source/crates/alphal00p-docs-examples)
743.92 s
> Compiling pyo3-macros-backend v0.28.3
743.92 s
> Compiling pyo3-ffi v0.28.3
743.92 s
> Compiling pyo3 v0.28.3
743.92 s
> Compiling numpy v0.28.0
743.92 s
> Compiling gammaloop-api v0.1.0 (/build/source/crates/gammaloop-api)
743.92 s
> Compiling gungraun v0.18.2
743.92 s
> Compiling pyo3-macros v0.28.3
743.92 s
> Compiling pyo3-stub-gen v0.17.2
743.92 s
> Compiling numerica v2.2.0 (https://github.com/symbolica-dev/symbolica?branch=dev#0441bd7a)
743.92 s
> Compiling graphica v2.1.0 (https://github.com/symbolica-dev/symbolica?branch=dev#0441bd7a)
743.92 s
> Compiling symbolica-utils v0.1.0 (/build/source/crates/symbolica-utils)
743.92 s
> Compiling gammaloop-workspace-hack v0.1.0 (/build/source/crates/gammaloop-workspace-hack)
743.92 s
> Compiling spenso-macros v0.3.2 (/build/source/crates/spenso-macros)
743.92 s
> Compiling linnet v0.17.0 (/build/source/crates/linnet)
743.92 s
> Compiling spenso v0.6.0 (/build/source/crates/spenso)
743.92 s
> Compiling idenso v0.3.0 (/build/source/crates/idenso)
743.92 s
> Compiling gammaloop-tracing-filter v0.1.0 (/build/source/crates/gammaloop-tracing-filter)
743.92 s
> Compiling spenso-hep-lib v0.1.7 (/build/source/crates/spenso-hep-lib)
743.92 s
> Compiling spynso3 v0.1.2 (/build/source/crates/spynso3)
743.92 s
> Compiling linnest v0.1.0 (/build/source/crates/linnest)
743.92 s
> Compiling linnet-py v0.1.0 (/build/source/crates/linnet-py)
743.92 s
> Finished `ci-optim` profile [optimized] target(s) in 11m 34s
743.92 s
> warning : the following packages contain code that will be rejected by a future version of Rust: proc-macro-error2 v2.0.1
743.92 s
> note : to see what the problems were, use the option `--future-incompat-report`, or run `cargo report future-incompatibilities --id 1`
743.92 s
> Doc-tests alphal00p_docs_builder
743.92 s
>
743.92 s
> running 0 tests
743.92 s
>
743.92 s
> test result: ok. 0 passed; 0 failed; 0 ignored; 0 measured; 0 filtered out; finished in 0.00s
743.92 s
>
743.92 s
> Doc-tests alphal00p_docs_catalogs
743.92 s
>
743.92 s
> running 0 tests
743.92 s
>
743.92 s
> test result: ok. 0 passed; 0 failed; 0 ignored; 0 measured; 0 filtered out; finished in 0.00s
743.92 s
>
743.92 s
> Doc-tests alphal00p_docs_examples
743.92 s
>
743.92 s
> running 0 tests
743.92 s
>
743.92 s
> test result: ok. 0 passed; 0 failed; 0 ignored; 0 measured; 0 filtered out; finished in 0.00s
743.92 s
>
743.92 s
> Doc-tests alphal00p_docs
743.92 s
>
743.92 s
> running 0 tests
743.92 s
>
743.92 s
> test result: ok. 0 passed; 0 failed; 0 ignored; 0 measured; 0 filtered out; finished in 0.00s
743.92 s
>
743.92 s
> Doc-tests alphal00p_docs_schema
743.92 s
>
743.92 s
> running 0 tests
743.92 s
>
743.92 s
> test result: ok. 0 passed; 0 failed; 0 ignored; 0 measured; 0 filtered out; finished in 0.00s
743.92 s
>
743.92 s
> Doc-tests gammaloop_api
743.92 s
>
743.92 s
> running 16 tests
743.92 s
> test crates/gammaloop-api/src/python.rs - python::GammaLoopAPI::get_integrand_settings (line 3647) ... FAILED
743.92 s
> test crates/gammaloop-api/src/python.rs - python::GammaLoopAPI::get_active_command_blocks (line 3760) ... FAILED
743.92 s
> test crates/gammaloop-api/src/python.rs - python::GammaLoopAPI::evaluate_samples (line 3108) ... FAILED
743.92 s
> test crates/gammaloop-api/src/python.rs - python::GammaLoopAPI::evaluate_sample (line 2967) ... FAILED
743.92 s
> test crates/gammaloop-api/src/python.rs - python::PyHistogramAccumulator (line 871) ... FAILED
743.93 s
> test crates/gammaloop-api/src/python.rs - python::GammaLoopAPI::get_default_runtime_settings (line 3796) ... FAILED
743.93 s
> test crates/gammaloop-api/src/python.rs - python::GammaLoopAPI::get_integrand_info (line 3585) ... FAILED
743.93 s
> test crates/gammaloop-api/src/lib.rs - (line 18) - compile ... ok
743.93 s
> test crates/gammaloop-api/src/python.rs - python::atom_to_dots (line 157) ... FAILED
743.93 s
> test crates/gammaloop-api/src/python.rs - python::GammaLoopAPI::get_global_settings (line 3739) ... FAILED
743.93 s
> test crates/gammaloop-api/src/python.rs - python::evaluate_graph_overall_factor (line 95) ... FAILED
743.93 s
> test crates/gammaloop-api/src/python.rs - python::GammaLoopAPI::run_command (line 3901) ... FAILED
743.93 s
> test crates/gammaloop-api/src/python.rs - python::GammaLoopAPI::get_run_history (line 3711) ... FAILED
743.93 s
> test crates/gammaloop-api/src/python.rs - python::GammaLoopAPI::new_python (line 2834) ... FAILED
743.93 s
> test crates/gammaloop-api/src/python.rs - python::atom_to_canonical_string (line 128) ... FAILED
743.93 s
> test crates/gammaloop-api/src/commands/evaluate_samples.rs - commands::evaluate_samples::EvaluateSamples (line 50) ... ok
743.93 s
>
743.93 s
> failures:
743.93 s
>
743.93 s
> ---- crates/gammaloop-api/src/python.rs - python::GammaLoopAPI::get_integrand_settings (line 3647) stdout ----
743.93 s
> error: expected one of `!` or `::`, found `=`
743.93 s
> --> crates/gammaloop-api/src/python.rs:3648:10
743.93 s
> |
743.93 s
> 3648 | settings = api.get_integrand_settings(process_id=0)
743.93 s
> | ^ expected one of `!` or `::`
743.93 s
>
743.93 s
> error: aborting due to 1 previous error
743.93 s
>
743.93 s
> Couldn't compile the test.
743.93 s
> ---- crates/gammaloop-api/src/python.rs - python::GammaLoopAPI::get_active_command_blocks (line 3760) stdout ----
743.93 s
> error: expected item, found keyword `for`
743.93 s
> --> crates/gammaloop-api/src/python.rs:3761:1
743.93 s
> |
743.93 s
> 3761 | for name, commands in api.get_active_command_blocks().items():
743.93 s
> | ^^^ expected item
743.93 s
> |
743.93 s
> = note: for a full list of items that can appear in modules, see <https://doc.rust-lang.org/reference/items.html>
743.93 s
>
743.93 s
> error: aborting due to 1 previous error
743.93 s
>
743.93 s
> Couldn't compile the test.
743.93 s
> ---- crates/gammaloop-api/src/python.rs - python::GammaLoopAPI::evaluate_samples (line 3108) stdout ----
743.93 s
> error: expected one of `!` or `::`, found `pathlib`
743.93 s
> --> crates/gammaloop-api/src/python.rs:3109:6
743.93 s
> |
743.93 s
> 3109 | from pathlib import Path
743.93 s
> | ^^^^^^^ expected one of `!` or `::`
743.93 s
>
743.93 s
> error: aborting due to 1 previous error
743.93 s
>
743.93 s
> Couldn't compile the test.
743.93 s
> ---- crates/gammaloop-api/src/python.rs - python::GammaLoopAPI::evaluate_sample (line 2967) stdout ----
743.93 s
> error: expected one of `!` or `::`, found `pathlib`
743.93 s
> --> crates/gammaloop-api/src/python.rs:2968:6
743.93 s
> |
743.93 s
> 2968 | from pathlib import Path
743.93 s
> | ^^^^^^^ expected one of `!` or `::`
743.93 s
>
743.93 s
> error: aborting due to 1 previous error
743.93 s
>
743.93 s
> Couldn't compile the test.
743.93 s
> ---- crates/gammaloop-api/src/python.rs - python::PyHistogramAccumulator (line 871) stdout ----
743.93 s
> error: expected one of `!` or `::`, found `gammaloop`
743.93 s
> --> crates/gammaloop-api/src/python.rs:872:6
743.93 s
> |
743.93 s
> 872 | from gammaloop import HistogramAccumulator
743.93 s
> | ^^^^^^^^^ expected one of `!` or `::`
743.93 s
>
743.93 s
> error: aborting due to 1 previous error
743.93 s
>
743.93 s
> Couldn't compile the test.
743.93 s
> ---- crates/gammaloop-api/src/python.rs - python::GammaLoopAPI::get_default_runtime_settings (line 3796) stdout ----
743.93 s
> error: expected one of `!` or `::`, found `=`
743.93 s
> --> crates/gammaloop-api/src/python.rs:3797:9
743.93 s
> |
743.93 s
> 3797 | runtime = api.get_default_runtime_settings()
743.93 s
> | ^ expected one of `!` or `::`
743.93 s
>
743.93 s
> error: aborting due to 1 previous error
743.93 s
>
743.93 s
> Couldn't compile the test.
743.93 s
> ---- crates/gammaloop-api/src/python.rs - python::GammaLoopAPI::get_integrand_info (line 3585) stdout ----
743.93 s
> error: expected one of `!` or `::`, found `pathlib`
743.93 s
> --> crates/gammaloop-api/src/python.rs:3586:6
743.93 s
> |
743.93 s
> 3586 | from pathlib import Path
743.93 s
> | ^^^^^^^ expected one of `!` or `::`
743.93 s
>
743.93 s
> error: aborting due to 1 previous error
743.93 s
>
743.93 s
> Couldn't compile the test.
743.93 s
> ---- crates/gammaloop-api/src/python.rs - python::atom_to_dots (line 157) stdout ----
743.93 s
> error[E0425] : cannot find function `to_dots` in this scope
743.93 s
> --> crates/gammaloop-api/src/python.rs:158:1
743.93 s
> |
743.93 s
> 158 | to_dots("p(mu) * q(mu)")
743.93 s
> | ^^^^^^^ not found in this scope
743.93 s
>
743.93 s
> error : aborting due to 1 previous error
743.93 s
>
743.93 s
> For more information about this error, try `rustc --explain E0425`.
743.93 s
> Couldn't compile the test.
743.93 s
> ---- crates/gammaloop-api/src/python.rs - python::GammaLoopAPI::get_global_settings (line 3739) stdout ----
743.93 s
> error[E0425] : cannot find value `settings_toml` in this scope
743.93 s
> --> crates/gammaloop-api/src/python.rs:3740:1
743.93 s
> |
743.93 s
> 3740 | settings_toml = api.get_global_settings()
743.93 s
> | ^^^^^^^^^^^^^
743.93 s
> |
743.93 s
> help : you might have meant to introduce a new binding
743.93 s
> |
743.93 s
> 3740 | let settings_toml = api.get_global_settings()
743.93 s
> | +++
743.93 s
>
743.93 s
> error[E0425] : cannot find value `api` in this scope
743.93 s
> --> crates/gammaloop-api/src/python.rs:3740:17
743.93 s
> |
743.93 s
> 3740 | settings_toml = api.get_global_settings()
743.93 s
> | ^^^ not found in this scope
743.93 s
>
743.93 s
> error : aborting due to 2 previous errors
743.93 s
>
743.93 s
> For more information about this error, try `rustc --explain E0425`.
743.93 s
> Couldn't compile the test.
743.93 s
> ---- crates/gammaloop-api/src/python.rs - python::evaluate_graph_overall_factor (line 95) stdout ----
743.93 s
> error[E0425] : cannot find function `evaluate_graph_overall_factor` in this scope
743.93 s
> --> crates/gammaloop-api/src/python.rs:96:1
743.93 s
> |
743.93 s
> 96 | evaluate_graph_overall_factor(
743.93 s
> | ^^^^^^^^^^^^^^^^^^^^^^^^^^^^^ not found in this scope
743.93 s
>
743.93 s
> error : aborting due to 1 previous error
743.93 s
>
743.93 s
> For more information about this error, try `rustc --explain E0425`.
743.93 s
> Couldn't compile the test.
743.93 s
> ---- crates/gammaloop-api/src/python.rs - python::GammaLoopAPI::run_command (line 3901) stdout ----
743.93 s
> error[E0425] : cannot find value `api` in this scope
743.93 s
> --> crates/gammaloop-api/src/python.rs:3902:1
743.93 s
> |
743.93 s
> 3902 | api.run("display processes")
743.93 s
> | ^^^ not found in this scope
743.93 s
>
743.93 s
> error : aborting due to 1 previous error
743.93 s
>
743.93 s
> For more information about this error, try `rustc --explain E0425`.
743.93 s
> Couldn't compile the test.
743.93 s
> ---- crates/gammaloop-api/src/python.rs - python::GammaLoopAPI::get_run_history (line 3711) stdout ----
743.93 s
> error[E0425] : cannot find value `run_card_toml` in this scope
743.93 s
> --> crates/gammaloop-api/src/python.rs:3712:1
743.93 s
> |
743.93 s
> 3712 | run_card_toml = api.get_run_history()
743.93 s
> | ^^^^^^^^^^^^^
743.93 s
> |
743.93 s
> help : you might have meant to introduce a new binding
743.93 s
> |
743.93 s
> 3712 | let run_card_toml = api.get_run_history()
743.93 s
> | +++
743.93 s
>
743.93 s
> error[E0425] : cannot find value `api` in this scope
743.93 s
> --> crates/gammaloop-api/src/python.rs:3712:17
743.93 s
> |
743.93 s
> 3712 | run_card_toml = api.get_run_history()
743.93 s
> | ^^^ not found in this scope
743.93 s
>
743.93 s
> error : aborting due to 2 previous errors
743.93 s
>
743.93 s
> For more information about this error, try `rustc --explain E0425`.
743.93 s
> Couldn't compile the test.
743.93 s
> ---- crates/gammaloop-api/src/python.rs - python::GammaLoopAPI::new_python (line 2834) stdout ----
743.93 s
> error[E0425] : cannot find value `api` in this scope
743.93 s
> --> crates/gammaloop-api/src/python.rs:2835:1
743.93 s
> |
743.93 s
> 2835 | api = GammaLoopAPI(state_folder="./state", read_only_state=True)
743.93 s
> | ^^^
743.93 s
> |
743.93 s
> help : you might have meant to introduce a new binding
743.93 s
> |
743.93 s
> 2835 | let api = GammaLoopAPI(state_folder="./state", read_only_state=True)
743.93 s
> | +++
743.93 s
>
743.93 s
> error[E0425] : cannot find value `state_folder` in this scope
743.93 s
> --> crates/gammaloop-api/src/python.rs:2835:20
743.93 s
> |
743.93 s
> 2835 | api = GammaLoopAPI(state_folder="./state", read_only_state=True)
743.93 s
> | ^^^^^^^^^^^^ not found in this scope
743.93 s
>
743.93 s
> error[E0425] : cannot find value `read_only_state` in this scope
743.93 s
> --> crates/gammaloop-api/src/python.rs:2835:44
743.93 s
> |
743.93 s
> 2835 | api = GammaLoopAPI(state_folder="./state", read_only_state=True)
743.93 s
> | ^^^^^^^^^^^^^^^ not found in this scope
743.93 s
>
743.93 s
> error[E0425] : cannot find value `True` in this scope
743.93 s
> --> crates/gammaloop-api/src/python.rs:2835:60
743.93 s
> |
743.93 s
> 2835 | api = GammaLoopAPI(state_folder="./state", read_only_state=True)
743.93 s
> | ^^^^ not found in this scope
743.93 s
> |
743.93 s
> help : you may want to use a bool value instead
743.93 s
> |
743.93 s
> 2835 - api = GammaLoopAPI(state_folder="./state", read_only_state=True )
743.93 s
> 2835 + api = GammaLoopAPI(state_folder="./state", read_only_state=true )
743.93 s
> |
743.93 s
>
743.93 s
> error[E0425] : cannot find function, tuple struct or tuple variant `GammaLoopAPI` in this scope
743.93 s
> --> crates/gammaloop-api/src/python.rs:2835:7
743.93 s
> |
743.93 s
> 2835 | api = GammaLoopAPI(state_folder="./state", read_only_state=True)
743.93 s
> | ^^^^^^^^^^^^ not found in this scope
743.93 s
>
743.93 s
> error : aborting due to 5 previous errors
743.93 s
>
743.93 s
> For more information about this error, try `rustc --explain E0425`.
743.93 s
> Couldn't compile the test.
743.93 s
> ---- crates/gammaloop-api/src/python.rs - python::atom_to_canonical_string (line 128) stdout ----
743.93 s
> error[E0425] : cannot find function `atom_to_canonical_string` in this scope
743.93 s
> --> crates/gammaloop-api/src/python.rs:129:1
743.93 s
> |
743.93 s
> 129 | atom_to_canonical_string("x + x")
743.93 s
> | ^^^^^^^^^^^^^^^^^^^^^^^^ not found in this scope
743.93 s
>
743.93 s
> error : aborting due to 1 previous error
743.93 s
>
743.93 s
> For more information about this error, try `rustc --explain E0425`.
743.93 s
> Couldn't compile the test.
743.93 s
>
743.93 s
> failures:
743.93 s
> crates/gammaloop-api/src/python.rs - python::GammaLoopAPI::evaluate_sample (line 2967)
743.93 s
> crates/gammaloop-api/src/python.rs - python::GammaLoopAPI::evaluate_samples (line 3108)
743.93 s
> crates/gammaloop-api/src/python.rs - python::GammaLoopAPI::get_active_command_blocks (line 3760)
743.93 s
> crates/gammaloop-api/src/python.rs - python::GammaLoopAPI::get_default_runtime_settings (line 3796)
743.93 s
> crates/gammaloop-api/src/python.rs - python::GammaLoopAPI::get_global_settings (line 3739)
743.93 s
> crates/gammaloop-api/src/python.rs - python::GammaLoopAPI::get_integrand_info (line 3585)
743.93 s
> crates/gammaloop-api/src/python.rs - python::GammaLoopAPI::get_integrand_settings (line 3647)
743.93 s
> crates/gammaloop-api/src/python.rs - python::GammaLoopAPI::get_run_history (line 3711)
743.93 s
> crates/gammaloop-api/src/python.rs - python::GammaLoopAPI::new_python (line 2834)
743.93 s
> crates/gammaloop-api/src/python.rs - python::GammaLoopAPI::run_command (line 3901)
743.93 s
> crates/gammaloop-api/src/python.rs - python::PyHistogramAccumulator (line 871)
743.93 s
> crates/gammaloop-api/src/python.rs - python::atom_to_canonical_string (line 128)
743.93 s
> crates/gammaloop-api/src/python.rs - python::atom_to_dots (line 157)
743.93 s
> crates/gammaloop-api/src/python.rs - python::evaluate_graph_overall_factor (line 95)
743.93 s
>
743.93 s
> test result: FAILED. 2 passed; 14 failed; 0 ignored; 0 measured; 0 filtered out; finished in 4.27s
743.93 s
>
743.93 s
> error : doctest failed, to rerun pass `-p gammaloop-api --doc`
743.93 s
For full logs, run:
743.93 s
nix log /nix/store/gfqf16jiri54v362qzgvkmdlmf27gab4-gammaloop-workspace-doctest-0.1.0.drv
744.12 s
Run failed.