1. 0.18 s $ /nix/store/9ypz3flqsrl5xl495mm8h645gadjsxi1-coreutils-9.11/bin/timeout --kill-after=15s 7200s /nix/store/23zk8sgzamrbmj1fday15szf7f2279s8-nix-2.34.7/bin/nix --extra-experimental-features nix-command --extra-experimental-features flakes flake clone git+https://github.com/alphal00p/gammaloop --dest /tmp/nix-ci-worker/stable-pwd/repo/
  2. 0.23 s Cloning into '/tmp/nix-ci-worker/stable-pwd/repo'...
  3. 0.96 s remote: Enumerating objects: 63730, done.
  4. 1.07 s remote: Counting objects: 0% (1/9084) remote: Counting objects: 1% (91/9084) remote: Counting objects: 2% (182/9084) remote: Counting objects: 3% (273/9084) remote: Counting objects: 4% (364/9084) remote: Counting objects: 5% (455/9084) remote: Counting objects: 6% (546/9084) remote: Counting objects: 7% (636/9084) remote: Counting objects: 8% (727/9084) remote: Counting objects: 9% (818/9084) remote: Counting objects: 10% (909/9084) remote: Counting objects: 11% (1000/9084) remote: Counting objects: 12% (1091/9084) remote: Counting objects: 13% (1181/9084) remote: Counting objects: 14% (1272/9084) remote: Counting objects: 15% (1363/9084) remote: Counting objects: 16% (1454/9084) remote: Counting objects: 17% (1545/9084) remote: Counting objects: 18% (1636/9084) remote: Counting objects: 19% (1726/9084) remote: Counting objects: 20% (1817/9084) remote: Counting objects: 21% (1908/9084) remote: Counting objects: 22% (1999/9084) remote: Counting objects: 23% (2090/9084) remote: Counting objects: 24% (2181/9084) remote: Counting objects: 25% (2271/9084) remote: Counting objects: 26% (2362/9084) remote: Counting objects: 27% (2453/9084) remote: Counting objects: 28% (2544/9084) remote: Counting objects: 29% (2635/9084) remote: Counting objects: 30% (2726/9084) remote: Counting objects: 31% (2817/9084) remote: Counting objects: 32% (2907/9084) remote: Counting objects: 33% (2998/9084) remote: Counting objects: 34% (3089/9084) remote: Counting objects: 35% (3180/9084) remote: Counting objects: 36% (3271/9084) remote: Counting objects: 37% (3362/9084) remote: Counting objects: 38% (3452/9084) remote: Counting objects: 39% (3543/9084) remote: Counting objects: 40% (3634/9084) remote: Counting objects: 41% (3725/9084) remote: Counting objects: 42% (3816/9084) remote: Counting objects: 43% (3907/9084) remote: Counting objects: 44% (3997/9084) remote: Counting objects: 45% (4088/9084) remote: Counting objects: 46% (4179/9084) remote: Counting objects: 47% (4270/9084) remote: Counting objects: 48% (4361/9084) remote: Counting objects: 49% (4452/9084) remote: Counting objects: 50% (4542/9084) remote: Counting objects: 51% (4633/9084) remote: Counting objects: 52% (4724/9084) remote: Counting objects: 53% (4815/9084) remote: Counting objects: 54% (4906/9084) remote: Counting objects: 55% (4997/9084) remote: Counting objects: 56% (5088/9084) remote: Counting objects: 57% (5178/9084) remote: Counting objects: 58% (5269/9084) remote: Counting objects: 59% (5360/9084) remote: Counting objects: 60% (5451/9084) remote: Counting objects: 61% (5542/9084) remote: Counting objects: 62% (5633/9084) remote: Counting objects: 63% (5723/9084) remote: Counting objects: 64% (5814/9084) remote: Counting objects: 65% (5905/9084) remote: Counting objects: 66% (5996/9084) remote: Counting objects: 67% (6087/9084) remote: Counting objects: 68% (6178/9084) remote: Counting objects: 69% (6268/9084) remote: Counting objects: 70% (6359/9084) remote: Counting objects: 71% (6450/9084) remote: Counting objects: 72% (6541/9084) remote: Counting objects: 73% (6632/9084) remote: Counting objects: 74% (6723/9084) remote: Counting objects: 75% (6813/9084) remote: Counting objects: 76% (6904/9084) remote: Counting objects: 77% (6995/9084) remote: Counting objects: 78% (7086/9084) remote: Counting objects: 79% (7177/9084) remote: Counting objects: 80% (7268/9084) remote: Counting objects: 81% (7359/9084) remote: Counting objects: 82% (7449/9084) remote: Counting objects: 83% (7540/9084) remote: Counting objects: 84% (7631/9084) remote: Counting objects: 85% (7722/9084) remote: Counting objects: 86% (7813/9084) remote: Counting objects: 87% (7904/9084) remote: Counting objects: 88% (7994/9084) remote: Counting objects: 89% (8085/9084) remote: Counting objects: 90% (8176/9084) remote: Counting objects: 91% (8267/9084) remote: Counting objects: 92% (8358/9084) remote: Counting objects: 93% (8449/9084) remote: Counting objects: 94% (8539/9084) remote: Counting objects: 95% (8630/9084) remote: Counting objects: 96% (8721/9084) remote: Counting objects: 97% (8812/9084) remote: Counting objects: 98% (8903/9084) remote: Counting objects: 99% (8994/9084) remote: Counting objects: 100% (9084/9084) remote: Counting objects: 100% (9084/9084), done.
  5. 3.60 s remote: Compressing objects: 0% (1/2049) remote: Compressing objects: 1% (21/2049) remote: Compressing objects: 2% (41/2049) remote: Compressing objects: 3% (62/2049) remote: Compressing objects: 4% (82/2049) remote: Compressing objects: 5% (103/2049) remote: Compressing objects: 6% (123/2049) remote: Compressing objects: 7% (144/2049) remote: Compressing objects: 8% (164/2049) remote: Compressing objects: 9% (185/2049) remote: Compressing objects: 10% (205/2049) remote: Compressing objects: 11% (226/2049) remote: Compressing objects: 12% (246/2049) remote: Compressing objects: 13% (267/2049) remote: Compressing objects: 14% (287/2049) remote: Compressing objects: 15% (308/2049) remote: Compressing objects: 16% (328/2049) remote: Compressing objects: 17% (349/2049) remote: Compressing objects: 18% (369/2049) remote: Compressing objects: 19% (390/2049) remote: Compressing objects: 19% (409/2049) remote: Compressing objects: 20% (410/2049) remote: Compressing objects: 21% (431/2049) remote: Compressing objects: 22% (451/2049) remote: Compressing objects: 23% (472/2049) remote: Compressing objects: 24% (492/2049) remote: Compressing objects: 25% (513/2049) remote: Compressing objects: 26% (533/2049) remote: Compressing objects: 26% (553/2049) remote: Compressing objects: 27% (554/2049) remote: Compressing objects: 28% (574/2049) remote: Compressing objects: 29% (595/2049) remote: Compressing objects: 30% (615/2049) remote: Compressing objects: 31% (636/2049) remote: Compressing objects: 32% (656/2049) remote: Compressing objects: 33% (677/2049) remote: Compressing objects: 34% (697/2049) remote: Compressing objects: 35% (718/2049) remote: Compressing objects: 36% (738/2049) remote: Compressing objects: 37% (759/2049) remote: Compressing objects: 38% (779/2049) remote: Compressing objects: 39% (800/2049) remote: Compressing objects: 40% (820/2049) remote: Compressing objects: 41% (841/2049) remote: Compressing objects: 42% (861/2049) remote: Compressing objects: 43% (882/2049) remote: Compressing objects: 44% (902/2049) remote: Compressing objects: 45% (923/2049) remote: Compressing objects: 46% (943/2049) remote: Compressing objects: 47% (964/2049) remote: Compressing objects: 48% (984/2049) remote: Compressing objects: 49% (1005/2049) remote: Compressing objects: 50% (1025/2049) remote: Compressing objects: 51% (1045/2049) remote: Compressing objects: 52% (1066/2049) remote: Compressing objects: 53% (1086/2049) remote: Compressing objects: 54% (1107/2049) remote: Compressing objects: 55% (1127/2049) remote: Compressing objects: 56% (1148/2049) remote: Compressing objects: 57% (1168/2049) remote: Compressing objects: 58% (1189/2049) remote: Compressing objects: 59% (1209/2049) remote: Compressing objects: 60% (1230/2049) remote: Compressing objects: 61% (1250/2049) remote: Compressing objects: 62% (1271/2049) remote: Compressing objects: 63% (1291/2049) remote: Compressing objects: 64% (1312/2049) remote: Compressing objects: 65% (1332/2049) remote: Compressing objects: 66% (1353/2049) remote: Compressing objects: 67% (1373/2049) remote: Compressing objects: 68% (1394/2049) remote: Compressing objects: 69% (1414/2049) remote: Compressing objects: 70% (1435/2049) remote: Compressing objects: 71% (1455/2049) remote: Compressing objects: 72% (1476/2049) remote: Compressing objects: 73% (1496/2049) remote: Compressing objects: 74% (1517/2049) remote: Compressing objects: 75% (1537/2049) remote: Compressing objects: 76% (1558/2049) remote: Compressing objects: 77% (1578/2049) remote: Compressing objects: 78% (1599/2049) remote: Compressing objects: 79% (1619/2049) remote: Compressing objects: 80% (1640/2049) remote: Compressing objects: 81% (1660/2049) remote: Compressing objects: 82% (1681/2049) remote: Compressing objects: 83% (1701/2049) remote: Compressing objects: 84% (1722/2049) remote: Compressing objects: 85% (1742/2049) remote: Compressing objects: 86% (1763/2049) remote: Compressing objects: 87% (1783/2049) remote: Compressing objects: 88% (1804/2049) remote: Compressing objects: 89% (1824/2049) remote: Compressing objects: 90% (1845/2049) remote: Compressing objects: 91% (1865/2049) remote: Compressing objects: 92% (1886/2049) remote: Compressing objects: 93% (1906/2049) remote: Compressing objects: 94% (1927/2049) remote: Compressing objects: 95% (1947/2049) remote: Compressing objects: 96% (1968/2049) remote: Compressing objects: 97% (1988/2049) remote: Compressing objects: 98% (2009/2049) remote: Compressing objects: 99% (2029/2049) remote: Compressing objects: 100% (2049/2049) remote: Compressing objects: 100% (2049/2049), done.
  6. 6.68 s Receiving objects: 0% (1/63730) Receiving objects: 1% (638/63730) Receiving objects: 2% (1275/63730) Receiving objects: 3% (1912/63730) Receiving objects: 4% (2550/63730) Receiving objects: 5% (3187/63730) Receiving objects: 6% (3824/63730) Receiving objects: 7% (4462/63730) Receiving objects: 8% (5099/63730) Receiving objects: 9% (5736/63730) Receiving objects: 10% (6373/63730), 12.19 MiB | 24.37 MiB/s Receiving objects: 11% (7011/63730), 12.19 MiB | 24.37 MiB/s Receiving objects: 12% (7648/63730), 12.19 MiB | 24.37 MiB/s Receiving objects: 13% (8285/63730), 12.19 MiB | 24.37 MiB/s Receiving objects: 14% (8923/63730), 12.19 MiB | 24.37 MiB/s Receiving objects: 15% (9560/63730), 12.19 MiB | 24.37 MiB/s Receiving objects: 16% (10197/63730), 12.19 MiB | 24.37 MiB/s Receiving objects: 17% (10835/63730), 12.19 MiB | 24.37 MiB/s Receiving objects: 18% (11472/63730), 12.19 MiB | 24.37 MiB/s Receiving objects: 19% (12109/63730), 12.19 MiB | 24.37 MiB/s Receiving objects: 20% (12746/63730), 12.19 MiB | 24.37 MiB/s Receiving objects: 21% (13384/63730), 12.19 MiB | 24.37 MiB/s Receiving objects: 22% (14021/63730), 12.19 MiB | 24.37 MiB/s Receiving objects: 23% (14658/63730), 12.19 MiB | 24.37 MiB/s Receiving objects: 24% (15296/63730), 12.19 MiB | 24.37 MiB/s Receiving objects: 25% (15933/63730), 12.19 MiB | 24.37 MiB/s Receiving objects: 26% (16570/63730), 12.19 MiB | 24.37 MiB/s Receiving objects: 27% (17208/63730), 12.19 MiB | 24.37 MiB/s Receiving objects: 28% (17845/63730), 12.19 MiB | 24.37 MiB/s Receiving objects: 29% (18482/63730), 12.19 MiB | 24.37 MiB/s Receiving objects: 30% (19119/63730), 12.19 MiB | 24.37 MiB/s Receiving objects: 31% (19757/63730), 12.19 MiB | 24.37 MiB/s Receiving objects: 32% (20394/63730), 12.19 MiB | 24.37 MiB/s Receiving objects: 33% (21031/63730), 12.19 MiB | 24.37 MiB/s Receiving objects: 34% (21669/63730), 12.19 MiB | 24.37 MiB/s Receiving objects: 35% (22306/63730), 12.19 MiB | 24.37 MiB/s Receiving objects: 36% (22943/63730), 12.19 MiB | 24.37 MiB/s Receiving objects: 37% (23581/63730), 12.19 MiB | 24.37 MiB/s Receiving objects: 38% (24218/63730), 12.19 MiB | 24.37 MiB/s Receiving objects: 39% (24855/63730), 12.19 MiB | 24.37 MiB/s Receiving objects: 40% (25492/63730), 12.19 MiB | 24.37 MiB/s Receiving objects: 41% (26130/63730), 12.19 MiB | 24.37 MiB/s Receiving objects: 42% (26767/63730), 12.19 MiB | 24.37 MiB/s Receiving objects: 43% (27404/63730), 12.19 MiB | 24.37 MiB/s Receiving objects: 44% (28042/63730), 12.19 MiB | 24.37 MiB/s Receiving objects: 45% (28679/63730), 12.19 MiB | 24.37 MiB/s Receiving objects: 46% (29316/63730), 12.19 MiB | 24.37 MiB/s Receiving objects: 47% (29954/63730), 12.19 MiB | 24.37 MiB/s Receiving objects: 48% (30591/63730), 12.19 MiB | 24.37 MiB/s Receiving objects: 49% (31228/63730), 12.19 MiB | 24.37 MiB/s Receiving objects: 50% (31865/63730), 12.19 MiB | 24.37 MiB/s Receiving objects: 51% (32503/63730), 12.19 MiB | 24.37 MiB/s Receiving objects: 51% (32817/63730), 29.17 MiB | 28.96 MiB/s Receiving objects: 52% (33140/63730), 29.17 MiB | 28.96 MiB/s Receiving objects: 53% (33777/63730), 29.17 MiB | 28.96 MiB/s Receiving objects: 54% (34415/63730), 29.17 MiB | 28.96 MiB/s Receiving objects: 55% (35052/63730), 29.17 MiB | 28.96 MiB/s Receiving objects: 56% (35689/63730), 29.17 MiB | 28.96 MiB/s Receiving objects: 57% (36327/63730), 29.17 MiB | 28.96 MiB/s Receiving objects: 58% (36964/63730), 29.17 MiB | 28.96 MiB/s Receiving objects: 59% (37601/63730), 45.50 MiB | 30.19 MiB/s Receiving objects: 60% (38238/63730), 45.50 MiB | 30.19 MiB/s Receiving objects: 61% (38876/63730), 45.50 MiB | 30.19 MiB/s Receiving objects: 62% (39513/63730), 45.50 MiB | 30.19 MiB/s Receiving objects: 63% (40150/63730), 45.50 MiB | 30.19 MiB/s Receiving objects: 64% (40788/63730), 45.50 MiB | 30.19 MiB/s Receiving objects: 65% (41425/63730), 45.50 MiB | 30.19 MiB/s Receiving objects: 66% (42062/63730), 45.50 MiB | 30.19 MiB/s Receiving objects: 67% (42700/63730), 45.50 MiB | 30.19 MiB/s Receiving objects: 67% (43277/63730), 61.29 MiB | 30.18 MiB/s Receiving objects: 68% (43337/63730), 61.29 MiB | 30.18 MiB/s Receiving objects: 69% (43974/63730), 61.29 MiB | 30.18 MiB/s Receiving objects: 70% (44611/63730), 61.29 MiB | 30.18 MiB/s Receiving objects: 71% (45249/63730), 61.29 MiB | 30.18 MiB/s Receiving objects: 72% (45886/63730), 61.29 MiB | 30.18 MiB/s Receiving objects: 73% (46523/63730), 61.29 MiB | 30.18 MiB/s Receiving objects: 74% (47161/63730), 61.29 MiB | 30.18 MiB/s Receiving objects: 75% (47798/63730), 61.29 MiB | 30.18 MiB/s Receiving objects: 76% (48435/63730), 61.29 MiB | 30.18 MiB/s Receiving objects: 77% (49073/63730), 61.29 MiB | 30.18 MiB/s Receiving objects: 78% (49710/63730), 61.29 MiB | 30.18 MiB/s Receiving objects: 79% (50347/63730), 61.29 MiB | 30.18 MiB/s Receiving objects: 80% (50984/63730), 61.29 MiB | 30.18 MiB/s Receiving objects: 81% (51622/63730), 61.29 MiB | 30.18 MiB/s Receiving objects: 82% (52259/63730), 61.29 MiB | 30.18 MiB/s Receiving objects: 83% (52896/63730), 61.29 MiB | 30.18 MiB/s Receiving objects: 84% (53534/63730), 79.34 MiB | 31.18 MiB/s Receiving objects: 85% (54171/63730), 79.34 MiB | 31.18 MiB/s Receiving objects: 86% (54808/63730), 79.34 MiB | 31.18 MiB/s Receiving objects: 87% (55446/63730), 79.34 MiB | 31.18 MiB/s Receiving objects: 88% (56083/63730), 79.34 MiB | 31.18 MiB/s Receiving objects: 89% (56720/63730), 79.34 MiB | 31.18 MiB/s Receiving objects: 90% (57357/63730), 79.34 MiB | 31.18 MiB/s Receiving objects: 91% (57995/63730), 79.34 MiB | 31.18 MiB/s Receiving objects: 92% (58632/63730), 79.34 MiB | 31.18 MiB/s Receiving objects: 93% (59269/63730), 79.34 MiB | 31.18 MiB/s Receiving objects: 94% (59907/63730), 79.34 MiB | 31.18 MiB/s Receiving objects: 95% (60544/63730), 79.34 MiB | 31.18 MiB/s Receiving objects: 96% (61181/63730), 79.34 MiB | 31.18 MiB/s Receiving objects: 97% (61819/63730), 79.34 MiB | 31.18 MiB/s Receiving objects: 98% (62456/63730), 79.34 MiB | 31.18 MiB/s Receiving objects: 98% (62612/63730), 79.34 MiB | 31.18 MiB/s Receiving objects: 99% (63093/63730), 79.34 MiB | 31.18 MiB/s remote: Total 63730 (delta 7155), reused 7446 (delta 6504), pack-reused 54646 (from 3)
  7. 6.77 s Receiving objects: 100% (63730/63730), 95.95 MiB | 31.52 MiB/s Receiving objects: 100% (63730/63730), 97.15 MiB | 31.58 MiB/s, done.
  8. 7.30 s Resolving deltas: 0% (0/44085) Resolving deltas: 1% (441/44085) Resolving deltas: 2% (882/44085) Resolving deltas: 3% (1325/44085) Resolving deltas: 4% (1764/44085) Resolving deltas: 5% (2205/44085) Resolving deltas: 6% (2646/44085) Resolving deltas: 7% (3086/44085) Resolving deltas: 8% (3529/44085) Resolving deltas: 9% (3968/44085) Resolving deltas: 10% (4409/44085) Resolving deltas: 11% (4850/44085) Resolving deltas: 12% (5291/44085) Resolving deltas: 13% (5732/44085) Resolving deltas: 14% (6172/44085) Resolving deltas: 15% (6613/44085) Resolving deltas: 16% (7054/44085) Resolving deltas: 17% (7495/44085) Resolving deltas: 18% (7936/44085) Resolving deltas: 19% (8377/44085) Resolving deltas: 20% (8817/44085) Resolving deltas: 21% (9258/44085) Resolving deltas: 22% (9699/44085) Resolving deltas: 23% (10141/44085) Resolving deltas: 24% (10581/44085) Resolving deltas: 25% (11022/44085) Resolving deltas: 26% (11463/44085) Resolving deltas: 27% (11903/44085) Resolving deltas: 28% (12344/44085) Resolving deltas: 29% (12785/44085) Resolving deltas: 30% (13227/44085) Resolving deltas: 31% (13667/44085) Resolving deltas: 32% (14108/44085) Resolving deltas: 33% (14549/44085) Resolving deltas: 34% (14989/44085) Resolving deltas: 35% (15430/44085) Resolving deltas: 36% (15871/44085) Resolving deltas: 37% (16312/44085) Resolving deltas: 38% (16753/44085) Resolving deltas: 39% (17194/44085) Resolving deltas: 40% (17634/44085) Resolving deltas: 41% (18075/44085) Resolving deltas: 42% (18517/44085) Resolving deltas: 43% (18957/44085) Resolving deltas: 44% (19398/44085) Resolving deltas: 45% (19839/44085) Resolving deltas: 46% (20280/44085) Resolving deltas: 47% (20721/44085) Resolving deltas: 48% (21161/44085) Resolving deltas: 49% (21602/44085) Resolving deltas: 50% (22043/44085) Resolving deltas: 51% (22484/44085) Resolving deltas: 52% (22928/44085) Resolving deltas: 53% (23367/44085) Resolving deltas: 54% (23807/44085) Resolving deltas: 55% (24247/44085) Resolving deltas: 56% (24689/44085) Resolving deltas: 57% (25129/44085) Resolving deltas: 58% (25570/44085) Resolving deltas: 59% (26011/44085) Resolving deltas: 60% (26451/44085) Resolving deltas: 61% (26892/44085) Resolving deltas: 62% (27333/44085) Resolving deltas: 63% (27774/44085) Resolving deltas: 64% (28215/44085) Resolving deltas: 65% (28656/44085) Resolving deltas: 66% (29099/44085) Resolving deltas: 67% (29537/44085) Resolving deltas: 68% (29978/44085) Resolving deltas: 69% (30419/44085) Resolving deltas: 70% (30860/44085) Resolving deltas: 71% (31301/44085) Resolving deltas: 72% (31742/44085) Resolving deltas: 73% (32183/44085) Resolving deltas: 74% (32623/44085) Resolving deltas: 75% (33064/44085) Resolving deltas: 76% (33506/44085) Resolving deltas: 77% (33946/44085) Resolving deltas: 78% (34387/44085) Resolving deltas: 79% (34828/44085) Resolving deltas: 80% (35268/44085) Resolving deltas: 81% (35709/44085) Resolving deltas: 82% (36150/44085) Resolving deltas: 83% (36591/44085) Resolving deltas: 84% (37032/44085) Resolving deltas: 85% (37474/44085) Resolving deltas: 86% (37914/44085) Resolving deltas: 87% (38355/44085) Resolving deltas: 88% (38795/44085) Resolving deltas: 89% (39236/44085) Resolving deltas: 90% (39677/44085) Resolving deltas: 91% (40118/44085) Resolving deltas: 92% (40562/44085) Resolving deltas: 93% (41000/44085) Resolving deltas: 94% (41443/44085) Resolving deltas: 95% (41881/44085) Resolving deltas: 96% (42322/44085) Resolving deltas: 97% (42764/44085) Resolving deltas: 98% (43206/44085) Resolving deltas: 99% (43645/44085) Resolving deltas: 100% (44085/44085) Resolving deltas: 100% (44085/44085), done.
  9. 7.55 s Fetching commit f8a0e490dd02bf2e71d7c8e59ff852384d143dfd for docs ...
  10. 7.55 s $ /nix/store/bcnisk3ydfgv26v2gw3zlky24g00yww2-git-2.54.0/bin/git fetch origin f8a0e490dd02bf2e71d7c8e59ff852384d143dfd
  11. 8.06 s From https://github.com/alphal00p/gammaloop
  12. 8.06 s * branch f8a0e490dd02bf2e71d7c8e59ff852384d143dfd -> FETCH_HEAD
  13. 8.08 s $ /nix/store/9ypz3flqsrl5xl495mm8h645gadjsxi1-coreutils-9.11/bin/timeout --kill-after=15s 7200s /nix/store/bcnisk3ydfgv26v2gw3zlky24g00yww2-git-2.54.0/bin/git -c advice.detachedHead=false checkout f8a0e490dd02bf2e71d7c8e59ff852384d143dfd
  14. 8.26 s HEAD is now at f8a0e490 link tutorials to getting started guides
  15. 8.27 s $ /nix/store/9ypz3flqsrl5xl495mm8h645gadjsxi1-coreutils-9.11/bin/timeout --kill-after=15s 7200s /nix/store/23zk8sgzamrbmj1fday15szf7f2279s8-nix-2.34.7/bin/nix --extra-experimental-features nix-command --extra-experimental-features flakes --log-format internal-json run .#packages.x86_64-linux.nix-ci-check-gammaloop-doctest --print-build-logs
  16. 10.27 s
  17. 12.20 s evaluating derivation 'g copying '/nix/store/8kp7 [0/19 built] [0/1 built] [1/0/1 built] building ggammaloop-workspace-doctest> Running phase: unpackPhase
  18. 12.26 s gammaloop-workspace-doctest> unpacking source archive /nix/store/7l1apkyf91kpbqvav8ix1cl9vm7hljmf-source
  19. 12.44 s gammaloop-workspace-doctest> source root is source
  20. 12.46 s gammaloop-workspace-doctest> Running phase: patchPhase
  21. 12.47 s gammaloop-workspace-doctest> Executing configureCargoCommonVars
  22. 12.47 s gammaloop-workspace-doctest> decompressing cargo artifacts from /nix/store/8rkh7d3hq722l839568nhnwihnsx041a-gammaloop-workspace-deps-deps-0.1.0/target.tar.zst to target
  23. 13.66 s gammaloop-workspace-doctest> Running phase: updateAutotoolsGnuConfigScriptsPhase
  24. 13.69 s gammaloop-workspace-doctest> Running phase: configurePhase
  25. 13.70 s gammaloop-workspace-doctest> will append /build/source/.cargo-home/config.toml with contents of /nix/store/xdy1vvhll2bijdplvl9fcc2b9plkxhaa-vendor-cargo-deps/config.toml
  26. 13.70 s gammaloop-workspace-doctest> default configurePhase, nothing to do
  27. 13.70 s gammaloop-workspace-doctest> Running phase: buildPhase
  28. 13.70 s gammaloop-workspace-doctest> +++ command cargo --version
  29. 13.71 s gammaloop-workspace-doctest> cargo 1.97.0 (c980f4866 2026-06-30)
  30. 13.73 s gammaloop-workspace-doctest> +++ command cargo test --profile ci-optim --doc --locked --workspace --features gammaloop-api/cli,gammaloop-tracing-filter/clap,gammaloop-tracing-filter/symbolica,idenso/bincode,idenso/reference-cases,linnet/bincode,linnet/drawing,linnet/nodestore-vec,linnet/rkyv,linnet/serde,linnet/symbolica,spenso-macros/shadowing,spenso/shadowing,symbolica/tracing_max_level_info
  31. 14.03 s gammaloop-workspace-doctest> Compiling target-lexicon v0.13.5
  32. 14.04 s gammaloop-workspace-doctest> Compiling symbolica v2.2.0 (https://github.com/symbolica-dev/symbolica?branch=dev#0441bd7a)
  33. 14.04 s gammaloop-workspace-doctest> Compiling maplit v1.0.2
  34. 14.05 s gammaloop-workspace-doctest> Compiling gammaloop-tracing-filter-macros v0.1.0 (/build/source/crates/gammaloop-tracing-filter-macros)
  35. 14.05 s gammaloop-workspace-doctest> Compiling vakint v0.1.2 (/build/source/crates/vakint)
  36. 14.06 s gammaloop-workspace-doctest> Compiling gammalooprs v0.3.4 (/build/source/crates/gammalooprs)
  37. 14.07 s gammaloop-workspace-doctest> Compiling alphal00p-docs-macros v0.1.0 (/build/source/crates/alphal00p-docs-macros)
  38. 14.07 s gammaloop-workspace-doctest> Compiling alphal00p-docs-schema v0.1.0 (/build/source/crates/alphal00p-docs-schema)
  39. 14.07 s gammaloop-workspace-doctest> Compiling rustc_version v0.4.1
  40. 14.08 s gammaloop-workspace-doctest> Compiling bincode v1.3.3
  41. 14.08 s gammaloop-workspace-doctest> Compiling iai-callgrind-runner v0.14.2
  42. 14.09 s gammaloop-workspace-doctest> Compiling target-triple v1.0.1
  43. 14.09 s gammaloop-workspace-doctest> Compiling gungraun-runner v0.18.2
  44. 14.09 s gammaloop-workspace-doctest> Compiling gammaloop-integration-tests v0.1.0 (/build/source/tests)
  45. 14.10 s gammaloop-workspace-doctest> Compiling test-log-core v0.2.20
  46. 14.25 s gammaloop-workspace-doctest> Compiling wait-timeout v0.2.1
  47. 14.27 s gammaloop-workspace-doctest> Compiling quick-error v1.2.3
  48. 14.28 s gammaloop-workspace-doctest> Compiling iai-callgrind v0.14.2
  49. 14.31 s gammaloop-workspace-doctest> Compiling bit-vec v0.8.0
  50. 14.43 s gammaloop-workspace-doctest> Compiling rusty-fork v0.3.1
  51. 14.44 s gammaloop-workspace-doctest> Compiling iai-callgrind-macros v0.5.1
  52. 14.44 s gammaloop-workspace-doctest> Compiling rand_xorshift v0.4.0
  53. 14.45 s gammaloop-workspace-doctest> Compiling bit-set v0.8.0
  54. 14.50 s gammaloop-workspace-doctest> Compiling console v0.15.11
  55. 14.51 s gammaloop-workspace-doctest> Compiling base64 v0.21.7
  56. 14.55 s gammaloop-workspace-doctest> Compiling termcolor v1.4.1
  57. 14.62 s gammaloop-workspace-doctest> Compiling unarray v0.1.4
  58. 14.64 s gammaloop-workspace-doctest> Compiling gungraun-macros v0.8.0
  59. 14.69 s gammaloop-workspace-doctest> Compiling glob v0.3.4
  60. 14.74 s gammaloop-workspace-doctest> Compiling alphal00p-docs-builder v0.1.0 (/build/source/crates/alphal00p-docs-builder)
  61. 14.83 s gammaloop-workspace-doctest> Compiling trybuild v1.0.120
  62. 14.86 s gammaloop-workspace-doctest> Compiling similar-asserts v1.7.0
  63. 15.04 s gammaloop-workspace-doctest> Compiling alphal00p-docs-catalogs v0.1.0 (/build/source/crates/alphal00p-docs-catalogs)
  64. 15.14 s gammaloop-workspace-doctest> Compiling ron v0.8.1
  65. 15.23 s gammaloop-workspace-doctest> Compiling proptest v1.11.0
  66. 15.27 s gammaloop-workspace-doctest> Compiling pyo3-build-config v0.28.3
  67. 15.33 s gammaloop-workspace-doctest> Compiling kurvst v0.1.0 (/build/source/crates/kurvst)
  68. 15.55 s gammaloop-workspace-doctest> Compiling test-log-macros v0.2.20
  69. 17.21 s gammaloop-workspace-doctest> Compiling test-log v0.2.20
  70. 17.34 s gammaloop-workspace-doctest> Compiling alphal00p-docs-examples v0.1.0 (/build/source/crates/alphal00p-docs-examples)
  71. 18.90 s gammaloop-workspace-doctest> Compiling gungraun v0.18.2
  72. 19.03 s gammaloop-workspace-doctest> Compiling pyo3-ffi v0.28.3
  73. 19.41 s gammaloop-workspace-doctest> Compiling pyo3-macros-backend v0.28.3
  74. 19.60 s gammaloop-workspace-doctest> Compiling pyo3 v0.28.3
  75. 19.78 s gammaloop-workspace-doctest> Compiling numpy v0.28.0
  76. 19.80 s gammaloop-workspace-doctest> Compiling gammaloop-api v0.1.0 (/build/source/crates/gammaloop-api)
  77. 23.98 s gammaloop-workspace-doctest> Compiling pyo3-macros v0.28.3
  78. 28.44 s gammaloop-workspace-doctest> Compiling pyo3-stub-gen v0.17.2
  79. 29.05 s gammaloop-workspace-doctest> Compiling numerica v2.2.0 (https://github.com/symbolica-dev/symbolica?branch=dev#0441bd7a)
  80. 31.07 s gammaloop-workspace-doctest> Compiling graphica v2.1.0 (https://github.com/symbolica-dev/symbolica?branch=dev#0441bd7a)
  81. 33.38 s gammaloop-workspace-doctest> Compiling symbolica-utils v0.1.0 (/build/source/crates/symbolica-utils)
  82. 193.94 s gammaloop-workspace-doctest> Compiling gammaloop-workspace-hack v0.1.0 (/build/source/crates/gammaloop-workspace-hack)
  83. 193.99 s gammaloop-workspace-doctest> Compiling spenso-macros v0.3.2 (/build/source/crates/spenso-macros)
  84. 194.10 s gammaloop-workspace-doctest> Compiling linnet v0.17.0 (/build/source/crates/linnet)
  85. 197.35 s gammaloop-workspace-doctest> Compiling spenso v0.6.0 (/build/source/crates/spenso)
  86. 205.17 s gammaloop-workspace-doctest> Compiling idenso v0.3.0 (/build/source/crates/idenso)
  87. 205.22 s gammaloop-workspace-doctest> Compiling gammaloop-tracing-filter v0.1.0 (/build/source/crates/gammaloop-tracing-filter)
  88. 208.95 s gammaloop-workspace-doctest> Compiling spenso-hep-lib v0.1.7 (/build/source/crates/spenso-hep-lib)
  89. 209.21 s gammaloop-workspace-doctest> Compiling spynso3 v0.1.2 (/build/source/crates/spynso3)
  90. 248.27 s gammaloop-workspace-doctest> Compiling linnest v0.1.0 (/build/source/crates/linnest)
  91. 248.33 s gammaloop-workspace-doctest> Compiling linnet-py v0.1.0 (/build/source/crates/linnet-py)
  92. 360.89 s gammaloop-workspace-doctest> Finished `ci-optim` profile [optimized] target(s) in 5m 47s
  93. 361.00 s gammaloop-workspace-doctest> warning: the following packages contain code that will be rejected by a future version of Rust: proc-macro-error2 v2.0.1
  94. 361.00 s gammaloop-workspace-doctest> note: to see what the problems were, use the option `--future-incompat-report`, or run `cargo report future-incompatibilities --id 1`
  95. 361.02 s gammaloop-workspace-doctest> Doc-tests alphal00p_docs_builder
  96. 361.16 s gammaloop-workspace-doctest>
  97. 361.16 s gammaloop-workspace-doctest> running 0 tests
  98. 361.16 s gammaloop-workspace-doctest>
  99. 361.16 s gammaloop-workspace-doctest> test result: ok. 0 passed; 0 failed; 0 ignored; 0 measured; 0 filtered out; finished in 0.00s
  100. 361.16 s gammaloop-workspace-doctest>
  101. 361.17 s gammaloop-workspace-doctest> Doc-tests alphal00p_docs_catalogs
  102. 362.29 s gammaloop-workspace-doctest>
  103. 362.29 s gammaloop-workspace-doctest> running 0 tests
  104. 362.29 s gammaloop-workspace-doctest>
  105. 362.29 s gammaloop-workspace-doctest> test result: ok. 0 passed; 0 failed; 0 ignored; 0 measured; 0 filtered out; finished in 0.00s
  106. 362.29 s gammaloop-workspace-doctest>
  107. 362.29 s gammaloop-workspace-doctest> Doc-tests alphal00p_docs_examples
  108. 362.30 s gammaloop-workspace-doctest>
  109. 362.30 s gammaloop-workspace-doctest> running 0 tests
  110. 362.30 s gammaloop-workspace-doctest>
  111. 362.30 s gammaloop-workspace-doctest> test result: ok. 0 passed; 0 failed; 0 ignored; 0 measured; 0 filtered out; finished in 0.00s
  112. 362.30 s gammaloop-workspace-doctest>
  113. 362.30 s gammaloop-workspace-doctest> Doc-tests alphal00p_docs
  114. 362.36 s gammaloop-workspace-doctest>
  115. 362.36 s gammaloop-workspace-doctest> running 0 tests
  116. 362.36 s gammaloop-workspace-doctest>
  117. 362.36 s gammaloop-workspace-doctest> test result: ok. 0 passed; 0 failed; 0 ignored; 0 measured; 0 filtered out; finished in 0.00s
  118. 362.36 s gammaloop-workspace-doctest>
  119. 362.36 s gammaloop-workspace-doctest> Doc-tests alphal00p_docs_schema
  120. 362.43 s gammaloop-workspace-doctest>
  121. 362.43 s gammaloop-workspace-doctest> running 0 tests
  122. 362.43 s gammaloop-workspace-doctest>
  123. 362.43 s gammaloop-workspace-doctest> test result: ok. 0 passed; 0 failed; 0 ignored; 0 measured; 0 filtered out; finished in 0.00s
  124. 362.43 s gammaloop-workspace-doctest>
  125. 362.43 s gammaloop-workspace-doctest> Doc-tests gammaloop_api
  126. 363.32 s gammaloop-workspace-doctest>
  127. 363.32 s gammaloop-workspace-doctest> running 16 tests
  128. 363.34 s gammaloop-workspace-doctest> test crates/gammaloop-api/src/python.rs - python::GammaLoopAPI::evaluate_sample (line 2967) ... FAILED
  129. 363.34 s gammaloop-workspace-doctest> test crates/gammaloop-api/src/python.rs - python::GammaLoopAPI::get_active_command_blocks (line 3760) ... FAILED
  130. 363.34 s gammaloop-workspace-doctest> test crates/gammaloop-api/src/python.rs - python::GammaLoopAPI::get_default_runtime_settings (line 3796) ... FAILED
  131. 363.34 s gammaloop-workspace-doctest> test crates/gammaloop-api/src/python.rs - python::PyHistogramAccumulator (line 871) ... FAILED
  132. 363.35 s gammaloop-workspace-doctest> test crates/gammaloop-api/src/python.rs - python::GammaLoopAPI::evaluate_samples (line 3108) ... FAILED
  133. 363.35 s gammaloop-workspace-doctest> test crates/gammaloop-api/src/python.rs - python::GammaLoopAPI::get_integrand_settings (line 3647) ... FAILED
  134. 363.35 s gammaloop-workspace-doctest> test crates/gammaloop-api/src/python.rs - python::GammaLoopAPI::get_integrand_info (line 3585) ... FAILED
  135. 363.40 s gammaloop-workspace-doctest> test crates/gammaloop-api/src/lib.rs - (line 18) - compile ... ok
  136. 363.43 s gammaloop-workspace-doctest> test crates/gammaloop-api/src/python.rs - python::GammaLoopAPI::run_command (line 3901) ... FAILED
  137. 363.43 s gammaloop-workspace-doctest> test crates/gammaloop-api/src/python.rs - python::GammaLoopAPI::get_global_settings (line 3739) ... FAILED
  138. 363.43 s gammaloop-workspace-doctest> test crates/gammaloop-api/src/python.rs - python::GammaLoopAPI::get_run_history (line 3711) ... FAILED
  139. 363.45 s gammaloop-workspace-doctest> test crates/gammaloop-api/src/python.rs - python::GammaLoopAPI::new_python (line 2834) ... FAILED
  140. 363.45 s gammaloop-workspace-doctest> test crates/gammaloop-api/src/python.rs - python::atom_to_dots (line 157) ... FAILED
  141. 363.45 s gammaloop-workspace-doctest> test crates/gammaloop-api/src/python.rs - python::evaluate_graph_overall_factor (line 95) ... FAILED
  142. 363.45 s gammaloop-workspace-doctest> test crates/gammaloop-api/src/python.rs - python::atom_to_canonical_string (line 128) ... FAILED
  143. 365.93 s gammaloop-workspace-doctest> test crates/gammaloop-api/src/commands/evaluate_samples.rs - commands::evaluate_samples::EvaluateSamples (line 50) ... ok
  144. 365.99 s gammaloop-workspace-doctest>
  145. 365.99 s gammaloop-workspace-doctest> failures:
  146. 365.99 s gammaloop-workspace-doctest>
  147. 365.99 s gammaloop-workspace-doctest> ---- crates/gammaloop-api/src/python.rs - python::GammaLoopAPI::evaluate_sample (line 2967) stdout ----
  148. 365.99 s gammaloop-workspace-doctest> error: expected one of `!` or `::`, found `pathlib`
  149. 365.99 s gammaloop-workspace-doctest> --> crates/gammaloop-api/src/python.rs:2968:6
  150. 365.99 s gammaloop-workspace-doctest> |
  151. 365.99 s gammaloop-workspace-doctest> 2968 | from pathlib import Path
  152. 365.99 s gammaloop-workspace-doctest> | ^^^^^^^ expected one of `!` or `::`
  153. 365.99 s gammaloop-workspace-doctest>
  154. 365.99 s gammaloop-workspace-doctest> error: aborting due to 1 previous error
  155. 365.99 s gammaloop-workspace-doctest>
  156. 365.99 s gammaloop-workspace-doctest> Couldn't compile the test.
  157. 365.99 s gammaloop-workspace-doctest> ---- crates/gammaloop-api/src/python.rs - python::GammaLoopAPI::get_active_command_blocks (line 3760) stdout ----
  158. 365.99 s gammaloop-workspace-doctest> error: expected item, found keyword `for`
  159. 365.99 s gammaloop-workspace-doctest> --> crates/gammaloop-api/src/python.rs:3761:1
  160. 365.99 s gammaloop-workspace-doctest> |
  161. 365.99 s gammaloop-workspace-doctest> 3761 | for name, commands in api.get_active_command_blocks().items():
  162. 365.99 s gammaloop-workspace-doctest> | ^^^ expected item
  163. 365.99 s gammaloop-workspace-doctest> |
  164. 365.99 s gammaloop-workspace-doctest> = note: for a full list of items that can appear in modules, see <https://doc.rust-lang.org/reference/items.html>
  165. 365.99 s gammaloop-workspace-doctest>
  166. 365.99 s gammaloop-workspace-doctest> error: aborting due to 1 previous error
  167. 365.99 s gammaloop-workspace-doctest>
  168. 365.99 s gammaloop-workspace-doctest> Couldn't compile the test.
  169. 365.99 s gammaloop-workspace-doctest> ---- crates/gammaloop-api/src/python.rs - python::GammaLoopAPI::get_default_runtime_settings (line 3796) stdout ----
  170. 365.99 s gammaloop-workspace-doctest> error: expected one of `!` or `::`, found `=`
  171. 365.99 s gammaloop-workspace-doctest> --> crates/gammaloop-api/src/python.rs:3797:9
  172. 365.99 s gammaloop-workspace-doctest> |
  173. 365.99 s gammaloop-workspace-doctest> 3797 | runtime = api.get_default_runtime_settings()
  174. 365.99 s gammaloop-workspace-doctest> | ^ expected one of `!` or `::`
  175. 365.99 s gammaloop-workspace-doctest>
  176. 365.99 s gammaloop-workspace-doctest> error: aborting due to 1 previous error
  177. 365.99 s gammaloop-workspace-doctest>
  178. 365.99 s gammaloop-workspace-doctest> Couldn't compile the test.
  179. 365.99 s gammaloop-workspace-doctest> ---- crates/gammaloop-api/src/python.rs - python::PyHistogramAccumulator (line 871) stdout ----
  180. 365.99 s gammaloop-workspace-doctest> error: expected one of `!` or `::`, found `gammaloop`
  181. 365.99 s gammaloop-workspace-doctest> --> crates/gammaloop-api/src/python.rs:872:6
  182. 365.99 s gammaloop-workspace-doctest> |
  183. 365.99 s gammaloop-workspace-doctest> 872 | from gammaloop import HistogramAccumulator
  184. 365.99 s gammaloop-workspace-doctest> | ^^^^^^^^^ expected one of `!` or `::`
  185. 365.99 s gammaloop-workspace-doctest>
  186. 365.99 s gammaloop-workspace-doctest> error: aborting due to 1 previous error
  187. 365.99 s gammaloop-workspace-doctest>
  188. 365.99 s gammaloop-workspace-doctest> Couldn't compile the test.
  189. 365.99 s gammaloop-workspace-doctest> ---- crates/gammaloop-api/src/python.rs - python::GammaLoopAPI::evaluate_samples (line 3108) stdout ----
  190. 365.99 s gammaloop-workspace-doctest> error: expected one of `!` or `::`, found `pathlib`
  191. 365.99 s gammaloop-workspace-doctest> --> crates/gammaloop-api/src/python.rs:3109:6
  192. 365.99 s gammaloop-workspace-doctest> |
  193. 365.99 s gammaloop-workspace-doctest> 3109 | from pathlib import Path
  194. 365.99 s gammaloop-workspace-doctest> | ^^^^^^^ expected one of `!` or `::`
  195. 365.99 s gammaloop-workspace-doctest>
  196. 365.99 s gammaloop-workspace-doctest> error: aborting due to 1 previous error
  197. 365.99 s gammaloop-workspace-doctest>
  198. 365.99 s gammaloop-workspace-doctest> Couldn't compile the test.
  199. 365.99 s gammaloop-workspace-doctest> ---- crates/gammaloop-api/src/python.rs - python::GammaLoopAPI::get_integrand_settings (line 3647) stdout ----
  200. 365.99 s gammaloop-workspace-doctest> error: expected one of `!` or `::`, found `=`
  201. 365.99 s gammaloop-workspace-doctest> --> crates/gammaloop-api/src/python.rs:3648:10
  202. 365.99 s gammaloop-workspace-doctest> |
  203. 365.99 s gammaloop-workspace-doctest> 3648 | settings = api.get_integrand_settings(process_id=0)
  204. 365.99 s gammaloop-workspace-doctest> | ^ expected one of `!` or `::`
  205. 365.99 s gammaloop-workspace-doctest>
  206. 365.99 s gammaloop-workspace-doctest> error: aborting due to 1 previous error
  207. 365.99 s gammaloop-workspace-doctest>
  208. 365.99 s gammaloop-workspace-doctest> Couldn't compile the test.
  209. 365.99 s gammaloop-workspace-doctest> ---- crates/gammaloop-api/src/python.rs - python::GammaLoopAPI::get_integrand_info (line 3585) stdout ----
  210. 365.99 s gammaloop-workspace-doctest> error: expected one of `!` or `::`, found `pathlib`
  211. 365.99 s gammaloop-workspace-doctest> --> crates/gammaloop-api/src/python.rs:3586:6
  212. 365.99 s gammaloop-workspace-doctest> |
  213. 365.99 s gammaloop-workspace-doctest> 3586 | from pathlib import Path
  214. 365.99 s gammaloop-workspace-doctest> | ^^^^^^^ expected one of `!` or `::`
  215. 365.99 s gammaloop-workspace-doctest>
  216. 365.99 s gammaloop-workspace-doctest> error: aborting due to 1 previous error
  217. 365.99 s gammaloop-workspace-doctest>
  218. 365.99 s gammaloop-workspace-doctest> Couldn't compile the test.
  219. 365.99 s gammaloop-workspace-doctest> ---- crates/gammaloop-api/src/python.rs - python::GammaLoopAPI::run_command (line 3901) stdout ----
  220. 365.99 s gammaloop-workspace-doctest> error[E0425]: cannot find value `api` in this scope
  221. 365.99 s gammaloop-workspace-doctest> --> crates/gammaloop-api/src/python.rs:3902:1
  222. 365.99 s gammaloop-workspace-doctest> |
  223. 365.99 s gammaloop-workspace-doctest> 3902 | api.run("display processes")
  224. 365.99 s gammaloop-workspace-doctest> | ^^^ not found in this scope
  225. 365.99 s gammaloop-workspace-doctest>
  226. 365.99 s gammaloop-workspace-doctest> error: aborting due to 1 previous error
  227. 365.99 s gammaloop-workspace-doctest>
  228. 365.99 s gammaloop-workspace-doctest> For more information about this error, try `rustc --explain E0425`.
  229. 365.99 s gammaloop-workspace-doctest> Couldn't compile the test.
  230. 365.99 s gammaloop-workspace-doctest> ---- crates/gammaloop-api/src/python.rs - python::GammaLoopAPI::get_global_settings (line 3739) stdout ----
  231. 365.99 s gammaloop-workspace-doctest> error[E0425]: cannot find value `settings_toml` in this scope
  232. 365.99 s gammaloop-workspace-doctest> --> crates/gammaloop-api/src/python.rs:3740:1
  233. 365.99 s gammaloop-workspace-doctest> |
  234. 365.99 s gammaloop-workspace-doctest> 3740 | settings_toml = api.get_global_settings()
  235. 365.99 s gammaloop-workspace-doctest> | ^^^^^^^^^^^^^
  236. 365.99 s gammaloop-workspace-doctest> |
  237. 365.99 s gammaloop-workspace-doctest> help: you might have meant to introduce a new binding
  238. 365.99 s gammaloop-workspace-doctest> |
  239. 365.99 s gammaloop-workspace-doctest> 3740 | let settings_toml = api.get_global_settings()
  240. 365.99 s gammaloop-workspace-doctest> | +++
  241. 365.99 s gammaloop-workspace-doctest>
  242. 365.99 s gammaloop-workspace-doctest> error[E0425]: cannot find value `api` in this scope
  243. 365.99 s gammaloop-workspace-doctest> --> crates/gammaloop-api/src/python.rs:3740:17
  244. 365.99 s gammaloop-workspace-doctest> |
  245. 365.99 s gammaloop-workspace-doctest> 3740 | settings_toml = api.get_global_settings()
  246. 365.99 s gammaloop-workspace-doctest> | ^^^ not found in this scope
  247. 365.99 s gammaloop-workspace-doctest>
  248. 365.99 s gammaloop-workspace-doctest> error: aborting due to 2 previous errors
  249. 365.99 s gammaloop-workspace-doctest>
  250. 365.99 s gammaloop-workspace-doctest> For more information about this error, try `rustc --explain E0425`.
  251. 365.99 s gammaloop-workspace-doctest> Couldn't compile the test.
  252. 365.99 s gammaloop-workspace-doctest> ---- crates/gammaloop-api/src/python.rs - python::GammaLoopAPI::get_run_history (line 3711) stdout ----
  253. 365.99 s gammaloop-workspace-doctest> error[E0425]: cannot find value `run_card_toml` in this scope
  254. 365.99 s gammaloop-workspace-doctest> --> crates/gammaloop-api/src/python.rs:3712:1
  255. 365.99 s gammaloop-workspace-doctest> |
  256. 365.99 s gammaloop-workspace-doctest> 3712 | run_card_toml = api.get_run_history()
  257. 365.99 s gammaloop-workspace-doctest> | ^^^^^^^^^^^^^
  258. 365.99 s gammaloop-workspace-doctest> |
  259. 365.99 s gammaloop-workspace-doctest> help: you might have meant to introduce a new binding
  260. 365.99 s gammaloop-workspace-doctest> |
  261. 365.99 s gammaloop-workspace-doctest> 3712 | let run_card_toml = api.get_run_history()
  262. 365.99 s gammaloop-workspace-doctest> | +++
  263. 365.99 s gammaloop-workspace-doctest>
  264. 365.99 s gammaloop-workspace-doctest> error[E0425]: cannot find value `api` in this scope
  265. 365.99 s gammaloop-workspace-doctest> --> crates/gammaloop-api/src/python.rs:3712:17
  266. 365.99 s gammaloop-workspace-doctest> |
  267. 365.99 s gammaloop-workspace-doctest> 3712 | run_card_toml = api.get_run_history()
  268. 365.99 s gammaloop-workspace-doctest> | ^^^ not found in this scope
  269. 365.99 s gammaloop-workspace-doctest>
  270. 365.99 s gammaloop-workspace-doctest> error: aborting due to 2 previous errors
  271. 365.99 s gammaloop-workspace-doctest>
  272. 365.99 s gammaloop-workspace-doctest> For more information about this error, try `rustc --explain E0425`.
  273. 365.99 s gammaloop-workspace-doctest> Couldn't compile the test.
  274. 365.99 s gammaloop-workspace-doctest> ---- crates/gammaloop-api/src/python.rs - python::GammaLoopAPI::new_python (line 2834) stdout ----
  275. 365.99 s gammaloop-workspace-doctest> error[E0425]: cannot find value `api` in this scope
  276. 365.99 s gammaloop-workspace-doctest> --> crates/gammaloop-api/src/python.rs:2835:1
  277. 365.99 s gammaloop-workspace-doctest> |
  278. 365.99 s gammaloop-workspace-doctest> 2835 | api = GammaLoopAPI(state_folder="./state", read_only_state=True)
  279. 365.99 s gammaloop-workspace-doctest> | ^^^
  280. 365.99 s gammaloop-workspace-doctest> |
  281. 365.99 s gammaloop-workspace-doctest> help: you might have meant to introduce a new binding
  282. 365.99 s gammaloop-workspace-doctest> |
  283. 365.99 s gammaloop-workspace-doctest> 2835 | let api = GammaLoopAPI(state_folder="./state", read_only_state=True)
  284. 365.99 s gammaloop-workspace-doctest> | +++
  285. 365.99 s gammaloop-workspace-doctest>
  286. 365.99 s gammaloop-workspace-doctest> error[E0425]: cannot find value `state_folder` in this scope
  287. 365.99 s gammaloop-workspace-doctest> --> crates/gammaloop-api/src/python.rs:2835:20
  288. 365.99 s gammaloop-workspace-doctest> |
  289. 365.99 s gammaloop-workspace-doctest> 2835 | api = GammaLoopAPI(state_folder="./state", read_only_state=True)
  290. 365.99 s gammaloop-workspace-doctest> | ^^^^^^^^^^^^ not found in this scope
  291. 365.99 s gammaloop-workspace-doctest>
  292. 365.99 s gammaloop-workspace-doctest> error[E0425]: cannot find value `read_only_state` in this scope
  293. 365.99 s gammaloop-workspace-doctest> --> crates/gammaloop-api/src/python.rs:2835:44
  294. 365.99 s gammaloop-workspace-doctest> |
  295. 365.99 s gammaloop-workspace-doctest> 2835 | api = GammaLoopAPI(state_folder="./state", read_only_state=True)
  296. 365.99 s gammaloop-workspace-doctest> | ^^^^^^^^^^^^^^^ not found in this scope
  297. 365.99 s gammaloop-workspace-doctest>
  298. 365.99 s gammaloop-workspace-doctest> error[E0425]: cannot find value `True` in this scope
  299. 365.99 s gammaloop-workspace-doctest> --> crates/gammaloop-api/src/python.rs:2835:60
  300. 365.99 s gammaloop-workspace-doctest> |
  301. 365.99 s gammaloop-workspace-doctest> 2835 | api = GammaLoopAPI(state_folder="./state", read_only_state=True)
  302. 365.99 s gammaloop-workspace-doctest> | ^^^^ not found in this scope
  303. 365.99 s gammaloop-workspace-doctest> |
  304. 365.99 s gammaloop-workspace-doctest> help: you may want to use a bool value instead
  305. 365.99 s gammaloop-workspace-doctest> |
  306. 365.99 s gammaloop-workspace-doctest> 2835 - api = GammaLoopAPI(state_folder="./state", read_only_state=True)
  307. 365.99 s gammaloop-workspace-doctest> 2835 + api = GammaLoopAPI(state_folder="./state", read_only_state=true)
  308. 365.99 s gammaloop-workspace-doctest> |
  309. 365.99 s gammaloop-workspace-doctest>
  310. 365.99 s gammaloop-workspace-doctest> error[E0425]: cannot find function, tuple struct or tuple variant `GammaLoopAPI` in this scope
  311. 365.99 s gammaloop-workspace-doctest> --> crates/gammaloop-api/src/python.rs:2835:7
  312. 365.99 s gammaloop-workspace-doctest> |
  313. 365.99 s gammaloop-workspace-doctest> 2835 | api = GammaLoopAPI(state_folder="./state", read_only_state=True)
  314. 365.99 s gammaloop-workspace-doctest> | ^^^^^^^^^^^^ not found in this scope
  315. 365.99 s gammaloop-workspace-doctest>
  316. 365.99 s gammaloop-workspace-doctest> error: aborting due to 5 previous errors
  317. 365.99 s gammaloop-workspace-doctest>
  318. 365.99 s gammaloop-workspace-doctest> For more information about this error, try `rustc --explain E0425`.
  319. 365.99 s gammaloop-workspace-doctest> Couldn't compile the test.
  320. 365.99 s gammaloop-workspace-doctest> ---- crates/gammaloop-api/src/python.rs - python::atom_to_dots (line 157) stdout ----
  321. 365.99 s gammaloop-workspace-doctest> error[E0425]: cannot find function `to_dots` in this scope
  322. 365.99 s gammaloop-workspace-doctest> --> crates/gammaloop-api/src/python.rs:158:1
  323. 365.99 s gammaloop-workspace-doctest> |
  324. 365.99 s gammaloop-workspace-doctest> 158 | to_dots("p(mu) * q(mu)")
  325. 365.99 s gammaloop-workspace-doctest> | ^^^^^^^ not found in this scope
  326. 365.99 s gammaloop-workspace-doctest>
  327. 365.99 s gammaloop-workspace-doctest> error: aborting due to 1 previous error
  328. 365.99 s gammaloop-workspace-doctest>
  329. 365.99 s gammaloop-workspace-doctest> For more information about this error, try `rustc --explain E0425`.
  330. 365.99 s gammaloop-workspace-doctest> Couldn't compile the test.
  331. 365.99 s gammaloop-workspace-doctest> ---- crates/gammaloop-api/src/python.rs - python::evaluate_graph_overall_factor (line 95) stdout ----
  332. 365.99 s gammaloop-workspace-doctest> error[E0425]: cannot find function `evaluate_graph_overall_factor` in this scope
  333. 365.99 s gammaloop-workspace-doctest> --> crates/gammaloop-api/src/python.rs:96:1
  334. 365.99 s gammaloop-workspace-doctest> |
  335. 365.99 s gammaloop-workspace-doctest> 96 | evaluate_graph_overall_factor(
  336. 365.99 s gammaloop-workspace-doctest> | ^^^^^^^^^^^^^^^^^^^^^^^^^^^^^ not found in this scope
  337. 365.99 s gammaloop-workspace-doctest>
  338. 365.99 s gammaloop-workspace-doctest> error: aborting due to 1 previous error
  339. 365.99 s gammaloop-workspace-doctest>
  340. 365.99 s gammaloop-workspace-doctest> For more information about this error, try `rustc --explain E0425`.
  341. 365.99 s gammaloop-workspace-doctest> Couldn't compile the test.
  342. 365.99 s gammaloop-workspace-doctest> ---- crates/gammaloop-api/src/python.rs - python::atom_to_canonical_string (line 128) stdout ----
  343. 365.99 s gammaloop-workspace-doctest> error[E0425]: cannot find function `atom_to_canonical_string` in this scope
  344. 365.99 s gammaloop-workspace-doctest> --> crates/gammaloop-api/src/python.rs:129:1
  345. 365.99 s gammaloop-workspace-doctest> |
  346. 365.99 s gammaloop-workspace-doctest> 129 | atom_to_canonical_string("x + x")
  347. 365.99 s gammaloop-workspace-doctest> | ^^^^^^^^^^^^^^^^^^^^^^^^ not found in this scope
  348. 365.99 s gammaloop-workspace-doctest>
  349. 365.99 s gammaloop-workspace-doctest> error: aborting due to 1 previous error
  350. 365.99 s gammaloop-workspace-doctest>
  351. 365.99 s gammaloop-workspace-doctest> For more information about this error, try `rustc --explain E0425`.
  352. 365.99 s gammaloop-workspace-doctest> Couldn't compile the test.
  353. 365.99 s gammaloop-workspace-doctest>
  354. 365.99 s gammaloop-workspace-doctest> failures:
  355. 365.99 s gammaloop-workspace-doctest> crates/gammaloop-api/src/python.rs - python::GammaLoopAPI::evaluate_sample (line 2967)
  356. 365.99 s gammaloop-workspace-doctest> crates/gammaloop-api/src/python.rs - python::GammaLoopAPI::evaluate_samples (line 3108)
  357. 365.99 s gammaloop-workspace-doctest> crates/gammaloop-api/src/python.rs - python::GammaLoopAPI::get_active_command_blocks (line 3760)
  358. 365.99 s gammaloop-workspace-doctest> crates/gammaloop-api/src/python.rs - python::GammaLoopAPI::get_default_runtime_settings (line 3796)
  359. 365.99 s gammaloop-workspace-doctest> crates/gammaloop-api/src/python.rs - python::GammaLoopAPI::get_global_settings (line 3739)
  360. 365.99 s gammaloop-workspace-doctest> crates/gammaloop-api/src/python.rs - python::GammaLoopAPI::get_integrand_info (line 3585)
  361. 365.99 s gammaloop-workspace-doctest> crates/gammaloop-api/src/python.rs - python::GammaLoopAPI::get_integrand_settings (line 3647)
  362. 365.99 s gammaloop-workspace-doctest> crates/gammaloop-api/src/python.rs - python::GammaLoopAPI::get_run_history (line 3711)
  363. 365.99 s gammaloop-workspace-doctest> crates/gammaloop-api/src/python.rs - python::GammaLoopAPI::new_python (line 2834)
  364. 365.99 s gammaloop-workspace-doctest> crates/gammaloop-api/src/python.rs - python::GammaLoopAPI::run_command (line 3901)
  365. 365.99 s gammaloop-workspace-doctest> crates/gammaloop-api/src/python.rs - python::PyHistogramAccumulator (line 871)
  366. 365.99 s gammaloop-workspace-doctest> crates/gammaloop-api/src/python.rs - python::atom_to_canonical_string (line 128)
  367. 365.99 s gammaloop-workspace-doctest> crates/gammaloop-api/src/python.rs - python::atom_to_dots (line 157)
  368. 365.99 s gammaloop-workspace-doctest> crates/gammaloop-api/src/python.rs - python::evaluate_graph_overall_factor (line 95)
  369. 365.99 s gammaloop-workspace-doctest>
  370. 365.99 s gammaloop-workspace-doctest> test result: FAILED. 2 passed; 14 failed; 0 ignored; 0 measured; 0 filtered out; finished in 2.61s
  371. 365.99 s gammaloop-workspace-doctest>
  372. 365.99 s gammaloop-workspace-doctest> error: doctest failed, to rerun pass `-p gammaloop-api --doc`
  373. 366.47 s error: Cannot build '/nix/store/y47h4cnqp41a82sbhpiarsni9kgmcns6-gammaloop-workspace-doctest-0.1.0.drv'.
  374. 366.47 s Reason: builder failed with exit code 101.
  375. 366.47 s Output paths:
  376. 366.47 s /nix/store/csbhhjrnmnlckq5bnzxs8vd5h7dpyng2-gammaloop-workspace-doctest-0.1.0
  377. 366.47 s Last 356 log lines:
  378. 366.47 s > Running phase: unpackPhase
  379. 366.47 s > unpacking source archive /nix/store/7l1apkyf91kpbqvav8ix1cl9vm7hljmf-source
  380. 366.47 s > source root is source
  381. 366.47 s > Running phase: patchPhase
  382. 366.47 s > Executing configureCargoCommonVars
  383. 366.47 s > decompressing cargo artifacts from /nix/store/8rkh7d3hq722l839568nhnwihnsx041a-gammaloop-workspace-deps-deps-0.1.0/target.tar.zst to target
  384. 366.47 s > Running phase: updateAutotoolsGnuConfigScriptsPhase
  385. 366.47 s > Running phase: configurePhase
  386. 366.47 s > will append /build/source/.cargo-home/config.toml with contents of /nix/store/xdy1vvhll2bijdplvl9fcc2b9plkxhaa-vendor-cargo-deps/config.toml
  387. 366.47 s > default configurePhase, nothing to do
  388. 366.47 s > Running phase: buildPhase
  389. 366.47 s > +++ command cargo --version
  390. 366.47 s > cargo 1.97.0 (c980f4866 2026-06-30)
  391. 366.47 s > +++ command cargo test --profile ci-optim --doc --locked --workspace --features gammaloop-api/cli,gammaloop-tracing-filter/clap,gammaloop-tracing-filter/symbolica,idenso/bincode,idenso/reference-cases,linnet/bincode,linnet/drawing,linnet/nodestore-vec,linnet/rkyv,linnet/serde,linnet/symbolica,spenso-macros/shadowing,spenso/shadowing,symbolica/tracing_max_level_info
  392. 366.47 s > Compiling target-lexicon v0.13.5
  393. 366.47 s > Compiling symbolica v2.2.0 (https://github.com/symbolica-dev/symbolica?branch=dev#0441bd7a)
  394. 366.47 s > Compiling maplit v1.0.2
  395. 366.47 s > Compiling gammaloop-tracing-filter-macros v0.1.0 (/build/source/crates/gammaloop-tracing-filter-macros)
  396. 366.47 s > Compiling vakint v0.1.2 (/build/source/crates/vakint)
  397. 366.47 s > Compiling gammalooprs v0.3.4 (/build/source/crates/gammalooprs)
  398. 366.47 s > Compiling alphal00p-docs-macros v0.1.0 (/build/source/crates/alphal00p-docs-macros)
  399. 366.47 s > Compiling alphal00p-docs-schema v0.1.0 (/build/source/crates/alphal00p-docs-schema)
  400. 366.47 s > Compiling rustc_version v0.4.1
  401. 366.47 s > Compiling bincode v1.3.3
  402. 366.47 s > Compiling iai-callgrind-runner v0.14.2
  403. 366.47 s > Compiling target-triple v1.0.1
  404. 366.47 s > Compiling gungraun-runner v0.18.2
  405. 366.47 s > Compiling gammaloop-integration-tests v0.1.0 (/build/source/tests)
  406. 366.47 s > Compiling test-log-core v0.2.20
  407. 366.47 s > Compiling wait-timeout v0.2.1
  408. 366.47 s > Compiling quick-error v1.2.3
  409. 366.47 s > Compiling iai-callgrind v0.14.2
  410. 366.47 s > Compiling bit-vec v0.8.0
  411. 366.47 s > Compiling rusty-fork v0.3.1
  412. 366.47 s > Compiling iai-callgrind-macros v0.5.1
  413. 366.47 s > Compiling rand_xorshift v0.4.0
  414. 366.47 s > Compiling bit-set v0.8.0
  415. 366.47 s > Compiling console v0.15.11
  416. 366.47 s > Compiling base64 v0.21.7
  417. 366.47 s > Compiling termcolor v1.4.1
  418. 366.47 s > Compiling unarray v0.1.4
  419. 366.47 s > Compiling gungraun-macros v0.8.0
  420. 366.47 s > Compiling glob v0.3.4
  421. 366.47 s > Compiling alphal00p-docs-builder v0.1.0 (/build/source/crates/alphal00p-docs-builder)
  422. 366.47 s > Compiling trybuild v1.0.120
  423. 366.47 s > Compiling similar-asserts v1.7.0
  424. 366.47 s > Compiling alphal00p-docs-catalogs v0.1.0 (/build/source/crates/alphal00p-docs-catalogs)
  425. 366.47 s > Compiling ron v0.8.1
  426. 366.47 s > Compiling proptest v1.11.0
  427. 366.47 s > Compiling pyo3-build-config v0.28.3
  428. 366.47 s > Compiling kurvst v0.1.0 (/build/source/crates/kurvst)
  429. 366.47 s > Compiling test-log-macros v0.2.20
  430. 366.47 s > Compiling test-log v0.2.20
  431. 366.47 s > Compiling alphal00p-docs-examples v0.1.0 (/build/source/crates/alphal00p-docs-examples)
  432. 366.47 s > Compiling gungraun v0.18.2
  433. 366.47 s > Compiling pyo3-ffi v0.28.3
  434. 366.47 s > Compiling pyo3-macros-backend v0.28.3
  435. 366.47 s > Compiling pyo3 v0.28.3
  436. 366.47 s > Compiling numpy v0.28.0
  437. 366.47 s > Compiling gammaloop-api v0.1.0 (/build/source/crates/gammaloop-api)
  438. 366.47 s > Compiling pyo3-macros v0.28.3
  439. 366.47 s > Compiling pyo3-stub-gen v0.17.2
  440. 366.47 s > Compiling numerica v2.2.0 (https://github.com/symbolica-dev/symbolica?branch=dev#0441bd7a)
  441. 366.47 s > Compiling graphica v2.1.0 (https://github.com/symbolica-dev/symbolica?branch=dev#0441bd7a)
  442. 366.47 s > Compiling symbolica-utils v0.1.0 (/build/source/crates/symbolica-utils)
  443. 366.47 s > Compiling gammaloop-workspace-hack v0.1.0 (/build/source/crates/gammaloop-workspace-hack)
  444. 366.47 s > Compiling spenso-macros v0.3.2 (/build/source/crates/spenso-macros)
  445. 366.47 s > Compiling linnet v0.17.0 (/build/source/crates/linnet)
  446. 366.47 s > Compiling spenso v0.6.0 (/build/source/crates/spenso)
  447. 366.47 s > Compiling idenso v0.3.0 (/build/source/crates/idenso)
  448. 366.47 s > Compiling gammaloop-tracing-filter v0.1.0 (/build/source/crates/gammaloop-tracing-filter)
  449. 366.47 s > Compiling spenso-hep-lib v0.1.7 (/build/source/crates/spenso-hep-lib)
  450. 366.47 s > Compiling spynso3 v0.1.2 (/build/source/crates/spynso3)
  451. 366.47 s > Compiling linnest v0.1.0 (/build/source/crates/linnest)
  452. 366.47 s > Compiling linnet-py v0.1.0 (/build/source/crates/linnet-py)
  453. 366.47 s > Finished `ci-optim` profile [optimized] target(s) in 5m 47s
  454. 366.47 s > warning: the following packages contain code that will be rejected by a future version of Rust: proc-macro-error2 v2.0.1
  455. 366.47 s > note: to see what the problems were, use the option `--future-incompat-report`, or run `cargo report future-incompatibilities --id 1`
  456. 366.47 s > Doc-tests alphal00p_docs_builder
  457. 366.47 s >
  458. 366.47 s > running 0 tests
  459. 366.47 s >
  460. 366.47 s > test result: ok. 0 passed; 0 failed; 0 ignored; 0 measured; 0 filtered out; finished in 0.00s
  461. 366.47 s >
  462. 366.47 s > Doc-tests alphal00p_docs_catalogs
  463. 366.47 s >
  464. 366.47 s > running 0 tests
  465. 366.47 s >
  466. 366.47 s > test result: ok. 0 passed; 0 failed; 0 ignored; 0 measured; 0 filtered out; finished in 0.00s
  467. 366.47 s >
  468. 366.47 s > Doc-tests alphal00p_docs_examples
  469. 366.47 s >
  470. 366.47 s > running 0 tests
  471. 366.47 s >
  472. 366.47 s > test result: ok. 0 passed; 0 failed; 0 ignored; 0 measured; 0 filtered out; finished in 0.00s
  473. 366.47 s >
  474. 366.47 s > Doc-tests alphal00p_docs
  475. 366.47 s >
  476. 366.47 s > running 0 tests
  477. 366.47 s >
  478. 366.47 s > test result: ok. 0 passed; 0 failed; 0 ignored; 0 measured; 0 filtered out; finished in 0.00s
  479. 366.47 s >
  480. 366.47 s > Doc-tests alphal00p_docs_schema
  481. 366.47 s >
  482. 366.47 s > running 0 tests
  483. 366.47 s >
  484. 366.47 s > test result: ok. 0 passed; 0 failed; 0 ignored; 0 measured; 0 filtered out; finished in 0.00s
  485. 366.47 s >
  486. 366.47 s > Doc-tests gammaloop_api
  487. 366.47 s >
  488. 366.47 s > running 16 tests
  489. 366.47 s > test crates/gammaloop-api/src/python.rs - python::GammaLoopAPI::evaluate_sample (line 2967) ... FAILED
  490. 366.47 s > test crates/gammaloop-api/src/python.rs - python::GammaLoopAPI::get_active_command_blocks (line 3760) ... FAILED
  491. 366.47 s > test crates/gammaloop-api/src/python.rs - python::GammaLoopAPI::get_default_runtime_settings (line 3796) ... FAILED
  492. 366.47 s > test crates/gammaloop-api/src/python.rs - python::PyHistogramAccumulator (line 871) ... FAILED
  493. 366.47 s > test crates/gammaloop-api/src/python.rs - python::GammaLoopAPI::evaluate_samples (line 3108) ... FAILED
  494. 366.47 s > test crates/gammaloop-api/src/python.rs - python::GammaLoopAPI::get_integrand_settings (line 3647) ... FAILED
  495. 366.47 s > test crates/gammaloop-api/src/python.rs - python::GammaLoopAPI::get_integrand_info (line 3585) ... FAILED
  496. 366.47 s > test crates/gammaloop-api/src/lib.rs - (line 18) - compile ... ok
  497. 366.47 s > test crates/gammaloop-api/src/python.rs - python::GammaLoopAPI::run_command (line 3901) ... FAILED
  498. 366.47 s > test crates/gammaloop-api/src/python.rs - python::GammaLoopAPI::get_global_settings (line 3739) ... FAILED
  499. 366.47 s > test crates/gammaloop-api/src/python.rs - python::GammaLoopAPI::get_run_history (line 3711) ... FAILED
  500. 366.47 s > test crates/gammaloop-api/src/python.rs - python::GammaLoopAPI::new_python (line 2834) ... FAILED
  501. 366.47 s > test crates/gammaloop-api/src/python.rs - python::atom_to_dots (line 157) ... FAILED
  502. 366.47 s > test crates/gammaloop-api/src/python.rs - python::evaluate_graph_overall_factor (line 95) ... FAILED
  503. 366.47 s > test crates/gammaloop-api/src/python.rs - python::atom_to_canonical_string (line 128) ... FAILED
  504. 366.47 s > test crates/gammaloop-api/src/commands/evaluate_samples.rs - commands::evaluate_samples::EvaluateSamples (line 50) ... ok
  505. 366.47 s >
  506. 366.47 s > failures:
  507. 366.47 s >
  508. 366.47 s > ---- crates/gammaloop-api/src/python.rs - python::GammaLoopAPI::evaluate_sample (line 2967) stdout ----
  509. 366.47 s > error: expected one of `!` or `::`, found `pathlib`
  510. 366.47 s > --> crates/gammaloop-api/src/python.rs:2968:6
  511. 366.47 s > |
  512. 366.47 s > 2968 | from pathlib import Path
  513. 366.47 s > | ^^^^^^^ expected one of `!` or `::`
  514. 366.47 s >
  515. 366.47 s > error: aborting due to 1 previous error
  516. 366.47 s >
  517. 366.47 s > Couldn't compile the test.
  518. 366.47 s > ---- crates/gammaloop-api/src/python.rs - python::GammaLoopAPI::get_active_command_blocks (line 3760) stdout ----
  519. 366.47 s > error: expected item, found keyword `for`
  520. 366.47 s > --> crates/gammaloop-api/src/python.rs:3761:1
  521. 366.47 s > |
  522. 366.47 s > 3761 | for name, commands in api.get_active_command_blocks().items():
  523. 366.47 s > | ^^^ expected item
  524. 366.47 s > |
  525. 366.47 s > = note: for a full list of items that can appear in modules, see <https://doc.rust-lang.org/reference/items.html>
  526. 366.47 s >
  527. 366.47 s > error: aborting due to 1 previous error
  528. 366.47 s >
  529. 366.47 s > Couldn't compile the test.
  530. 366.47 s > ---- crates/gammaloop-api/src/python.rs - python::GammaLoopAPI::get_default_runtime_settings (line 3796) stdout ----
  531. 366.47 s > error: expected one of `!` or `::`, found `=`
  532. 366.47 s > --> crates/gammaloop-api/src/python.rs:3797:9
  533. 366.47 s > |
  534. 366.47 s > 3797 | runtime = api.get_default_runtime_settings()
  535. 366.47 s > | ^ expected one of `!` or `::`
  536. 366.47 s >
  537. 366.47 s > error: aborting due to 1 previous error
  538. 366.47 s >
  539. 366.47 s > Couldn't compile the test.
  540. 366.47 s > ---- crates/gammaloop-api/src/python.rs - python::PyHistogramAccumulator (line 871) stdout ----
  541. 366.47 s > error: expected one of `!` or `::`, found `gammaloop`
  542. 366.47 s > --> crates/gammaloop-api/src/python.rs:872:6
  543. 366.47 s > |
  544. 366.47 s > 872 | from gammaloop import HistogramAccumulator
  545. 366.47 s > | ^^^^^^^^^ expected one of `!` or `::`
  546. 366.47 s >
  547. 366.47 s > error: aborting due to 1 previous error
  548. 366.47 s >
  549. 366.47 s > Couldn't compile the test.
  550. 366.47 s > ---- crates/gammaloop-api/src/python.rs - python::GammaLoopAPI::evaluate_samples (line 3108) stdout ----
  551. 366.47 s > error: expected one of `!` or `::`, found `pathlib`
  552. 366.47 s > --> crates/gammaloop-api/src/python.rs:3109:6
  553. 366.47 s > |
  554. 366.47 s > 3109 | from pathlib import Path
  555. 366.47 s > | ^^^^^^^ expected one of `!` or `::`
  556. 366.47 s >
  557. 366.47 s > error: aborting due to 1 previous error
  558. 366.47 s >
  559. 366.47 s > Couldn't compile the test.
  560. 366.47 s > ---- crates/gammaloop-api/src/python.rs - python::GammaLoopAPI::get_integrand_settings (line 3647) stdout ----
  561. 366.47 s > error: expected one of `!` or `::`, found `=`
  562. 366.47 s > --> crates/gammaloop-api/src/python.rs:3648:10
  563. 366.47 s > |
  564. 366.47 s > 3648 | settings = api.get_integrand_settings(process_id=0)
  565. 366.47 s > | ^ expected one of `!` or `::`
  566. 366.47 s >
  567. 366.47 s > error: aborting due to 1 previous error
  568. 366.47 s >
  569. 366.47 s > Couldn't compile the test.
  570. 366.47 s > ---- crates/gammaloop-api/src/python.rs - python::GammaLoopAPI::get_integrand_info (line 3585) stdout ----
  571. 366.47 s > error: expected one of `!` or `::`, found `pathlib`
  572. 366.47 s > --> crates/gammaloop-api/src/python.rs:3586:6
  573. 366.47 s > |
  574. 366.47 s > 3586 | from pathlib import Path
  575. 366.47 s > | ^^^^^^^ expected one of `!` or `::`
  576. 366.47 s >
  577. 366.47 s > error: aborting due to 1 previous error
  578. 366.47 s >
  579. 366.47 s > Couldn't compile the test.
  580. 366.47 s > ---- crates/gammaloop-api/src/python.rs - python::GammaLoopAPI::run_command (line 3901) stdout ----
  581. 366.47 s > error[E0425]: cannot find value `api` in this scope
  582. 366.47 s > --> crates/gammaloop-api/src/python.rs:3902:1
  583. 366.47 s > |
  584. 366.47 s > 3902 | api.run("display processes")
  585. 366.47 s > | ^^^ not found in this scope
  586. 366.47 s >
  587. 366.47 s > error: aborting due to 1 previous error
  588. 366.47 s >
  589. 366.47 s > For more information about this error, try `rustc --explain E0425`.
  590. 366.47 s > Couldn't compile the test.
  591. 366.47 s > ---- crates/gammaloop-api/src/python.rs - python::GammaLoopAPI::get_global_settings (line 3739) stdout ----
  592. 366.47 s > error[E0425]: cannot find value `settings_toml` in this scope
  593. 366.47 s > --> crates/gammaloop-api/src/python.rs:3740:1
  594. 366.47 s > |
  595. 366.47 s > 3740 | settings_toml = api.get_global_settings()
  596. 366.47 s > | ^^^^^^^^^^^^^
  597. 366.47 s > |
  598. 366.47 s > help: you might have meant to introduce a new binding
  599. 366.47 s > |
  600. 366.47 s > 3740 | let settings_toml = api.get_global_settings()
  601. 366.47 s > | +++
  602. 366.47 s >
  603. 366.47 s > error[E0425]: cannot find value `api` in this scope
  604. 366.47 s > --> crates/gammaloop-api/src/python.rs:3740:17
  605. 366.47 s > |
  606. 366.47 s > 3740 | settings_toml = api.get_global_settings()
  607. 366.47 s > | ^^^ not found in this scope
  608. 366.47 s >
  609. 366.47 s > error: aborting due to 2 previous errors
  610. 366.47 s >
  611. 366.47 s > For more information about this error, try `rustc --explain E0425`.
  612. 366.47 s > Couldn't compile the test.
  613. 366.47 s > ---- crates/gammaloop-api/src/python.rs - python::GammaLoopAPI::get_run_history (line 3711) stdout ----
  614. 366.47 s > error[E0425]: cannot find value `run_card_toml` in this scope
  615. 366.47 s > --> crates/gammaloop-api/src/python.rs:3712:1
  616. 366.47 s > |
  617. 366.47 s > 3712 | run_card_toml = api.get_run_history()
  618. 366.47 s > | ^^^^^^^^^^^^^
  619. 366.47 s > |
  620. 366.47 s > help: you might have meant to introduce a new binding
  621. 366.47 s > |
  622. 366.47 s > 3712 | let run_card_toml = api.get_run_history()
  623. 366.47 s > | +++
  624. 366.47 s >
  625. 366.47 s > error[E0425]: cannot find value `api` in this scope
  626. 366.47 s > --> crates/gammaloop-api/src/python.rs:3712:17
  627. 366.47 s > |
  628. 366.47 s > 3712 | run_card_toml = api.get_run_history()
  629. 366.47 s > | ^^^ not found in this scope
  630. 366.47 s >
  631. 366.47 s > error: aborting due to 2 previous errors
  632. 366.47 s >
  633. 366.47 s > For more information about this error, try `rustc --explain E0425`.
  634. 366.47 s > Couldn't compile the test.
  635. 366.47 s > ---- crates/gammaloop-api/src/python.rs - python::GammaLoopAPI::new_python (line 2834) stdout ----
  636. 366.47 s > error[E0425]: cannot find value `api` in this scope
  637. 366.47 s > --> crates/gammaloop-api/src/python.rs:2835:1
  638. 366.47 s > |
  639. 366.47 s > 2835 | api = GammaLoopAPI(state_folder="./state", read_only_state=True)
  640. 366.47 s > | ^^^
  641. 366.47 s > |
  642. 366.47 s > help: you might have meant to introduce a new binding
  643. 366.47 s > |
  644. 366.47 s > 2835 | let api = GammaLoopAPI(state_folder="./state", read_only_state=True)
  645. 366.47 s > | +++
  646. 366.47 s >
  647. 366.47 s > error[E0425]: cannot find value `state_folder` in this scope
  648. 366.47 s > --> crates/gammaloop-api/src/python.rs:2835:20
  649. 366.47 s > |
  650. 366.47 s > 2835 | api = GammaLoopAPI(state_folder="./state", read_only_state=True)
  651. 366.47 s > | ^^^^^^^^^^^^ not found in this scope
  652. 366.47 s >
  653. 366.47 s > error[E0425]: cannot find value `read_only_state` in this scope
  654. 366.47 s > --> crates/gammaloop-api/src/python.rs:2835:44
  655. 366.47 s > |
  656. 366.47 s > 2835 | api = GammaLoopAPI(state_folder="./state", read_only_state=True)
  657. 366.47 s > | ^^^^^^^^^^^^^^^ not found in this scope
  658. 366.47 s >
  659. 366.47 s > error[E0425]: cannot find value `True` in this scope
  660. 366.47 s > --> crates/gammaloop-api/src/python.rs:2835:60
  661. 366.47 s > |
  662. 366.47 s > 2835 | api = GammaLoopAPI(state_folder="./state", read_only_state=True)
  663. 366.47 s > | ^^^^ not found in this scope
  664. 366.47 s > |
  665. 366.47 s > help: you may want to use a bool value instead
  666. 366.47 s > |
  667. 366.47 s > 2835 - api = GammaLoopAPI(state_folder="./state", read_only_state=True)
  668. 366.47 s > 2835 + api = GammaLoopAPI(state_folder="./state", read_only_state=true)
  669. 366.47 s > |
  670. 366.47 s >
  671. 366.47 s > error[E0425]: cannot find function, tuple struct or tuple variant `GammaLoopAPI` in this scope
  672. 366.47 s > --> crates/gammaloop-api/src/python.rs:2835:7
  673. 366.47 s > |
  674. 366.47 s > 2835 | api = GammaLoopAPI(state_folder="./state", read_only_state=True)
  675. 366.47 s > | ^^^^^^^^^^^^ not found in this scope
  676. 366.47 s >
  677. 366.47 s > error: aborting due to 5 previous errors
  678. 366.47 s >
  679. 366.47 s > For more information about this error, try `rustc --explain E0425`.
  680. 366.47 s > Couldn't compile the test.
  681. 366.47 s > ---- crates/gammaloop-api/src/python.rs - python::atom_to_dots (line 157) stdout ----
  682. 366.47 s > error[E0425]: cannot find function `to_dots` in this scope
  683. 366.47 s > --> crates/gammaloop-api/src/python.rs:158:1
  684. 366.47 s > |
  685. 366.47 s > 158 | to_dots("p(mu) * q(mu)")
  686. 366.47 s > | ^^^^^^^ not found in this scope
  687. 366.47 s >
  688. 366.47 s > error: aborting due to 1 previous error
  689. 366.47 s >
  690. 366.47 s > For more information about this error, try `rustc --explain E0425`.
  691. 366.47 s > Couldn't compile the test.
  692. 366.47 s > ---- crates/gammaloop-api/src/python.rs - python::evaluate_graph_overall_factor (line 95) stdout ----
  693. 366.47 s > error[E0425]: cannot find function `evaluate_graph_overall_factor` in this scope
  694. 366.47 s > --> crates/gammaloop-api/src/python.rs:96:1
  695. 366.47 s > |
  696. 366.47 s > 96 | evaluate_graph_overall_factor(
  697. 366.47 s > | ^^^^^^^^^^^^^^^^^^^^^^^^^^^^^ not found in this scope
  698. 366.47 s >
  699. 366.47 s > error: aborting due to 1 previous error
  700. 366.47 s >
  701. 366.47 s > For more information about this error, try `rustc --explain E0425`.
  702. 366.47 s > Couldn't compile the test.
  703. 366.47 s > ---- crates/gammaloop-api/src/python.rs - python::atom_to_canonical_string (line 128) stdout ----
  704. 366.47 s > error[E0425]: cannot find function `atom_to_canonical_string` in this scope
  705. 366.47 s > --> crates/gammaloop-api/src/python.rs:129:1
  706. 366.47 s > |
  707. 366.47 s > 129 | atom_to_canonical_string("x + x")
  708. 366.47 s > | ^^^^^^^^^^^^^^^^^^^^^^^^ not found in this scope
  709. 366.47 s >
  710. 366.47 s > error: aborting due to 1 previous error
  711. 366.47 s >
  712. 366.47 s > For more information about this error, try `rustc --explain E0425`.
  713. 366.47 s > Couldn't compile the test.
  714. 366.47 s >
  715. 366.47 s > failures:
  716. 366.47 s > crates/gammaloop-api/src/python.rs - python::GammaLoopAPI::evaluate_sample (line 2967)
  717. 366.47 s > crates/gammaloop-api/src/python.rs - python::GammaLoopAPI::evaluate_samples (line 3108)
  718. 366.47 s > crates/gammaloop-api/src/python.rs - python::GammaLoopAPI::get_active_command_blocks (line 3760)
  719. 366.47 s > crates/gammaloop-api/src/python.rs - python::GammaLoopAPI::get_default_runtime_settings (line 3796)
  720. 366.47 s > crates/gammaloop-api/src/python.rs - python::GammaLoopAPI::get_global_settings (line 3739)
  721. 366.47 s > crates/gammaloop-api/src/python.rs - python::GammaLoopAPI::get_integrand_info (line 3585)
  722. 366.47 s > crates/gammaloop-api/src/python.rs - python::GammaLoopAPI::get_integrand_settings (line 3647)
  723. 366.47 s > crates/gammaloop-api/src/python.rs - python::GammaLoopAPI::get_run_history (line 3711)
  724. 366.47 s > crates/gammaloop-api/src/python.rs - python::GammaLoopAPI::new_python (line 2834)
  725. 366.47 s > crates/gammaloop-api/src/python.rs - python::GammaLoopAPI::run_command (line 3901)
  726. 366.47 s > crates/gammaloop-api/src/python.rs - python::PyHistogramAccumulator (line 871)
  727. 366.47 s > crates/gammaloop-api/src/python.rs - python::atom_to_canonical_string (line 128)
  728. 366.47 s > crates/gammaloop-api/src/python.rs - python::atom_to_dots (line 157)
  729. 366.47 s > crates/gammaloop-api/src/python.rs - python::evaluate_graph_overall_factor (line 95)
  730. 366.47 s >
  731. 366.47 s > test result: FAILED. 2 passed; 14 failed; 0 ignored; 0 measured; 0 filtered out; finished in 2.61s
  732. 366.47 s >
  733. 366.47 s > error: doctest failed, to rerun pass `-p gammaloop-api --doc`
  734. 366.47 s For full logs, run:
  735. 366.47 s nix log /nix/store/y47h4cnqp41a82sbhpiarsni9kgmcns6-gammaloop-workspace-doctest-0.1.0.drv
  736. 366.58 s [0 built (1 failed)]Run failed.