test packages.x86_64-linux.nix-ci-check-gammaloop-doctest
0.21 s
$ /nix/store/9ypz3flqsrl5xl495mm8h645gadjsxi1-coreutils-9.11/bin/timeout --kill-after=15s 7200s /nix/store/23zk8sgzamrbmj1fday15szf7f2279s8-nix-2.34.7/bin/nix --extra-experimental-features nix-command --extra-experimental-features flakes flake clone git+https://github.com/alphal00p/gammaloop --dest /tmp/nix-ci-worker/stable-pwd/repo/
0.26 s
Cloning into '/tmp/nix-ci-worker/stable-pwd/repo'...
1.37 s
remote: Enumerating objects: 63730, done.
1.91 s
remote: Counting objects: 0% (1/9084)
remote: Counting objects: 1% (91/9084)
remote: Counting objects: 2% (182/9084)
remote: Counting objects: 3% (273/9084)
remote: Counting objects: 4% (364/9084)
remote: Counting objects: 5% (455/9084)
remote: Counting objects: 6% (546/9084)
remote: Counting objects: 7% (636/9084)
remote: Counting objects: 8% (727/9084)
remote: Counting objects: 9% (818/9084)
remote: Counting objects: 10% (909/9084)
remote: Counting objects: 11% (1000/9084)
remote: Counting objects: 12% (1091/9084)
remote: Counting objects: 13% (1181/9084)
remote: Counting objects: 14% (1272/9084)
remote: Counting objects: 15% (1363/9084)
remote: Counting objects: 16% (1454/9084)
remote: Counting objects: 17% (1545/9084)
remote: Counting objects: 18% (1636/9084)
remote: Counting objects: 19% (1726/9084)
remote: Counting objects: 20% (1817/9084)
remote: Counting objects: 21% (1908/9084)
remote: Counting objects: 22% (1999/9084)
remote: Counting objects: 23% (2090/9084)
remote: Counting objects: 24% (2181/9084)
remote: Counting objects: 25% (2271/9084)
remote: Counting objects: 26% (2362/9084)
remote: Counting objects: 27% (2453/9084)
remote: Counting objects: 28% (2544/9084)
remote: Counting objects: 29% (2635/9084)
remote: Counting objects: 30% (2726/9084)
remote: Counting objects: 31% (2817/9084)
remote: Counting objects: 32% (2907/9084)
remote: Counting objects: 33% (2998/9084)
remote: Counting objects: 34% (3089/9084)
remote: Counting objects: 35% (3180/9084)
remote: Counting objects: 36% (3271/9084)
remote: Counting objects: 37% (3362/9084)
remote: Counting objects: 38% (3452/9084)
remote: Counting objects: 39% (3543/9084)
remote: Counting objects: 40% (3634/9084)
remote: Counting objects: 41% (3725/9084)
remote: Counting objects: 42% (3816/9084)
remote: Counting objects: 43% (3907/9084)
remote: Counting objects: 44% (3997/9084)
remote: Counting objects: 45% (4088/9084)
remote: Counting objects: 46% (4179/9084)
remote: Counting objects: 47% (4270/9084)
remote: Counting objects: 48% (4361/9084)
remote: Counting objects: 49% (4452/9084)
remote: Counting objects: 50% (4542/9084)
remote: Counting objects: 51% (4633/9084)
remote: Counting objects: 52% (4724/9084)
remote: Counting objects: 53% (4815/9084)
remote: Counting objects: 54% (4906/9084)
remote: Counting objects: 55% (4997/9084)
remote: Counting objects: 56% (5088/9084)
remote: Counting objects: 57% (5178/9084)
remote: Counting objects: 58% (5269/9084)
remote: Counting objects: 59% (5360/9084)
remote: Counting objects: 60% (5451/9084)
remote: Counting objects: 61% (5542/9084)
remote: Counting objects: 62% (5633/9084)
remote: Counting objects: 63% (5723/9084)
remote: Counting objects: 64% (5814/9084)
remote: Counting objects: 65% (5905/9084)
remote: Counting objects: 66% (5996/9084)
remote: Counting objects: 67% (6087/9084)
remote: Counting objects: 68% (6178/9084)
remote: Counting objects: 69% (6268/9084)
remote: Counting objects: 70% (6359/9084)
remote: Counting objects: 71% (6450/9084)
remote: Counting objects: 72% (6541/9084)
remote: Counting objects: 73% (6632/9084)
remote: Counting objects: 74% (6723/9084)
remote: Counting objects: 75% (6813/9084)
remote: Counting objects: 76% (6904/9084)
remote: Counting objects: 77% (6995/9084)
remote: Counting objects: 78% (7086/9084)
remote: Counting objects: 79% (7177/9084)
remote: Counting objects: 80% (7268/9084)
remote: Counting objects: 81% (7359/9084)
remote: Counting objects: 82% (7449/9084)
remote: Counting objects: 83% (7540/9084)
remote: Counting objects: 84% (7631/9084)
remote: Counting objects: 85% (7722/9084)
remote: Counting objects: 86% (7813/9084)
remote: Counting objects: 87% (7904/9084)
remote: Counting objects: 88% (7994/9084)
remote: Counting objects: 89% (8085/9084)
remote: Counting objects: 90% (8176/9084)
remote: Counting objects: 91% (8267/9084)
remote: Counting objects: 92% (8358/9084)
remote: Counting objects: 93% (8449/9084)
remote: Counting objects: 94% (8539/9084)
remote: Counting objects: 95% (8630/9084)
remote: Counting objects: 96% (8721/9084)
remote: Counting objects: 97% (8812/9084)
remote: Counting objects: 98% (8903/9084)
remote: Counting objects: 99% (8994/9084)
remote: Counting objects: 100% (9084/9084)
remote: Counting objects: 100% (9084/9084), done.
3.67 s
remote: Compressing objects: 0% (1/2049)
remote: Compressing objects: 1% (21/2049)
remote: Compressing objects: 2% (41/2049)
remote: Compressing objects: 3% (62/2049)
remote: Compressing objects: 4% (82/2049)
remote: Compressing objects: 5% (103/2049)
remote: Compressing objects: 6% (123/2049)
remote: Compressing objects: 7% (144/2049)
remote: Compressing objects: 8% (164/2049)
remote: Compressing objects: 9% (185/2049)
remote: Compressing objects: 10% (205/2049)
remote: Compressing objects: 11% (226/2049)
remote: Compressing objects: 12% (246/2049)
remote: Compressing objects: 13% (267/2049)
remote: Compressing objects: 14% (287/2049)
remote: Compressing objects: 15% (308/2049)
remote: Compressing objects: 16% (328/2049)
remote: Compressing objects: 17% (349/2049)
remote: Compressing objects: 18% (369/2049)
remote: Compressing objects: 19% (390/2049)
remote: Compressing objects: 20% (410/2049)
remote: Compressing objects: 20% (413/2049)
remote: Compressing objects: 21% (431/2049)
remote: Compressing objects: 22% (451/2049)
remote: Compressing objects: 23% (472/2049)
remote: Compressing objects: 24% (492/2049)
remote: Compressing objects: 25% (513/2049)
remote: Compressing objects: 26% (533/2049)
remote: Compressing objects: 27% (554/2049)
remote: Compressing objects: 28% (574/2049)
remote: Compressing objects: 29% (595/2049)
remote: Compressing objects: 30% (615/2049)
remote: Compressing objects: 30% (631/2049)
remote: Compressing objects: 31% (636/2049)
remote: Compressing objects: 32% (656/2049)
remote: Compressing objects: 33% (677/2049)
remote: Compressing objects: 34% (697/2049)
remote: Compressing objects: 35% (718/2049)
remote: Compressing objects: 36% (738/2049)
remote: Compressing objects: 37% (759/2049)
remote: Compressing objects: 38% (779/2049)
remote: Compressing objects: 39% (800/2049)
remote: Compressing objects: 40% (820/2049)
remote: Compressing objects: 41% (841/2049)
remote: Compressing objects: 42% (861/2049)
remote: Compressing objects: 43% (882/2049)
remote: Compressing objects: 44% (902/2049)
remote: Compressing objects: 45% (923/2049)
remote: Compressing objects: 46% (943/2049)
remote: Compressing objects: 47% (964/2049)
remote: Compressing objects: 48% (984/2049)
remote: Compressing objects: 49% (1005/2049)
remote: Compressing objects: 50% (1025/2049)
remote: Compressing objects: 51% (1045/2049)
remote: Compressing objects: 52% (1066/2049)
remote: Compressing objects: 53% (1086/2049)
remote: Compressing objects: 54% (1107/2049)
remote: Compressing objects: 55% (1127/2049)
remote: Compressing objects: 56% (1148/2049)
remote: Compressing objects: 57% (1168/2049)
remote: Compressing objects: 58% (1189/2049)
remote: Compressing objects: 59% (1209/2049)
remote: Compressing objects: 60% (1230/2049)
remote: Compressing objects: 61% (1250/2049)
remote: Compressing objects: 62% (1271/2049)
remote: Compressing objects: 63% (1291/2049)
remote: Compressing objects: 64% (1312/2049)
remote: Compressing objects: 65% (1332/2049)
remote: Compressing objects: 66% (1353/2049)
remote: Compressing objects: 67% (1373/2049)
remote: Compressing objects: 68% (1394/2049)
remote: Compressing objects: 69% (1414/2049)
remote: Compressing objects: 70% (1435/2049)
remote: Compressing objects: 71% (1455/2049)
remote: Compressing objects: 72% (1476/2049)
remote: Compressing objects: 73% (1496/2049)
remote: Compressing objects: 74% (1517/2049)
remote: Compressing objects: 75% (1537/2049)
remote: Compressing objects: 76% (1558/2049)
remote: Compressing objects: 77% (1578/2049)
remote: Compressing objects: 78% (1599/2049)
remote: Compressing objects: 79% (1619/2049)
remote: Compressing objects: 80% (1640/2049)
remote: Compressing objects: 81% (1660/2049)
remote: Compressing objects: 82% (1681/2049)
remote: Compressing objects: 83% (1701/2049)
remote: Compressing objects: 84% (1722/2049)
remote: Compressing objects: 85% (1742/2049)
remote: Compressing objects: 86% (1763/2049)
remote: Compressing objects: 87% (1783/2049)
remote: Compressing objects: 88% (1804/2049)
remote: Compressing objects: 89% (1824/2049)
remote: Compressing objects: 90% (1845/2049)
remote: Compressing objects: 91% (1865/2049)
remote: Compressing objects: 92% (1886/2049)
remote: Compressing objects: 93% (1906/2049)
remote: Compressing objects: 94% (1927/2049)
remote: Compressing objects: 95% (1947/2049)
remote: Compressing objects: 96% (1968/2049)
remote: Compressing objects: 97% (1988/2049)
remote: Compressing objects: 98% (2009/2049)
remote: Compressing objects: 99% (2029/2049)
remote: Compressing objects: 100% (2049/2049)
remote: Compressing objects: 100% (2049/2049), done.
7.60 s
Receiving objects: 0% (1/63730)
Receiving objects: 1% (638/63730)
Receiving objects: 2% (1275/63730)
Receiving objects: 3% (1912/63730)
Receiving objects: 4% (2550/63730)
Receiving objects: 5% (3187/63730)
Receiving objects: 6% (3824/63730)
Receiving objects: 7% (4462/63730)
Receiving objects: 8% (5099/63730)
Receiving objects: 9% (5736/63730)
Receiving objects: 10% (6373/63730), 6.67 MiB | 13.32 MiB/s
Receiving objects: 11% (7011/63730), 6.67 MiB | 13.32 MiB/s
Receiving objects: 12% (7648/63730), 6.67 MiB | 13.32 MiB/s
Receiving objects: 13% (8285/63730), 6.67 MiB | 13.32 MiB/s
Receiving objects: 14% (8923/63730), 6.67 MiB | 13.32 MiB/s
Receiving objects: 15% (9560/63730), 6.67 MiB | 13.32 MiB/s
Receiving objects: 16% (10197/63730), 6.67 MiB | 13.32 MiB/s
Receiving objects: 17% (10835/63730), 6.67 MiB | 13.32 MiB/s
Receiving objects: 18% (11472/63730), 6.67 MiB | 13.32 MiB/s
Receiving objects: 19% (12109/63730), 6.67 MiB | 13.32 MiB/s
Receiving objects: 20% (12746/63730), 6.67 MiB | 13.32 MiB/s
Receiving objects: 21% (13384/63730), 6.67 MiB | 13.32 MiB/s
Receiving objects: 22% (14021/63730), 6.67 MiB | 13.32 MiB/s
Receiving objects: 23% (14658/63730), 6.67 MiB | 13.32 MiB/s
Receiving objects: 24% (15296/63730), 6.67 MiB | 13.32 MiB/s
Receiving objects: 25% (15933/63730), 6.67 MiB | 13.32 MiB/s
Receiving objects: 26% (16570/63730), 6.67 MiB | 13.32 MiB/s
Receiving objects: 27% (17208/63730), 6.67 MiB | 13.32 MiB/s
Receiving objects: 28% (17845/63730), 6.67 MiB | 13.32 MiB/s
Receiving objects: 29% (18482/63730), 6.67 MiB | 13.32 MiB/s
Receiving objects: 30% (19119/63730), 6.67 MiB | 13.32 MiB/s
Receiving objects: 31% (19757/63730), 6.67 MiB | 13.32 MiB/s
Receiving objects: 32% (20394/63730), 6.67 MiB | 13.32 MiB/s
Receiving objects: 33% (21031/63730), 6.67 MiB | 13.32 MiB/s
Receiving objects: 34% (21669/63730), 6.67 MiB | 13.32 MiB/s
Receiving objects: 35% (22306/63730), 6.67 MiB | 13.32 MiB/s
Receiving objects: 36% (22943/63730), 6.67 MiB | 13.32 MiB/s
Receiving objects: 37% (23581/63730), 6.67 MiB | 13.32 MiB/s
Receiving objects: 38% (24218/63730), 6.67 MiB | 13.32 MiB/s
Receiving objects: 39% (24855/63730), 6.67 MiB | 13.32 MiB/s
Receiving objects: 40% (25492/63730), 6.67 MiB | 13.32 MiB/s
Receiving objects: 41% (26130/63730), 6.67 MiB | 13.32 MiB/s
Receiving objects: 42% (26767/63730), 6.67 MiB | 13.32 MiB/s
Receiving objects: 43% (27404/63730), 6.67 MiB | 13.32 MiB/s
Receiving objects: 44% (28042/63730), 6.67 MiB | 13.32 MiB/s
Receiving objects: 45% (28679/63730), 6.67 MiB | 13.32 MiB/s
Receiving objects: 46% (29316/63730), 6.67 MiB | 13.32 MiB/s
Receiving objects: 47% (29954/63730), 6.67 MiB | 13.32 MiB/s
Receiving objects: 48% (30591/63730), 6.67 MiB | 13.32 MiB/s
Receiving objects: 49% (31228/63730), 6.67 MiB | 13.32 MiB/s
Receiving objects: 50% (31865/63730), 6.67 MiB | 13.32 MiB/s
Receiving objects: 50% (31926/63730), 26.98 MiB | 26.98 MiB/s
Receiving objects: 51% (32503/63730), 26.98 MiB | 26.98 MiB/s
Receiving objects: 52% (33140/63730), 26.98 MiB | 26.98 MiB/s
Receiving objects: 53% (33777/63730), 26.98 MiB | 26.98 MiB/s
Receiving objects: 54% (34415/63730), 26.98 MiB | 26.98 MiB/s
Receiving objects: 55% (35052/63730), 26.98 MiB | 26.98 MiB/s
Receiving objects: 56% (35689/63730), 26.98 MiB | 26.98 MiB/s
Receiving objects: 57% (36327/63730), 26.98 MiB | 26.98 MiB/s
Receiving objects: 58% (36964/63730), 26.98 MiB | 26.98 MiB/s
Receiving objects: 59% (37601/63730), 26.98 MiB | 26.98 MiB/s
Receiving objects: 60% (38238/63730), 26.98 MiB | 26.98 MiB/s
Receiving objects: 61% (38876/63730), 48.31 MiB | 32.20 MiB/s
Receiving objects: 62% (39513/63730), 48.31 MiB | 32.20 MiB/s
Receiving objects: 63% (40150/63730), 48.31 MiB | 32.20 MiB/s
Receiving objects: 64% (40788/63730), 48.31 MiB | 32.20 MiB/s
Receiving objects: 65% (41425/63730), 48.31 MiB | 32.20 MiB/s
Receiving objects: 66% (42062/63730), 48.31 MiB | 32.20 MiB/s
Receiving objects: 67% (42700/63730), 48.31 MiB | 32.20 MiB/s
Receiving objects: 68% (43337/63730), 48.31 MiB | 32.20 MiB/s
Receiving objects: 68% (43589/63730), 48.31 MiB | 32.20 MiB/s
Receiving objects: 69% (43974/63730), 61.91 MiB | 30.92 MiB/s
Receiving objects: 70% (44611/63730), 61.91 MiB | 30.92 MiB/s
Receiving objects: 71% (45249/63730), 61.91 MiB | 30.92 MiB/s
Receiving objects: 72% (45886/63730), 61.91 MiB | 30.92 MiB/s
Receiving objects: 73% (46523/63730), 61.91 MiB | 30.92 MiB/s
Receiving objects: 74% (47161/63730), 61.91 MiB | 30.92 MiB/s
Receiving objects: 75% (47798/63730), 61.91 MiB | 30.92 MiB/s
Receiving objects: 76% (48435/63730), 61.91 MiB | 30.92 MiB/s
Receiving objects: 77% (49073/63730), 61.91 MiB | 30.92 MiB/s
Receiving objects: 78% (49710/63730), 71.70 MiB | 28.65 MiB/s
Receiving objects: 79% (50347/63730), 71.70 MiB | 28.65 MiB/s
Receiving objects: 80% (50984/63730), 71.70 MiB | 28.65 MiB/s
Receiving objects: 81% (51622/63730), 71.70 MiB | 28.65 MiB/s
Receiving objects: 82% (52259/63730), 71.70 MiB | 28.65 MiB/s
Receiving objects: 83% (52896/63730), 71.70 MiB | 28.65 MiB/s
Receiving objects: 84% (53534/63730), 71.70 MiB | 28.65 MiB/s
Receiving objects: 84% (53975/63730), 80.56 MiB | 26.83 MiB/s
Receiving objects: 85% (54171/63730), 80.56 MiB | 26.83 MiB/s
Receiving objects: 86% (54808/63730), 80.56 MiB | 26.83 MiB/s
Receiving objects: 87% (55446/63730), 80.56 MiB | 26.83 MiB/s
Receiving objects: 88% (56083/63730), 80.56 MiB | 26.83 MiB/s
Receiving objects: 89% (56720/63730), 80.56 MiB | 26.83 MiB/s
Receiving objects: 90% (57357/63730), 80.56 MiB | 26.83 MiB/s
Receiving objects: 91% (57995/63730), 80.56 MiB | 26.83 MiB/s
Receiving objects: 92% (58632/63730), 80.56 MiB | 26.83 MiB/s
Receiving objects: 93% (59269/63730), 80.56 MiB | 26.83 MiB/s
Receiving objects: 94% (59907/63730), 80.56 MiB | 26.83 MiB/s
Receiving objects: 95% (60544/63730), 80.56 MiB | 26.83 MiB/s
Receiving objects: 96% (61181/63730), 89.88 MiB | 25.66 MiB/s
Receiving objects: 97% (61819/63730), 89.88 MiB | 25.66 MiB/s
Receiving objects: 98% (62456/63730), 89.88 MiB | 25.66 MiB/s
Receiving objects: 99% (63093/63730), 89.88 MiB | 25.66 MiB/s
remote: Total 63730 (delta 7155), reused 7446 (delta 6504), pack-reused 54646 (from 3)
7.69 s
Receiving objects: 100% (63730/63730), 89.88 MiB | 25.66 MiB/s
Receiving objects: 100% (63730/63730), 97.15 MiB | 24.91 MiB/s, done.
10.37 s
Resolving deltas: 0% (0/44085)
Resolving deltas: 1% (441/44085)
Resolving deltas: 2% (882/44085)
Resolving deltas: 3% (1323/44085)
Resolving deltas: 4% (1764/44085)
Resolving deltas: 5% (2205/44085)
Resolving deltas: 6% (2646/44085)
Resolving deltas: 7% (3086/44085)
Resolving deltas: 8% (3528/44085)
Resolving deltas: 9% (3968/44085)
Resolving deltas: 10% (4410/44085)
Resolving deltas: 11% (4850/44085)
Resolving deltas: 12% (5291/44085)
Resolving deltas: 13% (5732/44085)
Resolving deltas: 14% (6172/44085)
Resolving deltas: 15% (6613/44085)
Resolving deltas: 16% (7054/44085)
Resolving deltas: 17% (7495/44085)
Resolving deltas: 18% (7936/44085)
Resolving deltas: 19% (8377/44085)
Resolving deltas: 20% (8817/44085)
Resolving deltas: 21% (9258/44085)
Resolving deltas: 22% (9701/44085)
Resolving deltas: 23% (10140/44085)
Resolving deltas: 24% (10581/44085)
Resolving deltas: 25% (11022/44085)
Resolving deltas: 26% (11463/44085)
Resolving deltas: 27% (11903/44085)
Resolving deltas: 28% (12344/44085)
Resolving deltas: 29% (12785/44085)
Resolving deltas: 30% (13226/44085)
Resolving deltas: 31% (13668/44085)
Resolving deltas: 32% (14108/44085)
Resolving deltas: 33% (14549/44085)
Resolving deltas: 34% (14989/44085)
Resolving deltas: 35% (15430/44085)
Resolving deltas: 36% (15871/44085)
Resolving deltas: 37% (16312/44085)
Resolving deltas: 38% (16754/44085)
Resolving deltas: 39% (17194/44085)
Resolving deltas: 40% (17634/44085)
Resolving deltas: 41% (18077/44085)
Resolving deltas: 42% (18516/44085)
Resolving deltas: 43% (18957/44085)
Resolving deltas: 44% (19398/44085)
Resolving deltas: 45% (19839/44085)
Resolving deltas: 46% (20280/44085)
Resolving deltas: 47% (20720/44085)
Resolving deltas: 48% (21161/44085)
Resolving deltas: 49% (21602/44085)
Resolving deltas: 50% (22043/44085)
Resolving deltas: 51% (22484/44085)
Resolving deltas: 52% (22925/44085)
Resolving deltas: 53% (23366/44085)
Resolving deltas: 54% (23806/44085)
Resolving deltas: 55% (24247/44085)
Resolving deltas: 56% (24688/44085)
Resolving deltas: 56% (24831/44085)
Resolving deltas: 57% (25129/44085)
Resolving deltas: 58% (25570/44085)
Resolving deltas: 59% (26011/44085)
Resolving deltas: 60% (26452/44085)
Resolving deltas: 61% (26893/44085)
Resolving deltas: 62% (27333/44085)
Resolving deltas: 63% (27774/44085)
Resolving deltas: 64% (28215/44085)
Resolving deltas: 65% (28656/44085)
Resolving deltas: 66% (29097/44085)
Resolving deltas: 67% (29537/44085)
Resolving deltas: 68% (29978/44085)
Resolving deltas: 69% (30419/44085)
Resolving deltas: 70% (30860/44085)
Resolving deltas: 71% (31301/44085)
Resolving deltas: 72% (31742/44085)
Resolving deltas: 73% (32183/44085)
Resolving deltas: 74% (32623/44085)
Resolving deltas: 74% (32915/44085)
Resolving deltas: 75% (33064/44085)
Resolving deltas: 76% (33505/44085)
Resolving deltas: 77% (33946/44085)
Resolving deltas: 78% (34387/44085)
Resolving deltas: 79% (34828/44085)
Resolving deltas: 80% (35268/44085)
Resolving deltas: 81% (35709/44085)
Resolving deltas: 82% (36150/44085)
Resolving deltas: 83% (36591/44085)
Resolving deltas: 84% (37032/44085)
Resolving deltas: 85% (37473/44085)
Resolving deltas: 86% (37914/44085)
Resolving deltas: 87% (38354/44085)
Resolving deltas: 88% (38795/44085)
Resolving deltas: 89% (39236/44085)
Resolving deltas: 90% (39677/44085)
Resolving deltas: 91% (40118/44085)
Resolving deltas: 92% (40559/44085)
Resolving deltas: 93% (41000/44085)
Resolving deltas: 94% (41440/44085)
Resolving deltas: 95% (41882/44085)
Resolving deltas: 96% (42322/44085)
Resolving deltas: 97% (42763/44085)
Resolving deltas: 98% (43204/44085)
Resolving deltas: 99% (43645/44085)
Resolving deltas: 100% (44085/44085)
Resolving deltas: 100% (44085/44085), done.
11.08 s
Fetching commit f8a0e490dd02bf2e71d7c8e59ff852384d143dfd for docs ...
11.09 s
$ /nix/store/bcnisk3ydfgv26v2gw3zlky24g00yww2-git-2.54.0/bin/git fetch origin f8a0e490dd02bf2e71d7c8e59ff852384d143dfd
11.77 s
From https://github.com/alphal00p/gammaloop
11.77 s
* branch f8a0e490dd02bf2e71d7c8e59ff852384d143dfd -> FETCH_HEAD
11.79 s
$ /nix/store/9ypz3flqsrl5xl495mm8h645gadjsxi1-coreutils-9.11/bin/timeout --kill-after=15s 7200s /nix/store/bcnisk3ydfgv26v2gw3zlky24g00yww2-git-2.54.0/bin/git -c advice.detachedHead=false checkout f8a0e490dd02bf2e71d7c8e59ff852384d143dfd
11.98 s
HEAD is now at f8a0e490 link tutorials to getting started guides
11.99 s
$ /nix/store/9ypz3flqsrl5xl495mm8h645gadjsxi1-coreutils-9.11/bin/timeout --kill-after=15s 7200s /nix/store/23zk8sgzamrbmj1fday15szf7f2279s8-nix-2.34.7/bin/nix --extra-experimental-features nix-command --extra-experimental-features flakes --log-format internal-json run .#packages.x86_64-linux.nix-ci-check-gammaloop-doctest --print-build-logs
14.89 s
15.12 s
Downloading cached nix-ci-check-gammaloop-doctest from https://cache.nix-ci.com
15.37 s
Downloaded cached nix-ci-check-gammaloop-doctest (1000 B) in 249ms
15.37 s
Progress: 0 of 1 built, 1 of 1 downloaded from cache
18.39 s
evaluating derivation 'g
copying '/nix/store/8kp7
evaluating derivation 'g
querying gammaloop-works
[0 /1 built, 0.0 KiB DL]
[1 /0 /1 built, 0.0 KiB DLgammaloop-workspace-doctest> Running phase: unpackPhase
18.40 s
gammaloop-workspace-doctest> unpacking source archive /nix/store/7l1apkyf91kpbqvav8ix1cl9vm7hljmf-source
18.72 s
gammaloop-workspace-doctest> source root is source
18.75 s
gammaloop-workspace-doctest> Running phase: patchPhase
18.76 s
gammaloop-workspace-doctest> Executing configureCargoCommonVars
18.76 s
gammaloop-workspace-doctest> decompressing cargo artifacts from /nix/store/8rkh7d3hq722l839568nhnwihnsx041a-gammaloop-workspace-deps-deps-0.1.0/target.tar.zst to target
20.50 s
gammaloop-workspace-doctest> Running phase: updateAutotoolsGnuConfigScriptsPhase
20.54 s
gammaloop-workspace-doctest> Running phase: configurePhase
20.54 s
gammaloop-workspace-doctest> will append /build/source/.cargo-home/config.toml with contents of /nix/store/xdy1vvhll2bijdplvl9fcc2b9plkxhaa-vendor-cargo-deps/config.toml
20.54 s
gammaloop-workspace-doctest> default configurePhase, nothing to do
20.54 s
gammaloop-workspace-doctest> Running phase: buildPhase
20.55 s
gammaloop-workspace-doctest> +++ command cargo --version
20.55 s
gammaloop-workspace-doctest> cargo 1.97.0 (c980f4866 2026-06-30)
20.58 s
gammaloop-workspace-doctest> +++ command cargo test --profile ci-optim --doc --locked --workspace --features gammaloop-api/cli,gammaloop-tracing-filter/clap,gammaloop-tracing-filter/symbolica,idenso/bincode,idenso/reference-cases,linnet/bincode,linnet/drawing,linnet/nodestore-vec,linnet/rkyv,linnet/serde,linnet/symbolica,spenso-macros/shadowing,spenso/shadowing,symbolica/tracing_max_level_info
20.98 s
gammaloop-workspace-doctest> Compiling target-lexicon v0.13.5
20.99 s
gammaloop-workspace-doctest> Compiling symbolica v2.2.0 (https://github.com/symbolica-dev/symbolica?branch=dev#0441bd7a)
20.99 s
gammaloop-workspace-doctest> Compiling maplit v1.0.2
21.00 s
gammaloop-workspace-doctest> Compiling gammaloop-tracing-filter-macros v0.1.0 (/build/source/crates/gammaloop-tracing-filter-macros)
21.00 s
gammaloop-workspace-doctest> Compiling vakint v0.1.2 (/build/source/crates/vakint)
21.01 s
gammaloop-workspace-doctest> Compiling gammalooprs v0.3.4 (/build/source/crates/gammalooprs)
21.02 s
gammaloop-workspace-doctest> Compiling alphal00p-docs-macros v0.1.0 (/build/source/crates/alphal00p-docs-macros)
21.02 s
gammaloop-workspace-doctest> Compiling alphal00p-docs-schema v0.1.0 (/build/source/crates/alphal00p-docs-schema)
21.02 s
gammaloop-workspace-doctest> Compiling rustc_version v0.4.1
21.03 s
gammaloop-workspace-doctest> Compiling bincode v1.3.3
21.03 s
gammaloop-workspace-doctest> Compiling iai-callgrind-runner v0.14.2
21.03 s
gammaloop-workspace-doctest> Compiling gungraun-runner v0.18.2
21.03 s
gammaloop-workspace-doctest> Compiling target-triple v1.0.1
21.03 s
gammaloop-workspace-doctest> Compiling gammaloop-integration-tests v0.1.0 (/build/source/tests)
21.03 s
gammaloop-workspace-doctest> Compiling test-log-core v0.2.20
21.29 s
gammaloop-workspace-doctest> Compiling wait-timeout v0.2.1
21.34 s
gammaloop-workspace-doctest> Compiling iai-callgrind v0.14.2
21.38 s
gammaloop-workspace-doctest> Compiling quick-error v1.2.3
21.43 s
gammaloop-workspace-doctest> Compiling bit-vec v0.8.0
21.64 s
gammaloop-workspace-doctest> Compiling bit-set v0.8.0
21.66 s
gammaloop-workspace-doctest> Compiling rusty-fork v0.3.1
21.73 s
gammaloop-workspace-doctest> Compiling iai-callgrind-macros v0.5.1
21.74 s
gammaloop-workspace-doctest> Compiling rand_xorshift v0.4.0
21.75 s
gammaloop-workspace-doctest> Compiling console v0.15.11
21.86 s
gammaloop-workspace-doctest> Compiling glob v0.3.4
21.91 s
gammaloop-workspace-doctest> Compiling unarray v0.1.4
22.02 s
gammaloop-workspace-doctest> Compiling base64 v0.21.7
22.03 s
gammaloop-workspace-doctest> Compiling termcolor v1.4.1
22.05 s
gammaloop-workspace-doctest> Compiling gungraun-macros v0.8.0
22.47 s
gammaloop-workspace-doctest> Compiling ron v0.8.1
22.55 s
gammaloop-workspace-doctest> Compiling similar-asserts v1.7.0
22.79 s
gammaloop-workspace-doctest> Compiling trybuild v1.0.120
22.90 s
gammaloop-workspace-doctest> Compiling proptest v1.11.0
22.99 s
gammaloop-workspace-doctest> Compiling alphal00p-docs-catalogs v0.1.0 (/build/source/crates/alphal00p-docs-catalogs)
23.30 s
gammaloop-workspace-doctest> Compiling pyo3-build-config v0.28.3
23.37 s
gammaloop-workspace-doctest> Compiling alphal00p-docs-builder v0.1.0 (/build/source/crates/alphal00p-docs-builder)
23.46 s
gammaloop-workspace-doctest> Compiling kurvst v0.1.0 (/build/source/crates/kurvst)
24.30 s
gammaloop-workspace-doctest> Compiling test-log-macros v0.2.20
26.94 s
gammaloop-workspace-doctest> Compiling alphal00p-docs-examples v0.1.0 (/build/source/crates/alphal00p-docs-examples)
28.48 s
gammaloop-workspace-doctest> Compiling test-log v0.2.20
30.59 s
gammaloop-workspace-doctest> Compiling pyo3-ffi v0.28.3
31.67 s
gammaloop-workspace-doctest> Compiling pyo3-macros-backend v0.28.3
31.79 s
gammaloop-workspace-doctest> Compiling pyo3 v0.28.3
32.18 s
gammaloop-workspace-doctest> Compiling numpy v0.28.0
32.38 s
gammaloop-workspace-doctest> Compiling gammaloop-api v0.1.0 (/build/source/crates/gammaloop-api)
32.39 s
gammaloop-workspace-doctest> Compiling gungraun v0.18.2
39.72 s
gammaloop-workspace-doctest> Compiling pyo3-macros v0.28.3
47.95 s
gammaloop-workspace-doctest> Compiling pyo3-stub-gen v0.17.2
48.79 s
gammaloop-workspace-doctest> Compiling numerica v2.2.0 (https://github.com/symbolica-dev/symbolica?branch=dev#0441bd7a)
52.71 s
gammaloop-workspace-doctest> Compiling graphica v2.1.0 (https://github.com/symbolica-dev/symbolica?branch=dev#0441bd7a)
56.40 s
gammaloop-workspace-doctest> Compiling symbolica-utils v0.1.0 (/build/source/crates/symbolica-utils)
237.71 s
gammaloop-workspace-doctest> Compiling gammaloop-workspace-hack v0.1.0 (/build/source/crates/gammaloop-workspace-hack)
237.76 s
gammaloop-workspace-doctest> Compiling spenso-macros v0.3.2 (/build/source/crates/spenso-macros)
237.88 s
gammaloop-workspace-doctest> Compiling linnet v0.17.0 (/build/source/crates/linnet)
241.03 s
gammaloop-workspace-doctest> Compiling spenso v0.6.0 (/build/source/crates/spenso)
249.03 s
gammaloop-workspace-doctest> Compiling idenso v0.3.0 (/build/source/crates/idenso)
249.09 s
gammaloop-workspace-doctest> Compiling gammaloop-tracing-filter v0.1.0 (/build/source/crates/gammaloop-tracing-filter)
252.99 s
gammaloop-workspace-doctest> Compiling spenso-hep-lib v0.1.7 (/build/source/crates/spenso-hep-lib)
253.22 s
gammaloop-workspace-doctest> Compiling spynso3 v0.1.2 (/build/source/crates/spynso3)
294.23 s
gammaloop-workspace-doctest> Compiling linnest v0.1.0 (/build/source/crates/linnest)
294.28 s
gammaloop-workspace-doctest> Compiling linnet-py v0.1.0 (/build/source/crates/linnet-py)
401.95 s
gammaloop-workspace-doctest> Finished `ci-optim` profile [optimized] target(s) in 6m 21s
402.06 s
gammaloop-workspace-doctest> warning : the following packages contain code that will be rejected by a future version of Rust: proc-macro-error2 v2.0.1
402.06 s
gammaloop-workspace-doctest> note : to see what the problems were, use the option `--future-incompat-report`, or run `cargo report future-incompatibilities --id 1`
402.09 s
gammaloop-workspace-doctest> Doc-tests alphal00p_docs_builder
402.23 s
gammaloop-workspace-doctest>
402.23 s
gammaloop-workspace-doctest> running 0 tests
402.23 s
gammaloop-workspace-doctest>
402.23 s
gammaloop-workspace-doctest> test result: ok. 0 passed; 0 failed; 0 ignored; 0 measured; 0 filtered out; finished in 0.00s
402.23 s
gammaloop-workspace-doctest>
402.24 s
gammaloop-workspace-doctest> Doc-tests alphal00p_docs_catalogs
403.33 s
gammaloop-workspace-doctest>
403.33 s
gammaloop-workspace-doctest> running 0 tests
403.33 s
gammaloop-workspace-doctest>
403.33 s
gammaloop-workspace-doctest> test result: ok. 0 passed; 0 failed; 0 ignored; 0 measured; 0 filtered out; finished in 0.00s
403.33 s
gammaloop-workspace-doctest>
403.33 s
gammaloop-workspace-doctest> Doc-tests alphal00p_docs_examples
403.35 s
gammaloop-workspace-doctest>
403.35 s
gammaloop-workspace-doctest> running 0 tests
403.35 s
gammaloop-workspace-doctest>
403.35 s
gammaloop-workspace-doctest> test result: ok. 0 passed; 0 failed; 0 ignored; 0 measured; 0 filtered out; finished in 0.00s
403.35 s
gammaloop-workspace-doctest>
403.35 s
gammaloop-workspace-doctest> Doc-tests alphal00p_docs
403.40 s
gammaloop-workspace-doctest>
403.40 s
gammaloop-workspace-doctest> running 0 tests
403.40 s
gammaloop-workspace-doctest>
403.40 s
gammaloop-workspace-doctest> test result: ok. 0 passed; 0 failed; 0 ignored; 0 measured; 0 filtered out; finished in 0.00s
403.40 s
gammaloop-workspace-doctest>
403.40 s
gammaloop-workspace-doctest> Doc-tests alphal00p_docs_schema
403.47 s
gammaloop-workspace-doctest>
403.47 s
gammaloop-workspace-doctest> running 0 tests
403.47 s
gammaloop-workspace-doctest>
403.47 s
gammaloop-workspace-doctest> test result: ok. 0 passed; 0 failed; 0 ignored; 0 measured; 0 filtered out; finished in 0.00s
403.47 s
gammaloop-workspace-doctest>
403.47 s
gammaloop-workspace-doctest> Doc-tests gammaloop_api
404.34 s
gammaloop-workspace-doctest>
404.34 s
gammaloop-workspace-doctest> running 16 tests
404.36 s
gammaloop-workspace-doctest> test crates/gammaloop-api/src/python.rs - python::GammaLoopAPI::get_integrand_settings (line 3647) ... FAILED
404.36 s
gammaloop-workspace-doctest> test crates/gammaloop-api/src/python.rs - python::GammaLoopAPI::get_default_runtime_settings (line 3796) ... FAILED
404.36 s
gammaloop-workspace-doctest> test crates/gammaloop-api/src/python.rs - python::GammaLoopAPI::evaluate_sample (line 2967) ... FAILED
404.36 s
gammaloop-workspace-doctest> test crates/gammaloop-api/src/python.rs - python::GammaLoopAPI::get_integrand_info (line 3585) ... FAILED
404.36 s
gammaloop-workspace-doctest> test crates/gammaloop-api/src/python.rs - python::GammaLoopAPI::evaluate_samples (line 3108) ... FAILED
404.36 s
gammaloop-workspace-doctest> test crates/gammaloop-api/src/python.rs - python::GammaLoopAPI::get_active_command_blocks (line 3760) ... FAILED
404.36 s
gammaloop-workspace-doctest> test crates/gammaloop-api/src/python.rs - python::PyHistogramAccumulator (line 871) ... FAILED
404.43 s
gammaloop-workspace-doctest> test crates/gammaloop-api/src/lib.rs - (line 18) - compile ... ok
404.45 s
gammaloop-workspace-doctest> test crates/gammaloop-api/src/python.rs - python::GammaLoopAPI::run_command (line 3901) ... FAILED
404.46 s
gammaloop-workspace-doctest> test crates/gammaloop-api/src/python.rs - python::GammaLoopAPI::get_global_settings (line 3739) ... FAILED
404.46 s
gammaloop-workspace-doctest> test crates/gammaloop-api/src/python.rs - python::GammaLoopAPI::get_run_history (line 3711) ... FAILED
404.47 s
gammaloop-workspace-doctest> test crates/gammaloop-api/src/python.rs - python::GammaLoopAPI::new_python (line 2834) ... FAILED
404.47 s
gammaloop-workspace-doctest> test crates/gammaloop-api/src/python.rs - python::atom_to_dots (line 157) ... FAILED
404.47 s
gammaloop-workspace-doctest> test crates/gammaloop-api/src/python.rs - python::evaluate_graph_overall_factor (line 95) ... FAILED
404.47 s
gammaloop-workspace-doctest> test crates/gammaloop-api/src/python.rs - python::atom_to_canonical_string (line 128) ... FAILED
406.90 s
gammaloop-workspace-doctest> test crates/gammaloop-api/src/commands/evaluate_samples.rs - commands::evaluate_samples::EvaluateSamples (line 50) ... ok
406.90 s
gammaloop-workspace-doctest>
406.90 s
gammaloop-workspace-doctest> failures:
406.90 s
gammaloop-workspace-doctest>
406.90 s
gammaloop-workspace-doctest> ---- crates/gammaloop-api/src/python.rs - python::GammaLoopAPI::get_integrand_settings (line 3647) stdout ----
406.90 s
gammaloop-workspace-doctest> error: expected one of `!` or `::`, found `=`
406.90 s
gammaloop-workspace-doctest> --> crates/gammaloop-api/src/python.rs:3648:10
406.90 s
gammaloop-workspace-doctest> |
406.90 s
gammaloop-workspace-doctest> 3648 | settings = api.get_integrand_settings(process_id=0)
406.90 s
gammaloop-workspace-doctest> | ^ expected one of `!` or `::`
406.90 s
gammaloop-workspace-doctest>
406.90 s
gammaloop-workspace-doctest> error: aborting due to 1 previous error
406.90 s
gammaloop-workspace-doctest>
406.90 s
gammaloop-workspace-doctest> Couldn't compile the test.
406.90 s
gammaloop-workspace-doctest> ---- crates/gammaloop-api/src/python.rs - python::GammaLoopAPI::get_default_runtime_settings (line 3796) stdout ----
406.90 s
gammaloop-workspace-doctest> error: expected one of `!` or `::`, found `=`
406.90 s
gammaloop-workspace-doctest> --> crates/gammaloop-api/src/python.rs:3797:9
406.90 s
gammaloop-workspace-doctest> |
406.90 s
gammaloop-workspace-doctest> 3797 | runtime = api.get_default_runtime_settings()
406.90 s
gammaloop-workspace-doctest> | ^ expected one of `!` or `::`
406.90 s
gammaloop-workspace-doctest>
406.90 s
gammaloop-workspace-doctest> error: aborting due to 1 previous error
406.90 s
gammaloop-workspace-doctest>
406.90 s
gammaloop-workspace-doctest> Couldn't compile the test.
406.90 s
gammaloop-workspace-doctest> ---- crates/gammaloop-api/src/python.rs - python::GammaLoopAPI::evaluate_sample (line 2967) stdout ----
406.90 s
gammaloop-workspace-doctest> error: expected one of `!` or `::`, found `pathlib`
406.90 s
gammaloop-workspace-doctest> --> crates/gammaloop-api/src/python.rs:2968:6
406.90 s
gammaloop-workspace-doctest> |
406.90 s
gammaloop-workspace-doctest> 2968 | from pathlib import Path
406.90 s
gammaloop-workspace-doctest> | ^^^^^^^ expected one of `!` or `::`
406.90 s
gammaloop-workspace-doctest>
406.90 s
gammaloop-workspace-doctest> error: aborting due to 1 previous error
406.90 s
gammaloop-workspace-doctest>
406.90 s
gammaloop-workspace-doctest> Couldn't compile the test.
406.90 s
gammaloop-workspace-doctest> ---- crates/gammaloop-api/src/python.rs - python::GammaLoopAPI::get_integrand_info (line 3585) stdout ----
406.90 s
gammaloop-workspace-doctest> error: expected one of `!` or `::`, found `pathlib`
406.90 s
gammaloop-workspace-doctest> --> crates/gammaloop-api/src/python.rs:3586:6
406.90 s
gammaloop-workspace-doctest> |
406.90 s
gammaloop-workspace-doctest> 3586 | from pathlib import Path
406.90 s
gammaloop-workspace-doctest> | ^^^^^^^ expected one of `!` or `::`
406.90 s
gammaloop-workspace-doctest>
406.90 s
gammaloop-workspace-doctest> error: aborting due to 1 previous error
406.90 s
gammaloop-workspace-doctest>
406.90 s
gammaloop-workspace-doctest> Couldn't compile the test.
406.90 s
gammaloop-workspace-doctest> ---- crates/gammaloop-api/src/python.rs - python::GammaLoopAPI::evaluate_samples (line 3108) stdout ----
406.90 s
gammaloop-workspace-doctest> error: expected one of `!` or `::`, found `pathlib`
406.90 s
gammaloop-workspace-doctest> --> crates/gammaloop-api/src/python.rs:3109:6
406.90 s
gammaloop-workspace-doctest> |
406.90 s
gammaloop-workspace-doctest> 3109 | from pathlib import Path
406.90 s
gammaloop-workspace-doctest> | ^^^^^^^ expected one of `!` or `::`
406.90 s
gammaloop-workspace-doctest>
406.90 s
gammaloop-workspace-doctest> error: aborting due to 1 previous error
406.90 s
gammaloop-workspace-doctest>
406.90 s
gammaloop-workspace-doctest> Couldn't compile the test.
406.90 s
gammaloop-workspace-doctest> ---- crates/gammaloop-api/src/python.rs - python::GammaLoopAPI::get_active_command_blocks (line 3760) stdout ----
406.90 s
gammaloop-workspace-doctest> error: expected item, found keyword `for`
406.90 s
gammaloop-workspace-doctest> --> crates/gammaloop-api/src/python.rs:3761:1
406.90 s
gammaloop-workspace-doctest> |
406.90 s
gammaloop-workspace-doctest> 3761 | for name, commands in api.get_active_command_blocks().items():
406.90 s
gammaloop-workspace-doctest> | ^^^ expected item
406.90 s
gammaloop-workspace-doctest> |
406.90 s
gammaloop-workspace-doctest> = note: for a full list of items that can appear in modules, see <https://doc.rust-lang.org/reference/items.html>
406.90 s
gammaloop-workspace-doctest>
406.90 s
gammaloop-workspace-doctest> error: aborting due to 1 previous error
406.90 s
gammaloop-workspace-doctest>
406.90 s
gammaloop-workspace-doctest> Couldn't compile the test.
406.90 s
gammaloop-workspace-doctest> ---- crates/gammaloop-api/src/python.rs - python::PyHistogramAccumulator (line 871) stdout ----
406.90 s
gammaloop-workspace-doctest> error: expected one of `!` or `::`, found `gammaloop`
406.90 s
gammaloop-workspace-doctest> --> crates/gammaloop-api/src/python.rs:872:6
406.90 s
gammaloop-workspace-doctest> |
406.90 s
gammaloop-workspace-doctest> 872 | from gammaloop import HistogramAccumulator
406.90 s
gammaloop-workspace-doctest> | ^^^^^^^^^ expected one of `!` or `::`
406.90 s
gammaloop-workspace-doctest>
406.90 s
gammaloop-workspace-doctest> error: aborting due to 1 previous error
406.90 s
gammaloop-workspace-doctest>
406.90 s
gammaloop-workspace-doctest> Couldn't compile the test.
406.90 s
gammaloop-workspace-doctest> ---- crates/gammaloop-api/src/python.rs - python::GammaLoopAPI::run_command (line 3901) stdout ----
406.90 s
gammaloop-workspace-doctest> error[E0425] : cannot find value `api` in this scope
406.90 s
gammaloop-workspace-doctest> --> crates/gammaloop-api/src/python.rs:3902:1
406.90 s
gammaloop-workspace-doctest> |
406.90 s
gammaloop-workspace-doctest> 3902 | api.run("display processes")
406.90 s
gammaloop-workspace-doctest> | ^^^ not found in this scope
406.90 s
gammaloop-workspace-doctest>
406.90 s
gammaloop-workspace-doctest> error : aborting due to 1 previous error
406.90 s
gammaloop-workspace-doctest>
406.90 s
gammaloop-workspace-doctest> For more information about this error, try `rustc --explain E0425`.
406.90 s
gammaloop-workspace-doctest> Couldn't compile the test.
406.90 s
gammaloop-workspace-doctest> ---- crates/gammaloop-api/src/python.rs - python::GammaLoopAPI::get_global_settings (line 3739) stdout ----
406.90 s
gammaloop-workspace-doctest> error[E0425] : cannot find value `settings_toml` in this scope
406.90 s
gammaloop-workspace-doctest> --> crates/gammaloop-api/src/python.rs:3740:1
406.90 s
gammaloop-workspace-doctest> |
406.90 s
gammaloop-workspace-doctest> 3740 | settings_toml = api.get_global_settings()
406.90 s
gammaloop-workspace-doctest> | ^^^^^^^^^^^^^
406.90 s
gammaloop-workspace-doctest> |
406.90 s
gammaloop-workspace-doctest> help : you might have meant to introduce a new binding
406.90 s
gammaloop-workspace-doctest> |
406.90 s
gammaloop-workspace-doctest> 3740 | let settings_toml = api.get_global_settings()
406.90 s
gammaloop-workspace-doctest> | +++
406.90 s
gammaloop-workspace-doctest>
406.90 s
gammaloop-workspace-doctest> error[E0425] : cannot find value `api` in this scope
406.90 s
gammaloop-workspace-doctest> --> crates/gammaloop-api/src/python.rs:3740:17
406.90 s
gammaloop-workspace-doctest> |
406.90 s
gammaloop-workspace-doctest> 3740 | settings_toml = api.get_global_settings()
406.90 s
gammaloop-workspace-doctest> | ^^^ not found in this scope
406.90 s
gammaloop-workspace-doctest>
406.90 s
gammaloop-workspace-doctest> error : aborting due to 2 previous errors
406.90 s
gammaloop-workspace-doctest>
406.90 s
gammaloop-workspace-doctest> For more information about this error, try `rustc --explain E0425`.
406.90 s
gammaloop-workspace-doctest> Couldn't compile the test.
406.90 s
gammaloop-workspace-doctest> ---- crates/gammaloop-api/src/python.rs - python::GammaLoopAPI::get_run_history (line 3711) stdout ----
406.90 s
gammaloop-workspace-doctest> error[E0425] : cannot find value `run_card_toml` in this scope
406.90 s
gammaloop-workspace-doctest> --> crates/gammaloop-api/src/python.rs:3712:1
406.90 s
gammaloop-workspace-doctest> |
406.90 s
gammaloop-workspace-doctest> 3712 | run_card_toml = api.get_run_history()
406.90 s
gammaloop-workspace-doctest> | ^^^^^^^^^^^^^
406.90 s
gammaloop-workspace-doctest> |
406.90 s
gammaloop-workspace-doctest> help : you might have meant to introduce a new binding
406.90 s
gammaloop-workspace-doctest> |
406.90 s
gammaloop-workspace-doctest> 3712 | let run_card_toml = api.get_run_history()
406.90 s
gammaloop-workspace-doctest> | +++
406.90 s
gammaloop-workspace-doctest>
406.90 s
gammaloop-workspace-doctest> error[E0425] : cannot find value `api` in this scope
406.90 s
gammaloop-workspace-doctest> --> crates/gammaloop-api/src/python.rs:3712:17
406.90 s
gammaloop-workspace-doctest> |
406.90 s
gammaloop-workspace-doctest> 3712 | run_card_toml = api.get_run_history()
406.90 s
gammaloop-workspace-doctest> | ^^^ not found in this scope
406.90 s
gammaloop-workspace-doctest>
406.90 s
gammaloop-workspace-doctest> error : aborting due to 2 previous errors
406.90 s
gammaloop-workspace-doctest>
406.90 s
gammaloop-workspace-doctest> For more information about this error, try `rustc --explain E0425`.
406.90 s
gammaloop-workspace-doctest> Couldn't compile the test.
406.90 s
gammaloop-workspace-doctest> ---- crates/gammaloop-api/src/python.rs - python::GammaLoopAPI::new_python (line 2834) stdout ----
406.90 s
gammaloop-workspace-doctest> error[E0425] : cannot find value `api` in this scope
406.90 s
gammaloop-workspace-doctest> --> crates/gammaloop-api/src/python.rs:2835:1
406.90 s
gammaloop-workspace-doctest> |
406.90 s
gammaloop-workspace-doctest> 2835 | api = GammaLoopAPI(state_folder="./state", read_only_state=True)
406.90 s
gammaloop-workspace-doctest> | ^^^
406.90 s
gammaloop-workspace-doctest> |
406.90 s
gammaloop-workspace-doctest> help : you might have meant to introduce a new binding
406.90 s
gammaloop-workspace-doctest> |
406.90 s
gammaloop-workspace-doctest> 2835 | let api = GammaLoopAPI(state_folder="./state", read_only_state=True)
406.90 s
gammaloop-workspace-doctest> | +++
406.90 s
gammaloop-workspace-doctest>
406.90 s
gammaloop-workspace-doctest> error[E0425] : cannot find value `state_folder` in this scope
406.90 s
gammaloop-workspace-doctest> --> crates/gammaloop-api/src/python.rs:2835:20
406.90 s
gammaloop-workspace-doctest> |
406.90 s
gammaloop-workspace-doctest> 2835 | api = GammaLoopAPI(state_folder="./state", read_only_state=True)
406.90 s
gammaloop-workspace-doctest> | ^^^^^^^^^^^^ not found in this scope
406.90 s
gammaloop-workspace-doctest>
406.90 s
gammaloop-workspace-doctest> error[E0425] : cannot find value `read_only_state` in this scope
406.90 s
gammaloop-workspace-doctest> --> crates/gammaloop-api/src/python.rs:2835:44
406.90 s
gammaloop-workspace-doctest> |
406.90 s
gammaloop-workspace-doctest> 2835 | api = GammaLoopAPI(state_folder="./state", read_only_state=True)
406.90 s
gammaloop-workspace-doctest> | ^^^^^^^^^^^^^^^ not found in this scope
406.90 s
gammaloop-workspace-doctest>
406.90 s
gammaloop-workspace-doctest> error[E0425] : cannot find value `True` in this scope
406.90 s
gammaloop-workspace-doctest> --> crates/gammaloop-api/src/python.rs:2835:60
406.90 s
gammaloop-workspace-doctest> |
406.90 s
gammaloop-workspace-doctest> 2835 | api = GammaLoopAPI(state_folder="./state", read_only_state=True)
406.90 s
gammaloop-workspace-doctest> | ^^^^ not found in this scope
406.90 s
gammaloop-workspace-doctest> |
406.90 s
gammaloop-workspace-doctest> help : you may want to use a bool value instead
406.90 s
gammaloop-workspace-doctest> |
406.90 s
gammaloop-workspace-doctest> 2835 - api = GammaLoopAPI(state_folder="./state", read_only_state=True )
406.90 s
gammaloop-workspace-doctest> 2835 + api = GammaLoopAPI(state_folder="./state", read_only_state=true )
406.90 s
gammaloop-workspace-doctest> |
406.90 s
gammaloop-workspace-doctest>
406.90 s
gammaloop-workspace-doctest> error[E0425] : cannot find function, tuple struct or tuple variant `GammaLoopAPI` in this scope
406.90 s
gammaloop-workspace-doctest> --> crates/gammaloop-api/src/python.rs:2835:7
406.90 s
gammaloop-workspace-doctest> |
406.90 s
gammaloop-workspace-doctest> 2835 | api = GammaLoopAPI(state_folder="./state", read_only_state=True)
406.90 s
gammaloop-workspace-doctest> | ^^^^^^^^^^^^ not found in this scope
406.90 s
gammaloop-workspace-doctest>
406.90 s
gammaloop-workspace-doctest> error : aborting due to 5 previous errors
406.90 s
gammaloop-workspace-doctest>
406.90 s
gammaloop-workspace-doctest> For more information about this error, try `rustc --explain E0425`.
406.90 s
gammaloop-workspace-doctest> Couldn't compile the test.
406.90 s
gammaloop-workspace-doctest> ---- crates/gammaloop-api/src/python.rs - python::atom_to_dots (line 157) stdout ----
406.90 s
gammaloop-workspace-doctest> error[E0425] : cannot find function `to_dots` in this scope
406.90 s
gammaloop-workspace-doctest> --> crates/gammaloop-api/src/python.rs:158:1
406.90 s
gammaloop-workspace-doctest> |
406.90 s
gammaloop-workspace-doctest> 158 | to_dots("p(mu) * q(mu)")
406.90 s
gammaloop-workspace-doctest> | ^^^^^^^ not found in this scope
406.90 s
gammaloop-workspace-doctest>
406.90 s
gammaloop-workspace-doctest> error : aborting due to 1 previous error
406.90 s
gammaloop-workspace-doctest>
406.90 s
gammaloop-workspace-doctest> For more information about this error, try `rustc --explain E0425`.
406.90 s
gammaloop-workspace-doctest> Couldn't compile the test.
406.90 s
gammaloop-workspace-doctest> ---- crates/gammaloop-api/src/python.rs - python::evaluate_graph_overall_factor (line 95) stdout ----
406.90 s
gammaloop-workspace-doctest> error[E0425] : cannot find function `evaluate_graph_overall_factor` in this scope
406.90 s
gammaloop-workspace-doctest> --> crates/gammaloop-api/src/python.rs:96:1
406.90 s
gammaloop-workspace-doctest> |
406.90 s
gammaloop-workspace-doctest> 96 | evaluate_graph_overall_factor(
406.90 s
gammaloop-workspace-doctest> | ^^^^^^^^^^^^^^^^^^^^^^^^^^^^^ not found in this scope
406.90 s
gammaloop-workspace-doctest>
406.90 s
gammaloop-workspace-doctest> error : aborting due to 1 previous error
406.90 s
gammaloop-workspace-doctest>
406.90 s
gammaloop-workspace-doctest> For more information about this error, try `rustc --explain E0425`.
406.90 s
gammaloop-workspace-doctest> Couldn't compile the test.
406.90 s
gammaloop-workspace-doctest> ---- crates/gammaloop-api/src/python.rs - python::atom_to_canonical_string (line 128) stdout ----
406.90 s
gammaloop-workspace-doctest> error[E0425] : cannot find function `atom_to_canonical_string` in this scope
406.90 s
gammaloop-workspace-doctest> --> crates/gammaloop-api/src/python.rs:129:1
406.90 s
gammaloop-workspace-doctest> |
406.90 s
gammaloop-workspace-doctest> 129 | atom_to_canonical_string("x + x")
406.90 s
gammaloop-workspace-doctest> | ^^^^^^^^^^^^^^^^^^^^^^^^ not found in this scope
406.90 s
gammaloop-workspace-doctest>
406.90 s
gammaloop-workspace-doctest> error : aborting due to 1 previous error
406.90 s
gammaloop-workspace-doctest>
406.90 s
gammaloop-workspace-doctest> For more information about this error, try `rustc --explain E0425`.
406.90 s
gammaloop-workspace-doctest> Couldn't compile the test.
406.90 s
gammaloop-workspace-doctest>
406.90 s
gammaloop-workspace-doctest> failures:
406.90 s
gammaloop-workspace-doctest> crates/gammaloop-api/src/python.rs - python::GammaLoopAPI::evaluate_sample (line 2967)
406.90 s
gammaloop-workspace-doctest> crates/gammaloop-api/src/python.rs - python::GammaLoopAPI::evaluate_samples (line 3108)
406.90 s
gammaloop-workspace-doctest> crates/gammaloop-api/src/python.rs - python::GammaLoopAPI::get_active_command_blocks (line 3760)
406.90 s
gammaloop-workspace-doctest> crates/gammaloop-api/src/python.rs - python::GammaLoopAPI::get_default_runtime_settings (line 3796)
406.90 s
gammaloop-workspace-doctest> crates/gammaloop-api/src/python.rs - python::GammaLoopAPI::get_global_settings (line 3739)
406.90 s
gammaloop-workspace-doctest> crates/gammaloop-api/src/python.rs - python::GammaLoopAPI::get_integrand_info (line 3585)
406.90 s
gammaloop-workspace-doctest> crates/gammaloop-api/src/python.rs - python::GammaLoopAPI::get_integrand_settings (line 3647)
406.90 s
gammaloop-workspace-doctest> crates/gammaloop-api/src/python.rs - python::GammaLoopAPI::get_run_history (line 3711)
406.90 s
gammaloop-workspace-doctest> crates/gammaloop-api/src/python.rs - python::GammaLoopAPI::new_python (line 2834)
406.90 s
gammaloop-workspace-doctest> crates/gammaloop-api/src/python.rs - python::GammaLoopAPI::run_command (line 3901)
406.90 s
gammaloop-workspace-doctest> crates/gammaloop-api/src/python.rs - python::PyHistogramAccumulator (line 871)
406.90 s
gammaloop-workspace-doctest> crates/gammaloop-api/src/python.rs - python::atom_to_canonical_string (line 128)
406.90 s
gammaloop-workspace-doctest> crates/gammaloop-api/src/python.rs - python::atom_to_dots (line 157)
406.90 s
gammaloop-workspace-doctest> crates/gammaloop-api/src/python.rs - python::evaluate_graph_overall_factor (line 95)
406.90 s
gammaloop-workspace-doctest>
406.90 s
gammaloop-workspace-doctest> test result: FAILED. 2 passed; 14 failed; 0 ignored; 0 measured; 0 filtered out; finished in 2.56s
406.90 s
gammaloop-workspace-doctest>
406.91 s
gammaloop-workspace-doctest> error : doctest failed, to rerun pass `-p gammaloop-api --doc`
407.33 s
error: Cannot build '/nix/store/y47h4cnqp41a82sbhpiarsni9kgmcns6-gammaloop-workspace-doctest-0.1.0.drv '.
407.44 s
Reason: builder failed with exit code 101 .
407.44 s
Output paths:
407.44 s
/nix/store/csbhhjrnmnlckq5bnzxs8vd5h7dpyng2-gammaloop-workspace-doctest-0.1.0
407.44 s
Last 356 log lines:
407.44 s
> Running phase: unpackPhase
407.44 s
> unpacking source archive /nix/store/7l1apkyf91kpbqvav8ix1cl9vm7hljmf-source
407.44 s
> source root is source
407.44 s
> Running phase: patchPhase
407.44 s
> Executing configureCargoCommonVars
407.44 s
> decompressing cargo artifacts from /nix/store/8rkh7d3hq722l839568nhnwihnsx041a-gammaloop-workspace-deps-deps-0.1.0/target.tar.zst to target
407.44 s
> Running phase: updateAutotoolsGnuConfigScriptsPhase
407.44 s
> Running phase: configurePhase
407.44 s
> will append /build/source/.cargo-home/config.toml with contents of /nix/store/xdy1vvhll2bijdplvl9fcc2b9plkxhaa-vendor-cargo-deps/config.toml
407.44 s
> default configurePhase, nothing to do
407.44 s
> Running phase: buildPhase
407.44 s
> +++ command cargo --version
407.44 s
> cargo 1.97.0 (c980f4866 2026-06-30)
407.44 s
> +++ command cargo test --profile ci-optim --doc --locked --workspace --features gammaloop-api/cli,gammaloop-tracing-filter/clap,gammaloop-tracing-filter/symbolica,idenso/bincode,idenso/reference-cases,linnet/bincode,linnet/drawing,linnet/nodestore-vec,linnet/rkyv,linnet/serde,linnet/symbolica,spenso-macros/shadowing,spenso/shadowing,symbolica/tracing_max_level_info
407.44 s
> Compiling target-lexicon v0.13.5
407.44 s
> Compiling symbolica v2.2.0 (https://github.com/symbolica-dev/symbolica?branch=dev#0441bd7a)
407.44 s
> Compiling maplit v1.0.2
407.44 s
> Compiling gammaloop-tracing-filter-macros v0.1.0 (/build/source/crates/gammaloop-tracing-filter-macros)
407.44 s
> Compiling vakint v0.1.2 (/build/source/crates/vakint)
407.44 s
> Compiling gammalooprs v0.3.4 (/build/source/crates/gammalooprs)
407.44 s
> Compiling alphal00p-docs-macros v0.1.0 (/build/source/crates/alphal00p-docs-macros)
407.44 s
> Compiling alphal00p-docs-schema v0.1.0 (/build/source/crates/alphal00p-docs-schema)
407.44 s
> Compiling rustc_version v0.4.1
407.44 s
> Compiling bincode v1.3.3
407.44 s
> Compiling iai-callgrind-runner v0.14.2
407.44 s
> Compiling gungraun-runner v0.18.2
407.44 s
> Compiling target-triple v1.0.1
407.44 s
> Compiling gammaloop-integration-tests v0.1.0 (/build/source/tests)
407.44 s
> Compiling test-log-core v0.2.20
407.44 s
> Compiling wait-timeout v0.2.1
407.44 s
> Compiling iai-callgrind v0.14.2
407.44 s
> Compiling quick-error v1.2.3
407.44 s
> Compiling bit-vec v0.8.0
407.44 s
> Compiling bit-set v0.8.0
407.44 s
> Compiling rusty-fork v0.3.1
407.44 s
> Compiling iai-callgrind-macros v0.5.1
407.44 s
> Compiling rand_xorshift v0.4.0
407.44 s
> Compiling console v0.15.11
407.44 s
> Compiling glob v0.3.4
407.44 s
> Compiling unarray v0.1.4
407.44 s
> Compiling base64 v0.21.7
407.44 s
> Compiling termcolor v1.4.1
407.44 s
> Compiling gungraun-macros v0.8.0
407.44 s
> Compiling ron v0.8.1
407.44 s
> Compiling similar-asserts v1.7.0
407.44 s
> Compiling trybuild v1.0.120
407.44 s
> Compiling proptest v1.11.0
407.44 s
> Compiling alphal00p-docs-catalogs v0.1.0 (/build/source/crates/alphal00p-docs-catalogs)
407.44 s
> Compiling pyo3-build-config v0.28.3
407.44 s
> Compiling alphal00p-docs-builder v0.1.0 (/build/source/crates/alphal00p-docs-builder)
407.44 s
> Compiling kurvst v0.1.0 (/build/source/crates/kurvst)
407.44 s
> Compiling test-log-macros v0.2.20
407.44 s
> Compiling alphal00p-docs-examples v0.1.0 (/build/source/crates/alphal00p-docs-examples)
407.44 s
> Compiling test-log v0.2.20
407.44 s
> Compiling pyo3-ffi v0.28.3
407.44 s
> Compiling pyo3-macros-backend v0.28.3
407.44 s
> Compiling pyo3 v0.28.3
407.44 s
> Compiling numpy v0.28.0
407.44 s
> Compiling gammaloop-api v0.1.0 (/build/source/crates/gammaloop-api)
407.44 s
> Compiling gungraun v0.18.2
407.44 s
> Compiling pyo3-macros v0.28.3
407.44 s
> Compiling pyo3-stub-gen v0.17.2
407.44 s
> Compiling numerica v2.2.0 (https://github.com/symbolica-dev/symbolica?branch=dev#0441bd7a)
407.44 s
> Compiling graphica v2.1.0 (https://github.com/symbolica-dev/symbolica?branch=dev#0441bd7a)
407.44 s
> Compiling symbolica-utils v0.1.0 (/build/source/crates/symbolica-utils)
407.44 s
> Compiling gammaloop-workspace-hack v0.1.0 (/build/source/crates/gammaloop-workspace-hack)
407.44 s
> Compiling spenso-macros v0.3.2 (/build/source/crates/spenso-macros)
407.44 s
> Compiling linnet v0.17.0 (/build/source/crates/linnet)
407.44 s
> Compiling spenso v0.6.0 (/build/source/crates/spenso)
407.44 s
> Compiling idenso v0.3.0 (/build/source/crates/idenso)
407.44 s
> Compiling gammaloop-tracing-filter v0.1.0 (/build/source/crates/gammaloop-tracing-filter)
407.44 s
> Compiling spenso-hep-lib v0.1.7 (/build/source/crates/spenso-hep-lib)
407.44 s
> Compiling spynso3 v0.1.2 (/build/source/crates/spynso3)
407.44 s
> Compiling linnest v0.1.0 (/build/source/crates/linnest)
407.44 s
> Compiling linnet-py v0.1.0 (/build/source/crates/linnet-py)
407.44 s
> Finished `ci-optim` profile [optimized] target(s) in 6m 21s
407.44 s
> warning : the following packages contain code that will be rejected by a future version of Rust: proc-macro-error2 v2.0.1
407.44 s
> note : to see what the problems were, use the option `--future-incompat-report`, or run `cargo report future-incompatibilities --id 1`
407.44 s
> Doc-tests alphal00p_docs_builder
407.44 s
>
407.44 s
> running 0 tests
407.44 s
>
407.44 s
> test result: ok. 0 passed; 0 failed; 0 ignored; 0 measured; 0 filtered out; finished in 0.00s
407.44 s
>
407.44 s
> Doc-tests alphal00p_docs_catalogs
407.44 s
>
407.44 s
> running 0 tests
407.44 s
>
407.44 s
> test result: ok. 0 passed; 0 failed; 0 ignored; 0 measured; 0 filtered out; finished in 0.00s
407.44 s
>
407.44 s
> Doc-tests alphal00p_docs_examples
407.44 s
>
407.44 s
> running 0 tests
407.44 s
>
407.44 s
> test result: ok. 0 passed; 0 failed; 0 ignored; 0 measured; 0 filtered out; finished in 0.00s
407.44 s
>
407.44 s
> Doc-tests alphal00p_docs
407.44 s
>
407.44 s
> running 0 tests
407.44 s
>
407.44 s
> test result: ok. 0 passed; 0 failed; 0 ignored; 0 measured; 0 filtered out; finished in 0.00s
407.44 s
>
407.44 s
> Doc-tests alphal00p_docs_schema
407.44 s
>
407.44 s
> running 0 tests
407.44 s
>
407.44 s
> test result: ok. 0 passed; 0 failed; 0 ignored; 0 measured; 0 filtered out; finished in 0.00s
407.44 s
>
407.44 s
> Doc-tests gammaloop_api
407.44 s
>
407.44 s
> running 16 tests
407.44 s
> test crates/gammaloop-api/src/python.rs - python::GammaLoopAPI::get_integrand_settings (line 3647) ... FAILED
407.44 s
> test crates/gammaloop-api/src/python.rs - python::GammaLoopAPI::get_default_runtime_settings (line 3796) ... FAILED
407.44 s
> test crates/gammaloop-api/src/python.rs - python::GammaLoopAPI::evaluate_sample (line 2967) ... FAILED
407.44 s
> test crates/gammaloop-api/src/python.rs - python::GammaLoopAPI::get_integrand_info (line 3585) ... FAILED
407.44 s
> test crates/gammaloop-api/src/python.rs - python::GammaLoopAPI::evaluate_samples (line 3108) ... FAILED
407.44 s
> test crates/gammaloop-api/src/python.rs - python::GammaLoopAPI::get_active_command_blocks (line 3760) ... FAILED
407.44 s
> test crates/gammaloop-api/src/python.rs - python::PyHistogramAccumulator (line 871) ... FAILED
407.44 s
> test crates/gammaloop-api/src/lib.rs - (line 18) - compile ... ok
407.44 s
> test crates/gammaloop-api/src/python.rs - python::GammaLoopAPI::run_command (line 3901) ... FAILED
407.44 s
> test crates/gammaloop-api/src/python.rs - python::GammaLoopAPI::get_global_settings (line 3739) ... FAILED
407.44 s
> test crates/gammaloop-api/src/python.rs - python::GammaLoopAPI::get_run_history (line 3711) ... FAILED
407.44 s
> test crates/gammaloop-api/src/python.rs - python::GammaLoopAPI::new_python (line 2834) ... FAILED
407.44 s
> test crates/gammaloop-api/src/python.rs - python::atom_to_dots (line 157) ... FAILED
407.44 s
> test crates/gammaloop-api/src/python.rs - python::evaluate_graph_overall_factor (line 95) ... FAILED
407.44 s
> test crates/gammaloop-api/src/python.rs - python::atom_to_canonical_string (line 128) ... FAILED
407.44 s
> test crates/gammaloop-api/src/commands/evaluate_samples.rs - commands::evaluate_samples::EvaluateSamples (line 50) ... ok
407.44 s
>
407.44 s
> failures:
407.44 s
>
407.44 s
> ---- crates/gammaloop-api/src/python.rs - python::GammaLoopAPI::get_integrand_settings (line 3647) stdout ----
407.44 s
> error: expected one of `!` or `::`, found `=`
407.44 s
> --> crates/gammaloop-api/src/python.rs:3648:10
407.44 s
> |
407.44 s
> 3648 | settings = api.get_integrand_settings(process_id=0)
407.44 s
> | ^ expected one of `!` or `::`
407.44 s
>
407.44 s
> error: aborting due to 1 previous error
407.44 s
>
407.44 s
> Couldn't compile the test.
407.44 s
> ---- crates/gammaloop-api/src/python.rs - python::GammaLoopAPI::get_default_runtime_settings (line 3796) stdout ----
407.44 s
> error: expected one of `!` or `::`, found `=`
407.44 s
> --> crates/gammaloop-api/src/python.rs:3797:9
407.44 s
> |
407.44 s
> 3797 | runtime = api.get_default_runtime_settings()
407.44 s
> | ^ expected one of `!` or `::`
407.44 s
>
407.44 s
> error: aborting due to 1 previous error
407.44 s
>
407.44 s
> Couldn't compile the test.
407.44 s
> ---- crates/gammaloop-api/src/python.rs - python::GammaLoopAPI::evaluate_sample (line 2967) stdout ----
407.44 s
> error: expected one of `!` or `::`, found `pathlib`
407.44 s
> --> crates/gammaloop-api/src/python.rs:2968:6
407.44 s
> |
407.44 s
> 2968 | from pathlib import Path
407.44 s
> | ^^^^^^^ expected one of `!` or `::`
407.44 s
>
407.44 s
> error: aborting due to 1 previous error
407.44 s
>
407.44 s
> Couldn't compile the test.
407.44 s
> ---- crates/gammaloop-api/src/python.rs - python::GammaLoopAPI::get_integrand_info (line 3585) stdout ----
407.44 s
> error: expected one of `!` or `::`, found `pathlib`
407.44 s
> --> crates/gammaloop-api/src/python.rs:3586:6
407.44 s
> |
407.44 s
> 3586 | from pathlib import Path
407.44 s
> | ^^^^^^^ expected one of `!` or `::`
407.44 s
>
407.44 s
> error: aborting due to 1 previous error
407.44 s
>
407.44 s
> Couldn't compile the test.
407.44 s
> ---- crates/gammaloop-api/src/python.rs - python::GammaLoopAPI::evaluate_samples (line 3108) stdout ----
407.44 s
> error: expected one of `!` or `::`, found `pathlib`
407.44 s
> --> crates/gammaloop-api/src/python.rs:3109:6
407.44 s
> |
407.44 s
> 3109 | from pathlib import Path
407.44 s
> | ^^^^^^^ expected one of `!` or `::`
407.44 s
>
407.44 s
> error: aborting due to 1 previous error
407.44 s
>
407.44 s
> Couldn't compile the test.
407.44 s
> ---- crates/gammaloop-api/src/python.rs - python::GammaLoopAPI::get_active_command_blocks (line 3760) stdout ----
407.44 s
> error: expected item, found keyword `for`
407.44 s
> --> crates/gammaloop-api/src/python.rs:3761:1
407.44 s
> |
407.44 s
> 3761 | for name, commands in api.get_active_command_blocks().items():
407.44 s
> | ^^^ expected item
407.44 s
> |
407.44 s
> = note: for a full list of items that can appear in modules, see <https://doc.rust-lang.org/reference/items.html>
407.44 s
>
407.44 s
> error: aborting due to 1 previous error
407.44 s
>
407.44 s
> Couldn't compile the test.
407.44 s
> ---- crates/gammaloop-api/src/python.rs - python::PyHistogramAccumulator (line 871) stdout ----
407.44 s
> error: expected one of `!` or `::`, found `gammaloop`
407.44 s
> --> crates/gammaloop-api/src/python.rs:872:6
407.44 s
> |
407.44 s
> 872 | from gammaloop import HistogramAccumulator
407.44 s
> | ^^^^^^^^^ expected one of `!` or `::`
407.44 s
>
407.44 s
> error: aborting due to 1 previous error
407.44 s
>
407.44 s
> Couldn't compile the test.
407.44 s
> ---- crates/gammaloop-api/src/python.rs - python::GammaLoopAPI::run_command (line 3901) stdout ----
407.44 s
> error[E0425] : cannot find value `api` in this scope
407.44 s
> --> crates/gammaloop-api/src/python.rs:3902:1
407.44 s
> |
407.44 s
> 3902 | api.run("display processes")
407.44 s
> | ^^^ not found in this scope
407.44 s
>
407.44 s
> error : aborting due to 1 previous error
407.44 s
>
407.44 s
> For more information about this error, try `rustc --explain E0425`.
407.44 s
> Couldn't compile the test.
407.44 s
> ---- crates/gammaloop-api/src/python.rs - python::GammaLoopAPI::get_global_settings (line 3739) stdout ----
407.44 s
> error[E0425] : cannot find value `settings_toml` in this scope
407.44 s
> --> crates/gammaloop-api/src/python.rs:3740:1
407.44 s
> |
407.44 s
> 3740 | settings_toml = api.get_global_settings()
407.44 s
> | ^^^^^^^^^^^^^
407.44 s
> |
407.44 s
> help : you might have meant to introduce a new binding
407.44 s
> |
407.44 s
> 3740 | let settings_toml = api.get_global_settings()
407.44 s
> | +++
407.44 s
>
407.44 s
> error[E0425] : cannot find value `api` in this scope
407.44 s
> --> crates/gammaloop-api/src/python.rs:3740:17
407.44 s
> |
407.44 s
> 3740 | settings_toml = api.get_global_settings()
407.44 s
> | ^^^ not found in this scope
407.44 s
>
407.44 s
> error : aborting due to 2 previous errors
407.44 s
>
407.44 s
> For more information about this error, try `rustc --explain E0425`.
407.44 s
> Couldn't compile the test.
407.44 s
> ---- crates/gammaloop-api/src/python.rs - python::GammaLoopAPI::get_run_history (line 3711) stdout ----
407.44 s
> error[E0425] : cannot find value `run_card_toml` in this scope
407.44 s
> --> crates/gammaloop-api/src/python.rs:3712:1
407.44 s
> |
407.44 s
> 3712 | run_card_toml = api.get_run_history()
407.44 s
> | ^^^^^^^^^^^^^
407.44 s
> |
407.44 s
> help : you might have meant to introduce a new binding
407.44 s
> |
407.44 s
> 3712 | let run_card_toml = api.get_run_history()
407.44 s
> | +++
407.44 s
>
407.44 s
> error[E0425] : cannot find value `api` in this scope
407.44 s
> --> crates/gammaloop-api/src/python.rs:3712:17
407.44 s
> |
407.44 s
> 3712 | run_card_toml = api.get_run_history()
407.44 s
> | ^^^ not found in this scope
407.44 s
>
407.44 s
> error : aborting due to 2 previous errors
407.44 s
>
407.44 s
> For more information about this error, try `rustc --explain E0425`.
407.44 s
> Couldn't compile the test.
407.44 s
> ---- crates/gammaloop-api/src/python.rs - python::GammaLoopAPI::new_python (line 2834) stdout ----
407.44 s
> error[E0425] : cannot find value `api` in this scope
407.44 s
> --> crates/gammaloop-api/src/python.rs:2835:1
407.44 s
> |
407.44 s
> 2835 | api = GammaLoopAPI(state_folder="./state", read_only_state=True)
407.44 s
> | ^^^
407.44 s
> |
407.44 s
> help : you might have meant to introduce a new binding
407.44 s
> |
407.44 s
> 2835 | let api = GammaLoopAPI(state_folder="./state", read_only_state=True)
407.44 s
> | +++
407.44 s
>
407.44 s
> error[E0425] : cannot find value `state_folder` in this scope
407.44 s
> --> crates/gammaloop-api/src/python.rs:2835:20
407.44 s
> |
407.44 s
> 2835 | api = GammaLoopAPI(state_folder="./state", read_only_state=True)
407.44 s
> | ^^^^^^^^^^^^ not found in this scope
407.44 s
>
407.44 s
> error[E0425] : cannot find value `read_only_state` in this scope
407.44 s
> --> crates/gammaloop-api/src/python.rs:2835:44
407.44 s
> |
407.44 s
> 2835 | api = GammaLoopAPI(state_folder="./state", read_only_state=True)
407.44 s
> | ^^^^^^^^^^^^^^^ not found in this scope
407.44 s
>
407.44 s
> error[E0425] : cannot find value `True` in this scope
407.44 s
> --> crates/gammaloop-api/src/python.rs:2835:60
407.44 s
> |
407.44 s
> 2835 | api = GammaLoopAPI(state_folder="./state", read_only_state=True)
407.44 s
> | ^^^^ not found in this scope
407.44 s
> |
407.44 s
> help : you may want to use a bool value instead
407.44 s
> |
407.44 s
> 2835 - api = GammaLoopAPI(state_folder="./state", read_only_state=True )
407.44 s
> 2835 + api = GammaLoopAPI(state_folder="./state", read_only_state=true )
407.44 s
> |
407.44 s
>
407.44 s
> error[E0425] : cannot find function, tuple struct or tuple variant `GammaLoopAPI` in this scope
407.44 s
> --> crates/gammaloop-api/src/python.rs:2835:7
407.44 s
> |
407.44 s
> 2835 | api = GammaLoopAPI(state_folder="./state", read_only_state=True)
407.44 s
> | ^^^^^^^^^^^^ not found in this scope
407.44 s
>
407.44 s
> error : aborting due to 5 previous errors
407.44 s
>
407.44 s
> For more information about this error, try `rustc --explain E0425`.
407.44 s
> Couldn't compile the test.
407.44 s
> ---- crates/gammaloop-api/src/python.rs - python::atom_to_dots (line 157) stdout ----
407.44 s
> error[E0425] : cannot find function `to_dots` in this scope
407.44 s
> --> crates/gammaloop-api/src/python.rs:158:1
407.44 s
> |
407.44 s
> 158 | to_dots("p(mu) * q(mu)")
407.44 s
> | ^^^^^^^ not found in this scope
407.44 s
>
407.44 s
> error : aborting due to 1 previous error
407.44 s
>
407.44 s
> For more information about this error, try `rustc --explain E0425`.
407.44 s
> Couldn't compile the test.
407.44 s
> ---- crates/gammaloop-api/src/python.rs - python::evaluate_graph_overall_factor (line 95) stdout ----
407.44 s
> error[E0425] : cannot find function `evaluate_graph_overall_factor` in this scope
407.44 s
> --> crates/gammaloop-api/src/python.rs:96:1
407.44 s
> |
407.44 s
> 96 | evaluate_graph_overall_factor(
407.44 s
> | ^^^^^^^^^^^^^^^^^^^^^^^^^^^^^ not found in this scope
407.44 s
>
407.44 s
> error : aborting due to 1 previous error
407.44 s
>
407.44 s
> For more information about this error, try `rustc --explain E0425`.
407.44 s
> Couldn't compile the test.
407.44 s
> ---- crates/gammaloop-api/src/python.rs - python::atom_to_canonical_string (line 128) stdout ----
407.44 s
> error[E0425] : cannot find function `atom_to_canonical_string` in this scope
407.44 s
> --> crates/gammaloop-api/src/python.rs:129:1
407.44 s
> |
407.44 s
> 129 | atom_to_canonical_string("x + x")
407.44 s
> | ^^^^^^^^^^^^^^^^^^^^^^^^ not found in this scope
407.44 s
>
407.44 s
> error : aborting due to 1 previous error
407.44 s
>
407.44 s
> For more information about this error, try `rustc --explain E0425`.
407.44 s
> Couldn't compile the test.
407.44 s
>
407.44 s
> failures:
407.44 s
> crates/gammaloop-api/src/python.rs - python::GammaLoopAPI::evaluate_sample (line 2967)
407.44 s
> crates/gammaloop-api/src/python.rs - python::GammaLoopAPI::evaluate_samples (line 3108)
407.44 s
> crates/gammaloop-api/src/python.rs - python::GammaLoopAPI::get_active_command_blocks (line 3760)
407.44 s
> crates/gammaloop-api/src/python.rs - python::GammaLoopAPI::get_default_runtime_settings (line 3796)
407.44 s
> crates/gammaloop-api/src/python.rs - python::GammaLoopAPI::get_global_settings (line 3739)
407.44 s
> crates/gammaloop-api/src/python.rs - python::GammaLoopAPI::get_integrand_info (line 3585)
407.44 s
> crates/gammaloop-api/src/python.rs - python::GammaLoopAPI::get_integrand_settings (line 3647)
407.44 s
> crates/gammaloop-api/src/python.rs - python::GammaLoopAPI::get_run_history (line 3711)
407.44 s
> crates/gammaloop-api/src/python.rs - python::GammaLoopAPI::new_python (line 2834)
407.44 s
> crates/gammaloop-api/src/python.rs - python::GammaLoopAPI::run_command (line 3901)
407.44 s
> crates/gammaloop-api/src/python.rs - python::PyHistogramAccumulator (line 871)
407.44 s
> crates/gammaloop-api/src/python.rs - python::atom_to_canonical_string (line 128)
407.44 s
> crates/gammaloop-api/src/python.rs - python::atom_to_dots (line 157)
407.44 s
> crates/gammaloop-api/src/python.rs - python::evaluate_graph_overall_factor (line 95)
407.44 s
>
407.44 s
> test result: FAILED. 2 passed; 14 failed; 0 ignored; 0 measured; 0 filtered out; finished in 2.56s
407.44 s
>
407.44 s
> error : doctest failed, to rerun pass `-p gammaloop-api --doc`
407.44 s
For full logs, run:
407.44 s
nix log /nix/store/y47h4cnqp41a82sbhpiarsni9kgmcns6-gammaloop-workspace-doctest-0.1.0.drv
407.44 s
[0 built (1 failed ), 0.0 Run failed.