test packages.x86_64-linux.nix-ci-check-gammaloop-nextest-core

Reproduce this run
Retry Run
  1. 0.00 s $ /nix/store/9ypz3flqsrl5xl495mm8h645gadjsxi1-coreutils-9.11/bin/timeout --kill-after=15s 7200s /nix/store/23zk8sgzamrbmj1fday15szf7f2279s8-nix-2.34.7/bin/nix --extra-experimental-features nix-command --extra-experimental-features flakes flake clone git+https://github.com/alphal00p/gammaloop --dest /tmp/nix-ci-worker/stable-pwd/repo/
  2. 0.08 s Cloning into '/tmp/nix-ci-worker/stable-pwd/repo'...
  3. 0.72 s remote: Enumerating objects: 85207, done.
  4. 0.82 s remote: Counting objects: 0% (1/8912) remote: Counting objects: 1% (90/8912) remote: Counting objects: 2% (179/8912) remote: Counting objects: 3% (268/8912) remote: Counting objects: 4% (357/8912) remote: Counting objects: 5% (446/8912) remote: Counting objects: 6% (535/8912) remote: Counting objects: 7% (624/8912) remote: Counting objects: 8% (713/8912) remote: Counting objects: 9% (803/8912) remote: Counting objects: 10% (892/8912) remote: Counting objects: 11% (981/8912) remote: Counting objects: 12% (1070/8912) remote: Counting objects: 13% (1159/8912) remote: Counting objects: 14% (1248/8912) remote: Counting objects: 15% (1337/8912) remote: Counting objects: 16% (1426/8912) remote: Counting objects: 17% (1516/8912) remote: Counting objects: 18% (1605/8912) remote: Counting objects: 19% (1694/8912) remote: Counting objects: 20% (1783/8912) remote: Counting objects: 21% (1872/8912) remote: Counting objects: 22% (1961/8912) remote: Counting objects: 23% (2050/8912) remote: Counting objects: 24% (2139/8912) remote: Counting objects: 25% (2228/8912) remote: Counting objects: 26% (2318/8912) remote: Counting objects: 27% (2407/8912) remote: Counting objects: 28% (2496/8912) remote: Counting objects: 29% (2585/8912) remote: Counting objects: 30% (2674/8912) remote: Counting objects: 31% (2763/8912) remote: Counting objects: 32% (2852/8912) remote: Counting objects: 33% (2941/8912) remote: Counting objects: 34% (3031/8912) remote: Counting objects: 35% (3120/8912) remote: Counting objects: 36% (3209/8912) remote: Counting objects: 37% (3298/8912) remote: Counting objects: 38% (3387/8912) remote: Counting objects: 39% (3476/8912) remote: Counting objects: 40% (3565/8912) remote: Counting objects: 41% (3654/8912) remote: Counting objects: 42% (3744/8912) remote: Counting objects: 43% (3833/8912) remote: Counting objects: 44% (3922/8912) remote: Counting objects: 45% (4011/8912) remote: Counting objects: 46% (4100/8912) remote: Counting objects: 47% (4189/8912) remote: Counting objects: 48% (4278/8912) remote: Counting objects: 49% (4367/8912) remote: Counting objects: 50% (4456/8912) remote: Counting objects: 51% (4546/8912) remote: Counting objects: 52% (4635/8912) remote: Counting objects: 53% (4724/8912) remote: Counting objects: 54% (4813/8912) remote: Counting objects: 55% (4902/8912) remote: Counting objects: 56% (4991/8912) remote: Counting objects: 57% (5080/8912) remote: Counting objects: 58% (5169/8912) remote: Counting objects: 59% (5259/8912) remote: Counting objects: 60% (5348/8912) remote: Counting objects: 61% (5437/8912) remote: Counting objects: 62% (5526/8912) remote: Counting objects: 63% (5615/8912) remote: Counting objects: 64% (5704/8912) remote: Counting objects: 65% (5793/8912) remote: Counting objects: 66% (5882/8912) remote: Counting objects: 67% (5972/8912) remote: Counting objects: 68% (6061/8912) remote: Counting objects: 69% (6150/8912) remote: Counting objects: 70% (6239/8912) remote: Counting objects: 71% (6328/8912) remote: Counting objects: 72% (6417/8912) remote: Counting objects: 73% (6506/8912) remote: Counting objects: 74% (6595/8912) remote: Counting objects: 75% (6684/8912) remote: Counting objects: 76% (6774/8912) remote: Counting objects: 77% (6863/8912) remote: Counting objects: 78% (6952/8912) remote: Counting objects: 79% (7041/8912) remote: Counting objects: 80% (7130/8912) remote: Counting objects: 81% (7219/8912) remote: Counting objects: 82% (7308/8912) remote: Counting objects: 83% (7397/8912) remote: Counting objects: 84% (7487/8912) remote: Counting objects: 85% (7576/8912) remote: Counting objects: 86% (7665/8912) remote: Counting objects: 87% (7754/8912) remote: Counting objects: 88% (7843/8912) remote: Counting objects: 89% (7932/8912) remote: Counting objects: 90% (8021/8912) remote: Counting objects: 91% (8110/8912) remote: Counting objects: 92% (8200/8912) remote: Counting objects: 93% (8289/8912) remote: Counting objects: 94% (8378/8912) remote: Counting objects: 95% (8467/8912) remote: Counting objects: 96% (8556/8912) remote: Counting objects: 97% (8645/8912) remote: Counting objects: 98% (8734/8912) remote: Counting objects: 99% (8823/8912) remote: Counting objects: 100% (8912/8912) remote: Counting objects: 100% (8912/8912), done.
  5. 2.68 s remote: Compressing objects: 0% (1/1935) remote: Compressing objects: 1% (20/1935) remote: Compressing objects: 2% (39/1935) remote: Compressing objects: 3% (59/1935) remote: Compressing objects: 4% (78/1935) remote: Compressing objects: 5% (97/1935) remote: Compressing objects: 6% (117/1935) remote: Compressing objects: 7% (136/1935) remote: Compressing objects: 8% (155/1935) remote: Compressing objects: 9% (175/1935) remote: Compressing objects: 10% (194/1935) remote: Compressing objects: 10% (201/1935) remote: Compressing objects: 11% (213/1935) remote: Compressing objects: 12% (233/1935) remote: Compressing objects: 13% (252/1935) remote: Compressing objects: 14% (271/1935) remote: Compressing objects: 15% (291/1935) remote: Compressing objects: 16% (310/1935) remote: Compressing objects: 17% (329/1935) remote: Compressing objects: 18% (349/1935) remote: Compressing objects: 19% (368/1935) remote: Compressing objects: 20% (387/1935) remote: Compressing objects: 21% (407/1935) remote: Compressing objects: 22% (426/1935) remote: Compressing objects: 23% (446/1935) remote: Compressing objects: 24% (465/1935) remote: Compressing objects: 25% (484/1935) remote: Compressing objects: 26% (504/1935) remote: Compressing objects: 27% (523/1935) remote: Compressing objects: 28% (542/1935) remote: Compressing objects: 29% (562/1935) remote: Compressing objects: 30% (581/1935) remote: Compressing objects: 31% (600/1935) remote: Compressing objects: 32% (620/1935) remote: Compressing objects: 33% (639/1935) remote: Compressing objects: 34% (658/1935) remote: Compressing objects: 35% (678/1935) remote: Compressing objects: 36% (697/1935) remote: Compressing objects: 37% (716/1935) remote: Compressing objects: 38% (736/1935) remote: Compressing objects: 39% (755/1935) remote: Compressing objects: 40% (774/1935) remote: Compressing objects: 41% (794/1935) remote: Compressing objects: 42% (813/1935) remote: Compressing objects: 43% (833/1935) remote: Compressing objects: 44% (852/1935) remote: Compressing objects: 45% (871/1935) remote: Compressing objects: 46% (891/1935) remote: Compressing objects: 47% (910/1935) remote: Compressing objects: 48% (929/1935) remote: Compressing objects: 49% (949/1935) remote: Compressing objects: 50% (968/1935) remote: Compressing objects: 51% (987/1935) remote: Compressing objects: 52% (1007/1935) remote: Compressing objects: 53% (1026/1935) remote: Compressing objects: 54% (1045/1935) remote: Compressing objects: 55% (1065/1935) remote: Compressing objects: 56% (1084/1935) remote: Compressing objects: 57% (1103/1935) remote: Compressing objects: 58% (1123/1935) remote: Compressing objects: 59% (1142/1935) remote: Compressing objects: 60% (1161/1935) remote: Compressing objects: 61% (1181/1935) remote: Compressing objects: 62% (1200/1935) remote: Compressing objects: 63% (1220/1935) remote: Compressing objects: 64% (1239/1935) remote: Compressing objects: 65% (1258/1935) remote: Compressing objects: 66% (1278/1935) remote: Compressing objects: 67% (1297/1935) remote: Compressing objects: 68% (1316/1935) remote: Compressing objects: 69% (1336/1935) remote: Compressing objects: 70% (1355/1935) remote: Compressing objects: 71% (1374/1935) remote: Compressing objects: 72% (1394/1935) remote: Compressing objects: 73% (1413/1935) remote: Compressing objects: 74% (1432/1935) remote: Compressing objects: 75% (1452/1935) remote: Compressing objects: 76% (1471/1935) remote: Compressing objects: 77% (1490/1935) remote: Compressing objects: 78% (1510/1935) remote: Compressing objects: 79% (1529/1935) remote: Compressing objects: 80% (1548/1935) remote: Compressing objects: 81% (1568/1935) remote: Compressing objects: 82% (1587/1935) remote: Compressing objects: 83% (1607/1935) remote: Compressing objects: 84% (1626/1935) remote: Compressing objects: 85% (1645/1935) remote: Compressing objects: 86% (1665/1935) remote: Compressing objects: 87% (1684/1935) remote: Compressing objects: 88% (1703/1935) remote: Compressing objects: 89% (1723/1935) remote: Compressing objects: 90% (1742/1935) remote: Compressing objects: 91% (1761/1935) remote: Compressing objects: 92% (1781/1935) remote: Compressing objects: 93% (1800/1935) remote: Compressing objects: 94% (1819/1935) remote: Compressing objects: 95% (1839/1935) remote: Compressing objects: 96% (1858/1935) remote: Compressing objects: 97% (1877/1935) remote: Compressing objects: 98% (1897/1935) remote: Compressing objects: 99% (1916/1935) remote: Compressing objects: 100% (1935/1935) remote: Compressing objects: 100% (1935/1935), done.
  6. 7.26 s Receiving objects: 0% (1/85207) Receiving objects: 1% (853/85207) Receiving objects: 2% (1705/85207) Receiving objects: 3% (2557/85207) Receiving objects: 4% (3409/85207) Receiving objects: 5% (4261/85207) Receiving objects: 6% (5113/85207), 9.18 MiB | 18.35 MiB/s Receiving objects: 7% (5965/85207), 9.18 MiB | 18.35 MiB/s Receiving objects: 8% (6817/85207), 9.18 MiB | 18.35 MiB/s Receiving objects: 9% (7669/85207), 9.18 MiB | 18.35 MiB/s Receiving objects: 10% (8521/85207), 9.18 MiB | 18.35 MiB/s Receiving objects: 11% (9373/85207), 9.18 MiB | 18.35 MiB/s Receiving objects: 12% (10225/85207), 9.18 MiB | 18.35 MiB/s Receiving objects: 13% (11077/85207), 9.18 MiB | 18.35 MiB/s Receiving objects: 14% (11929/85207), 9.18 MiB | 18.35 MiB/s Receiving objects: 15% (12782/85207), 9.18 MiB | 18.35 MiB/s Receiving objects: 16% (13634/85207), 9.18 MiB | 18.35 MiB/s Receiving objects: 17% (14486/85207), 9.18 MiB | 18.35 MiB/s Receiving objects: 18% (15338/85207), 9.18 MiB | 18.35 MiB/s Receiving objects: 19% (16190/85207), 9.18 MiB | 18.35 MiB/s Receiving objects: 20% (17042/85207), 9.18 MiB | 18.35 MiB/s Receiving objects: 21% (17894/85207), 9.18 MiB | 18.35 MiB/s Receiving objects: 22% (18746/85207), 9.18 MiB | 18.35 MiB/s Receiving objects: 23% (19598/85207), 9.18 MiB | 18.35 MiB/s Receiving objects: 24% (20450/85207), 9.18 MiB | 18.35 MiB/s Receiving objects: 25% (21302/85207), 9.18 MiB | 18.35 MiB/s Receiving objects: 26% (22154/85207), 9.18 MiB | 18.35 MiB/s Receiving objects: 27% (23006/85207), 9.18 MiB | 18.35 MiB/s Receiving objects: 28% (23858/85207), 9.18 MiB | 18.35 MiB/s Receiving objects: 29% (24711/85207), 9.18 MiB | 18.35 MiB/s Receiving objects: 30% (25563/85207), 9.18 MiB | 18.35 MiB/s Receiving objects: 31% (26415/85207), 9.18 MiB | 18.35 MiB/s Receiving objects: 32% (27267/85207), 9.18 MiB | 18.35 MiB/s Receiving objects: 33% (28119/85207), 9.18 MiB | 18.35 MiB/s Receiving objects: 34% (28971/85207), 9.18 MiB | 18.35 MiB/s Receiving objects: 35% (29823/85207), 9.18 MiB | 18.35 MiB/s Receiving objects: 36% (30675/85207), 9.18 MiB | 18.35 MiB/s Receiving objects: 36% (31463/85207), 9.18 MiB | 18.35 MiB/s Receiving objects: 37% (31527/85207), 29.45 MiB | 29.45 MiB/s Receiving objects: 38% (32379/85207), 29.45 MiB | 29.45 MiB/s Receiving objects: 39% (33231/85207), 29.45 MiB | 29.45 MiB/s Receiving objects: 40% (34083/85207), 29.45 MiB | 29.45 MiB/s Receiving objects: 41% (34935/85207), 29.45 MiB | 29.45 MiB/s Receiving objects: 42% (35787/85207), 29.45 MiB | 29.45 MiB/s Receiving objects: 43% (36640/85207), 29.45 MiB | 29.45 MiB/s Receiving objects: 44% (37492/85207), 29.45 MiB | 29.45 MiB/s Receiving objects: 45% (38344/85207), 29.45 MiB | 29.45 MiB/s Receiving objects: 46% (39196/85207), 29.45 MiB | 29.45 MiB/s Receiving objects: 47% (40048/85207), 46.36 MiB | 30.62 MiB/s Receiving objects: 48% (40900/85207), 46.36 MiB | 30.62 MiB/s Receiving objects: 49% (41752/85207), 46.36 MiB | 30.62 MiB/s Receiving objects: 50% (42604/85207), 46.36 MiB | 30.62 MiB/s Receiving objects: 51% (43456/85207), 46.36 MiB | 30.62 MiB/s Receiving objects: 52% (44308/85207), 46.36 MiB | 30.62 MiB/s Receiving objects: 53% (45160/85207), 46.36 MiB | 30.62 MiB/s Receiving objects: 54% (46012/85207), 46.36 MiB | 30.62 MiB/s Receiving objects: 55% (46864/85207), 46.36 MiB | 30.62 MiB/s Receiving objects: 56% (47716/85207), 46.36 MiB | 30.62 MiB/s Receiving objects: 57% (48568/85207), 46.36 MiB | 30.62 MiB/s Receiving objects: 57% (48725/85207), 64.22 MiB | 31.69 MiB/s Receiving objects: 58% (49421/85207), 64.22 MiB | 31.69 MiB/s Receiving objects: 59% (50273/85207), 64.22 MiB | 31.69 MiB/s Receiving objects: 60% (51125/85207), 64.22 MiB | 31.69 MiB/s Receiving objects: 61% (51977/85207), 64.22 MiB | 31.69 MiB/s Receiving objects: 62% (52829/85207), 64.22 MiB | 31.69 MiB/s Receiving objects: 63% (53681/85207), 64.22 MiB | 31.69 MiB/s Receiving objects: 64% (54533/85207), 64.22 MiB | 31.69 MiB/s Receiving objects: 65% (55385/85207), 64.22 MiB | 31.69 MiB/s Receiving objects: 66% (56237/85207), 64.22 MiB | 31.69 MiB/s Receiving objects: 67% (57089/85207), 82.14 MiB | 32.47 MiB/s Receiving objects: 67% (57331/85207), 99.78 MiB | 32.94 MiB/s Receiving objects: 68% (57941/85207), 99.78 MiB | 32.94 MiB/s Receiving objects: 69% (58793/85207), 99.78 MiB | 32.94 MiB/s Receiving objects: 70% (59645/85207), 99.78 MiB | 32.94 MiB/s Receiving objects: 71% (60497/85207), 99.78 MiB | 32.94 MiB/s Receiving objects: 72% (61350/85207), 99.78 MiB | 32.94 MiB/s Receiving objects: 73% (62202/85207), 99.78 MiB | 32.94 MiB/s Receiving objects: 74% (63054/85207), 99.78 MiB | 32.94 MiB/s Receiving objects: 75% (63906/85207), 117.46 MiB | 33.18 MiB/s Receiving objects: 76% (64758/85207), 117.46 MiB | 33.18 MiB/s Receiving objects: 77% (65610/85207), 117.46 MiB | 33.18 MiB/s Receiving objects: 78% (66462/85207), 117.46 MiB | 33.18 MiB/s Receiving objects: 79% (67314/85207), 117.46 MiB | 33.18 MiB/s Receiving objects: 79% (67889/85207), 117.46 MiB | 33.18 MiB/s Receiving objects: 80% (68166/85207), 117.46 MiB | 33.18 MiB/s Receiving objects: 81% (69018/85207), 117.46 MiB | 33.18 MiB/s Receiving objects: 82% (69870/85207), 117.46 MiB | 33.18 MiB/s Receiving objects: 83% (70722/85207), 135.81 MiB | 33.58 MiB/s Receiving objects: 84% (71574/85207), 135.81 MiB | 33.58 MiB/s Receiving objects: 85% (72426/85207), 135.81 MiB | 33.58 MiB/s Receiving objects: 86% (73279/85207), 135.81 MiB | 33.58 MiB/s Receiving objects: 87% (74131/85207), 135.81 MiB | 33.58 MiB/s Receiving objects: 88% (74983/85207), 135.81 MiB | 33.58 MiB/s Receiving objects: 89% (75835/85207), 135.81 MiB | 33.58 MiB/s Receiving objects: 90% (76687/85207), 135.81 MiB | 33.58 MiB/s Receiving objects: 91% (77539/85207), 135.81 MiB | 33.58 MiB/s Receiving objects: 92% (78391/85207), 135.81 MiB | 33.58 MiB/s Receiving objects: 93% (79243/85207), 135.81 MiB | 33.58 MiB/s Receiving objects: 94% (80095/85207), 135.81 MiB | 33.58 MiB/s Receiving objects: 95% (80947/85207), 135.81 MiB | 33.58 MiB/s Receiving objects: 96% (81799/85207), 135.81 MiB | 33.58 MiB/s Receiving objects: 97% (82651/85207), 135.81 MiB | 33.58 MiB/s Receiving objects: 98% (83503/85207), 135.81 MiB | 33.58 MiB/s Receiving objects: 99% (84355/85207), 153.23 MiB | 33.72 MiB/s remote: Total 85207 (delta 7767), reused 7056 (delta 6977), pack-reused 76295 (from 3)
  7. 7.26 s Receiving objects: 100% (85207/85207), 153.23 MiB | 33.72 MiB/s Receiving objects: 100% (85207/85207), 155.04 MiB | 33.85 MiB/s, done.
  8. 8.28 s Resolving deltas: 0% (0/57685) Resolving deltas: 1% (577/57685) Resolving deltas: 2% (1154/57685) Resolving deltas: 3% (1731/57685) Resolving deltas: 4% (2308/57685) Resolving deltas: 5% (2886/57685) Resolving deltas: 6% (3462/57685) Resolving deltas: 7% (4038/57685) Resolving deltas: 8% (4615/57685) Resolving deltas: 9% (5192/57685) Resolving deltas: 10% (5769/57685) Resolving deltas: 11% (6346/57685) Resolving deltas: 12% (6923/57685) Resolving deltas: 13% (7500/57685) Resolving deltas: 14% (8076/57685) Resolving deltas: 15% (8653/57685) Resolving deltas: 16% (9230/57685) Resolving deltas: 17% (9807/57685) Resolving deltas: 18% (10384/57685) Resolving deltas: 19% (10961/57685) Resolving deltas: 20% (11537/57685) Resolving deltas: 21% (12114/57685) Resolving deltas: 22% (12691/57685) Resolving deltas: 23% (13268/57685) Resolving deltas: 24% (13845/57685) Resolving deltas: 25% (14424/57685) Resolving deltas: 26% (14999/57685) Resolving deltas: 27% (15575/57685) Resolving deltas: 28% (16152/57685) Resolving deltas: 29% (16729/57685) Resolving deltas: 30% (17307/57685) Resolving deltas: 31% (17883/57685) Resolving deltas: 32% (18460/57685) Resolving deltas: 33% (19037/57685) Resolving deltas: 34% (19613/57685) Resolving deltas: 35% (20190/57685) Resolving deltas: 36% (20768/57685) Resolving deltas: 37% (21345/57685) Resolving deltas: 38% (21922/57685) Resolving deltas: 39% (22498/57685) Resolving deltas: 40% (23074/57685) Resolving deltas: 41% (23651/57685) Resolving deltas: 42% (24228/57685) Resolving deltas: 43% (24805/57685) Resolving deltas: 44% (25382/57685) Resolving deltas: 45% (25959/57685) Resolving deltas: 46% (26536/57685) Resolving deltas: 47% (27112/57685) Resolving deltas: 48% (27690/57685) Resolving deltas: 49% (28266/57685) Resolving deltas: 50% (28843/57685) Resolving deltas: 51% (29420/57685) Resolving deltas: 52% (29997/57685) Resolving deltas: 53% (30575/57685) Resolving deltas: 54% (31150/57685) Resolving deltas: 55% (31727/57685) Resolving deltas: 56% (32305/57685) Resolving deltas: 57% (32881/57685) Resolving deltas: 58% (33459/57685) Resolving deltas: 59% (34036/57685) Resolving deltas: 60% (34611/57685) Resolving deltas: 61% (35188/57685) Resolving deltas: 62% (35765/57685) Resolving deltas: 63% (36343/57685) Resolving deltas: 64% (36919/57685) Resolving deltas: 65% (37496/57685) Resolving deltas: 66% (38073/57685) Resolving deltas: 67% (38649/57685) Resolving deltas: 68% (39226/57685) Resolving deltas: 69% (39803/57685) Resolving deltas: 70% (40381/57685) Resolving deltas: 71% (40957/57685) Resolving deltas: 72% (41534/57685) Resolving deltas: 73% (42111/57685) Resolving deltas: 74% (42688/57685) Resolving deltas: 75% (43267/57685) Resolving deltas: 76% (43842/57685) Resolving deltas: 77% (44418/57685) Resolving deltas: 78% (44996/57685) Resolving deltas: 79% (45572/57685) Resolving deltas: 80% (46148/57685) Resolving deltas: 81% (46725/57685) Resolving deltas: 82% (47302/57685) Resolving deltas: 83% (47879/57685) Resolving deltas: 84% (48456/57685) Resolving deltas: 85% (49033/57685) Resolving deltas: 86% (49610/57685) Resolving deltas: 87% (50186/57685) Resolving deltas: 88% (50765/57685) Resolving deltas: 89% (51340/57685) Resolving deltas: 90% (51917/57685) Resolving deltas: 91% (52494/57685) Resolving deltas: 92% (53072/57685) Resolving deltas: 93% (53648/57685) Resolving deltas: 94% (54224/57685) Resolving deltas: 95% (54801/57685) Resolving deltas: 96% (55378/57685) Resolving deltas: 97% (55955/57685) Resolving deltas: 98% (56532/57685) Resolving deltas: 99% (57109/57685) Resolving deltas: 99% (57304/57685) Resolving deltas: 100% (57685/57685) Resolving deltas: 100% (57685/57685), done.
  9. 8.75 s Fetching commit 03811d86006efd33beb74d3960a473554851637e for faster_uv_from_4d ...
  10. 8.75 s $ /nix/store/bcnisk3ydfgv26v2gw3zlky24g00yww2-git-2.54.0/bin/git fetch origin 03811d86006efd33beb74d3960a473554851637e
  11. 9.15 s From https://github.com/alphal00p/gammaloop
  12. 9.15 s * branch 03811d86006efd33beb74d3960a473554851637e -> FETCH_HEAD
  13. 9.16 s $ /nix/store/9ypz3flqsrl5xl495mm8h645gadjsxi1-coreutils-9.11/bin/timeout --kill-after=15s 7200s /nix/store/bcnisk3ydfgv26v2gw3zlky24g00yww2-git-2.54.0/bin/git -c advice.detachedHead=false checkout 03811d86006efd33beb74d3960a473554851637e
  14. 9.47 s HEAD is now at 03811d860 record complete-forest progress and validation protocol
  15. 9.48 s $ /nix/store/9ypz3flqsrl5xl495mm8h645gadjsxi1-coreutils-9.11/bin/timeout --kill-after=15s 7200s /nix/store/23zk8sgzamrbmj1fday15szf7f2279s8-nix-2.34.7/bin/nix --extra-experimental-features nix-command --extra-experimental-features flakes --log-format internal-json run .#packages.x86_64-linux.nix-ci-check-gammaloop-nextest-core --print-build-logs
  16. 13.99 s
  17. 19.32 s evaluating derivation 'g copying '/nix/store/qas7 evaluating derivation 'g copying '/nix/store/qas7 evaluating derivation 'g copying '/nix/store/qas7 evaluating derivation 'g copying '/nix/store/qas7 evaluating derivation 'g copying '/nix/store/qas7 evaluating derivation 'g copying '/nix/store/qas7 evaluating derivation 'g copying '/nix/store/qas7 evaluating derivation 'g copying '/nix/store/qas7 evaluating derivation 'g querying gammaloop-nexte [0/1 built, 0.0 KiB DL] [1/0/1 built, 0.0 KiB DLgammaloop-nextest-core> Extracting 4 binaries (including 1 non-test binary), 1 build script output directory, and 2 linked paths to /build/nextest-archive-X7JZCH
  18. 20.01 s gammaloop-nextest-core> Extracted 20 files to /build/nextest-archive-X7JZCH in 0.69s
  19. 20.02 s gammaloop-nextest-core> ------------
  20. 20.02 s gammaloop-nextest-core> Nextest run ID 534566ea-69e2-4b9e-b216-d04f9e96f42a with nextest profile: ci_gammaloop
  21. 20.02 s gammaloop-nextest-core> Starting 379 tests across 3 binaries
  22. 21.33 s gammaloop-nextest-core> ------------
  23. 21.33 s gammaloop-nextest-core> Summary [ 1.310s] 379 tests run: 379 passed, 0 skipped
  24. 21.48 s gammaloop-nextest-core>
  25. 21.48 s gammaloop-nextest-core> ========== nextest test summary ==========
  26. 21.48 s gammaloop-nextest-core> report: target/nextest/ci_gammaloop/junit.xml
  27. 21.48 s gammaloop-nextest-core> tests: 379, failures: 0, errors: 0
  28. 21.48 s gammaloop-nextest-core> No failing testcases found.
  29. 21.48 s gammaloop-nextest-core> =========================================
  30. 21.50 s gammaloop-nextest-core> Extracting 1 binary and 1 linked path to /build/nextest-archive-B2fPxO
  31. 21.56 s gammaloop-nextest-core> Extracted 7 files to /build/nextest-archive-B2fPxO in 0.06s
  32. 21.57 s gammaloop-nextest-core> ------------
  33. 21.57 s gammaloop-nextest-core> Nextest run ID baab1f5b-5c54-46f1-8d52-d653d83eab97 with nextest profile: ci_gammaloop
  34. 21.57 s gammaloop-nextest-core> Starting 19 tests across 1 binary
  35. 21.58 s gammaloop-nextest-core> ------------
  36. 21.58 s gammaloop-nextest-core> Summary [ 0.012s] 19 tests run: 19 passed, 0 skipped
  37. 21.62 s gammaloop-nextest-core>
  38. 21.62 s gammaloop-nextest-core> ========== nextest test summary ==========
  39. 21.62 s gammaloop-nextest-core> report: target/nextest/ci_gammaloop/junit.xml
  40. 21.62 s gammaloop-nextest-core> tests: 19, failures: 0, errors: 0
  41. 21.62 s gammaloop-nextest-core> No failing testcases found.
  42. 21.62 s gammaloop-nextest-core> =========================================
  43. 21.64 s gammaloop-nextest-core> Extracting 1 binary to /build/nextest-archive-aCrv37
  44. 21.67 s gammaloop-nextest-core> Extracted 4 files to /build/nextest-archive-aCrv37 in 0.03s
  45. 21.68 s gammaloop-nextest-core> ------------
  46. 21.68 s gammaloop-nextest-core> Nextest run ID 57088720-cc7a-4d8c-821c-a5c7a47d31ac with nextest profile: ci_gammaloop
  47. 21.68 s gammaloop-nextest-core> Starting 0 tests across 1 binary
  48. 21.68 s gammaloop-nextest-core> ------------
  49. 21.68 s gammaloop-nextest-core> Summary [ 0.000s] 0 tests run: 0 passed, 0 skipped
  50. 21.71 s gammaloop-nextest-core>
  51. 21.71 s gammaloop-nextest-core> ========== nextest test summary ==========
  52. 21.71 s gammaloop-nextest-core> report: target/nextest/ci_gammaloop/junit.xml
  53. 21.71 s gammaloop-nextest-core> tests: 0, failures: 0, errors: 0
  54. 21.71 s gammaloop-nextest-core> No failing testcases found.
  55. 21.71 s gammaloop-nextest-core> =========================================
  56. 21.72 s gammaloop-nextest-core> Extracting 4 binaries, 1 build script output directory, and 2 linked paths to /build/nextest-archive-xOtrDC
  57. 22.20 s gammaloop-nextest-core> Extracted 18 files to /build/nextest-archive-xOtrDC in 0.48s
  58. 22.21 s gammaloop-nextest-core> ------------
  59. 22.21 s gammaloop-nextest-core> Nextest run ID a4c45fde-a4c0-49d4-9f9c-4ec09e76a988 with nextest profile: ci_gammaloop
  60. 22.21 s gammaloop-nextest-core> Starting 700 tests across 4 binaries (60 tests skipped, including 59 tests via profile.ci_gammaloop.default-filter)
  61. 32.75 s gammaloop-nextest-core> FAIL [ 5.733s] (695/700) gammalooprs::test_renormalization finite_part_ghost_2loop
  62. 32.75 s gammaloop-nextest-core> stdout ---
  63. 32.75 s gammaloop-nextest-core>
  64. 32.75 s gammaloop-nextest-core> running 1 test
  65. 32.75 s gammaloop-nextest-core> test finite_part_ghost_2loop ... FAILED
  66. 32.75 s gammaloop-nextest-core>
  67. 32.75 s gammaloop-nextest-core> failures:
  68. 32.75 s gammaloop-nextest-core>
  69. 32.75 s gammaloop-nextest-core> failures:
  70. 32.75 s gammaloop-nextest-core> finite_part_ghost_2loop
  71. 32.75 s gammaloop-nextest-core>
  72. 32.75 s gammaloop-nextest-core> test result: FAILED. 0 passed; 1 failed; 0 ignored; 0 measured; 6 filtered out; finished in 5.71s
  73. 32.75 s gammaloop-nextest-core>
  74. 32.75 s gammaloop-nextest-core> stderr ---
  75. 32.75 s gammaloop-nextest-core> The application panicked (crashed).
  76. 32.75 s gammaloop-nextest-core> Message: assertion failed: (align_to_rqft(&a, &model) - expected).expand().is_zero()
  77. 32.75 s gammaloop-nextest-core> Location: crates/gammalooprs/tests/test_renormalization.rs:583
  78. 32.75 s gammaloop-nextest-core>
  79. 32.75 s gammaloop-nextest-core> ━━━━━━━━━━━━━━━━━━━━━━━━━━━━━━━━━━ BACKTRACE ━━━━━━━━━━━━━━━━━━━━━━━━━━━━━━━━━━━
  80. 32.75 s gammaloop-nextest-core> 1: <color_eyre[51793ea62743adbd]::config::PanicHook>::panic_report<unknown>
  81. 32.75 s gammaloop-nextest-core> at <unknown source file>:<unknown line>
  82. 32.75 s gammaloop-nextest-core> 2: <color_eyre[51793ea62743adbd]::config::PanicHook>::into_panic_hook::{closure#0}<unknown>
  83. 32.75 s gammaloop-nextest-core> at <unknown source file>:<unknown line>
  84. 32.75 s gammaloop-nextest-core> 3: std[bcb96dfbba0ab899]::panicking::panic_with_hook<unknown>
  85. 32.75 s gammaloop-nextest-core> at <unknown source file>:<unknown line>
  86. 32.75 s gammaloop-nextest-core> 4: std[bcb96dfbba0ab899]::panicking::panic_handler::{closure#0}<unknown>
  87. 32.75 s gammaloop-nextest-core> at <unknown source file>:<unknown line>
  88. 32.75 s gammaloop-nextest-core> 5: std[bcb96dfbba0ab899]::sys::backtrace::__rust_end_short_backtrace::<std[bcb96dfbba0ab899]::panicking::panic_handler::{closure#0}, !><unknown>
  89. 32.75 s gammaloop-nextest-core> at <unknown source file>:<unknown line>
  90. 32.75 s gammaloop-nextest-core> 6: __rustc[6c289b9f9c454d21]::rust_begin_unwind<unknown>
  91. 32.75 s gammaloop-nextest-core> at <unknown source file>:<unknown line>
  92. 32.75 s gammaloop-nextest-core> 7: core[940e698046960fd5]::panicking::panic_fmt<unknown>
  93. 32.75 s gammaloop-nextest-core> at <unknown source file>:<unknown line>
  94. 32.75 s gammaloop-nextest-core> 8: core[940e698046960fd5]::panicking::panic<unknown>
  95. 32.75 s gammaloop-nextest-core> at <unknown source file>:<unknown line>
  96. 32.75 s gammaloop-nextest-core> 9: <test_renormalization[5812939ef1a04d89]::finite_part_ghost_2loop::{closure#0} as core[940e698046960fd5]::ops::function::FnOnce<()>>::call_once<unknown>
  97. 32.75 s gammaloop-nextest-core> at <unknown source file>:<unknown line>
  98. 32.75 s gammaloop-nextest-core> 10: test[75d6903177b1d7e9]::__rust_begin_short_backtrace::<core[940e698046960fd5]::result::Result<(), alloc[2ea6bcb46fca0c42]::string::String>, fn() -> core[940e698046960fd5]::result::Result<(), alloc[2ea6bcb46fca0c42]::string::String>><unknown>
  99. 32.75 s gammaloop-nextest-core> at <unknown source file>:<unknown line>
  100. 32.75 s gammaloop-nextest-core> 11: test[75d6903177b1d7e9]::run_test::{closure#0}<unknown>
  101. 32.75 s gammaloop-nextest-core> at <unknown source file>:<unknown line>
  102. 32.75 s gammaloop-nextest-core> 12: std[bcb96dfbba0ab899]::sys::backtrace::__rust_begin_short_backtrace::<test[75d6903177b1d7e9]::run_test::{closure#1}, ()><unknown>
  103. 32.75 s gammaloop-nextest-core> at <unknown source file>:<unknown line>
  104. 32.75 s gammaloop-nextest-core> 13: <std[bcb96dfbba0ab899]::thread::lifecycle::spawn_unchecked<test[75d6903177b1d7e9]::run_test::{closure#1}, ()>::{closure#1} as core[940e698046960fd5]::ops::function::FnOnce<()>>::call_once::{shim:vtable#0}<unknown>
  105. 32.75 s gammaloop-nextest-core> at <unknown source file>:<unknown line>
  106. 32.75 s gammaloop-nextest-core> 14: <std[bcb96dfbba0ab899]::sys::thread::unix::Thread>::new::thread_start<unknown>
  107. 32.75 s gammaloop-nextest-core> at <unknown source file>:<unknown line>
  108. 32.75 s gammaloop-nextest-core> 15: start_thread<unknown>
  109. 32.75 s gammaloop-nextest-core> at <unknown source file>:<unknown line>
  110. 32.75 s gammaloop-nextest-core> 16: __clone3<unknown>
  111. 32.75 s gammaloop-nextest-core> at <unknown source file>:<unknown line>
  112. 32.75 s gammaloop-nextest-core>
  113. 32.75 s gammaloop-nextest-core> Run with COLORBT_SHOW_HIDDEN=1 environment variable to disable frame filtering.
  114. 32.75 s gammaloop-nextest-core> Run with RUST_BACKTRACE=full to include source snippets.
  115. 32.75 s gammaloop-nextest-core>
  116. 39.22 s gammaloop-nextest-core> ------------
  117. 39.22 s gammaloop-nextest-core> Summary [ 17.008s] 700 tests run: 699 passed, 1 failed, 60 skipped
  118. 39.22 s gammaloop-nextest-core> FAIL [ 5.733s] (695/700) gammalooprs::test_renormalization finite_part_ghost_2loop
  119. 39.22 s gammaloop-nextest-core> stdout ---
  120. 39.22 s gammaloop-nextest-core>
  121. 39.22 s gammaloop-nextest-core> running 1 test
  122. 39.22 s gammaloop-nextest-core> test finite_part_ghost_2loop ... FAILED
  123. 39.22 s gammaloop-nextest-core>
  124. 39.22 s gammaloop-nextest-core> failures:
  125. 39.22 s gammaloop-nextest-core>
  126. 39.22 s gammaloop-nextest-core> failures:
  127. 39.22 s gammaloop-nextest-core> finite_part_ghost_2loop
  128. 39.22 s gammaloop-nextest-core>
  129. 39.22 s gammaloop-nextest-core> test result: FAILED. 0 passed; 1 failed; 0 ignored; 0 measured; 6 filtered out; finished in 5.71s
  130. 39.22 s gammaloop-nextest-core>
  131. 39.22 s gammaloop-nextest-core> stderr ---
  132. 39.22 s gammaloop-nextest-core> The application panicked (crashed).
  133. 39.22 s gammaloop-nextest-core> Message: assertion failed: (align_to_rqft(&a, &model) - expected).expand().is_zero()
  134. 39.22 s gammaloop-nextest-core> Location: crates/gammalooprs/tests/test_renormalization.rs:583
  135. 39.22 s gammaloop-nextest-core>
  136. 39.22 s gammaloop-nextest-core> ━━━━━━━━━━━━━━━━━━━━━━━━━━━━━━━━━━ BACKTRACE ━━━━━━━━━━━━━━━━━━━━━━━━━━━━━━━━━━━
  137. 39.22 s gammaloop-nextest-core> 1: <color_eyre[51793ea62743adbd]::config::PanicHook>::panic_report<unknown>
  138. 39.22 s gammaloop-nextest-core> at <unknown source file>:<unknown line>
  139. 39.22 s gammaloop-nextest-core> 2: <color_eyre[51793ea62743adbd]::config::PanicHook>::into_panic_hook::{closure#0}<unknown>
  140. 39.22 s gammaloop-nextest-core> at <unknown source file>:<unknown line>
  141. 39.22 s gammaloop-nextest-core> 3: std[bcb96dfbba0ab899]::panicking::panic_with_hook<unknown>
  142. 39.22 s gammaloop-nextest-core> at <unknown source file>:<unknown line>
  143. 39.22 s gammaloop-nextest-core> 4: std[bcb96dfbba0ab899]::panicking::panic_handler::{closure#0}<unknown>
  144. 39.22 s gammaloop-nextest-core> at <unknown source file>:<unknown line>
  145. 39.22 s gammaloop-nextest-core> 5: std[bcb96dfbba0ab899]::sys::backtrace::__rust_end_short_backtrace::<std[bcb96dfbba0ab899]::panicking::panic_handler::{closure#0}, !><unknown>
  146. 39.22 s gammaloop-nextest-core> at <unknown source file>:<unknown line>
  147. 39.22 s gammaloop-nextest-core> 6: __rustc[6c289b9f9c454d21]::rust_begin_unwind<unknown>
  148. 39.22 s gammaloop-nextest-core> at <unknown source file>:<unknown line>
  149. 39.22 s gammaloop-nextest-core> 7: core[940e698046960fd5]::panicking::panic_fmt<unknown>
  150. 39.22 s gammaloop-nextest-core> at <unknown source file>:<unknown line>
  151. 39.22 s gammaloop-nextest-core> 8: core[940e698046960fd5]::panicking::panic<unknown>
  152. 39.22 s gammaloop-nextest-core> at <unknown source file>:<unknown line>
  153. 39.22 s gammaloop-nextest-core> 9: <test_renormalization[5812939ef1a04d89]::finite_part_ghost_2loop::{closure#0} as core[940e698046960fd5]::ops::function::FnOnce<()>>::call_once<unknown>
  154. 39.22 s gammaloop-nextest-core> at <unknown source file>:<unknown line>
  155. 39.22 s gammaloop-nextest-core> 10: test[75d6903177b1d7e9]::__rust_begin_short_backtrace::<core[940e698046960fd5]::result::Result<(), alloc[2ea6bcb46fca0c42]::string::String>, fn() -> core[940e698046960fd5]::result::Result<(), alloc[2ea6bcb46fca0c42]::string::String>><unknown>
  156. 39.22 s gammaloop-nextest-core> at <unknown source file>:<unknown line>
  157. 39.22 s gammaloop-nextest-core> 11: test[75d6903177b1d7e9]::run_test::{closure#0}<unknown>
  158. 39.22 s gammaloop-nextest-core> at <unknown source file>:<unknown line>
  159. 39.22 s gammaloop-nextest-core> 12: std[bcb96dfbba0ab899]::sys::backtrace::__rust_begin_short_backtrace::<test[75d6903177b1d7e9]::run_test::{closure#1}, ()><unknown>
  160. 39.22 s gammaloop-nextest-core> at <unknown source file>:<unknown line>
  161. 39.22 s gammaloop-nextest-core> 13: <std[bcb96dfbba0ab899]::thread::lifecycle::spawn_unchecked<test[75d6903177b1d7e9]::run_test::{closure#1}, ()>::{closure#1} as core[940e698046960fd5]::ops::function::FnOnce<()>>::call_once::{shim:vtable#0}<unknown>
  162. 39.22 s gammaloop-nextest-core> at <unknown source file>:<unknown line>
  163. 39.22 s gammaloop-nextest-core> 14: <std[bcb96dfbba0ab899]::sys::thread::unix::Thread>::new::thread_start<unknown>
  164. 39.22 s gammaloop-nextest-core> at <unknown source file>:<unknown line>
  165. 39.22 s gammaloop-nextest-core> 15: start_thread<unknown>
  166. 39.22 s gammaloop-nextest-core> at <unknown source file>:<unknown line>
  167. 39.22 s gammaloop-nextest-core> 16: __clone3<unknown>
  168. 39.22 s gammaloop-nextest-core> at <unknown source file>:<unknown line>
  169. 39.22 s gammaloop-nextest-core>
  170. 39.22 s gammaloop-nextest-core> Run with COLORBT_SHOW_HIDDEN=1 environment variable to disable frame filtering.
  171. 39.22 s gammaloop-nextest-core> Run with RUST_BACKTRACE=full to include source snippets.
  172. 39.22 s gammaloop-nextest-core>
  173. 39.32 s gammaloop-nextest-core> error: test run failed
  174. 39.36 s gammaloop-nextest-core>
  175. 39.36 s gammaloop-nextest-core> ========== nextest test summary ==========
  176. 39.36 s gammaloop-nextest-core> report: target/nextest/ci_gammaloop/junit.xml
  177. 39.36 s gammaloop-nextest-core> tests: 700, failures: 1, errors: 0
  178. 39.36 s gammaloop-nextest-core>
  179. 39.36 s gammaloop-nextest-core> 1. gammalooprs::test_renormalization::finite_part_ghost_2loop
  180. 39.36 s gammaloop-nextest-core> failure: test failure with exit code 101
  181. 39.36 s gammaloop-nextest-core> system-out
  182. 39.36 s gammaloop-nextest-core> running 1 test
  183. 39.36 s gammaloop-nextest-core> test finite_part_ghost_2loop ... FAILED
  184. 39.36 s gammaloop-nextest-core>
  185. 39.36 s gammaloop-nextest-core> failures:
  186. 39.36 s gammaloop-nextest-core>
  187. 39.36 s gammaloop-nextest-core> failures:
  188. 39.36 s gammaloop-nextest-core> finite_part_ghost_2loop
  189. 39.36 s gammaloop-nextest-core>
  190. 39.36 s gammaloop-nextest-core> test result: FAILED. 0 passed; 1 failed; 0 ignored; 0 measured; 6 filtered out; finished in 5.71s
  191. 39.36 s gammaloop-nextest-core> system-err
  192. 39.36 s gammaloop-nextest-core> The application panicked (crashed).
  193. 39.36 s gammaloop-nextest-core> Message: assertion failed: (align_to_rqft(&a, &model) - expected).expand().is_zero()
  194. 39.36 s gammaloop-nextest-core> Location: crates/gammalooprs/tests/test_renormalization.rs:583
  195. 39.36 s gammaloop-nextest-core>
  196. 39.36 s gammaloop-nextest-core> ━━━━━━━━━━━━━━━━━━━━━━━━━━━━━━━━━━ BACKTRACE ━━━━━━━━━━━━━━━━━━━━━━━━━━━━━━━━━━━
  197. 39.36 s gammaloop-nextest-core> 1: <color_eyre[51793ea62743adbd]::config::PanicHook>::panic_report<unknown>
  198. 39.36 s gammaloop-nextest-core> at <unknown source file>:<unknown line>
  199. 39.36 s gammaloop-nextest-core> 2: <color_eyre[51793ea62743adbd]::config::PanicHook>::into_panic_hook::{closure#0}<unknown>
  200. 39.36 s gammaloop-nextest-core> at <unknown source file>:<unknown line>
  201. 39.36 s gammaloop-nextest-core> 3: std[bcb96dfbba0ab899]::panicking::panic_with_hook<unknown>
  202. 39.36 s gammaloop-nextest-core> at <unknown source file>:<unknown line>
  203. 39.36 s gammaloop-nextest-core> 4: std[bcb96dfbba0ab899]::panicking::panic_handler::{closure#0}<unknown>
  204. 39.36 s gammaloop-nextest-core> at <unknown source file>:<unknown line>
  205. 39.36 s gammaloop-nextest-core> 5: std[bcb96dfbba0ab899]::sys::backtrace::__rust_end_short_backtrace::<std[bcb96dfbba0ab899]::panicking::panic_handler::{closure#0}, !><unknown>
  206. 39.36 s gammaloop-nextest-core> at <unknown source file>:<unknown line>
  207. 39.36 s gammaloop-nextest-core> 6: __rustc[6c289b9f9c454d21]::rust_begin_unwind<unknown>
  208. 39.36 s gammaloop-nextest-core> at <unknown source file>:<unknown line>
  209. 39.36 s gammaloop-nextest-core> 7: core[940e698046960fd5]::panicking::panic_fmt<unknown>
  210. 39.36 s gammaloop-nextest-core> at <unknown source file>:<unknown line>
  211. 39.36 s gammaloop-nextest-core> 8: core[940e698046960fd5]::panicking::panic<unknown>
  212. 39.36 s gammaloop-nextest-core> at <unknown source file>:<unknown line>
  213. 39.36 s gammaloop-nextest-core> 9: <test_renormalization[5812939ef1a04d89]::finite_part_ghost_2loop::{closure#0} as core[940e698046960fd5]::ops::function::FnOnce<()>>::call_once<unknown>
  214. 39.36 s gammaloop-nextest-core> at <unknown source file>:<unknown line>
  215. 39.36 s gammaloop-nextest-core> 10: test[75d6903177b1d7e9]::__rust_begin_short_backtrace::<core[940e698046960fd5]::result::Result<(), alloc[2ea6bcb46fca0c42]::string::String>, fn() -> core[940e698046960fd5]::result::Result<(), alloc[2ea6bcb46fca0c42]::string::String>><unknown>
  216. 39.36 s gammaloop-nextest-core> at <unknown source file>:<unknown line>
  217. 39.36 s gammaloop-nextest-core> 11: test[75d6903177b1d7e9]::run_test::{closure#0}<unknown>
  218. 39.36 s gammaloop-nextest-core> at <unknown source file>:<unknown line>
  219. 39.36 s gammaloop-nextest-core> 12: std[bcb96dfbba0ab899]::sys::backtrace::__rust_begin_short_backtrace::<test[75d6903177b1d7e9]::run_test::{closure#1}, ()><unknown>
  220. 39.36 s gammaloop-nextest-core> at <unknown source file>:<unknown line>
  221. 39.36 s gammaloop-nextest-core> 13: <std[bcb96dfbba0ab899]::thread::lifecycle::spawn_unchecked<test[75d6903177b1d7e9]::run_test::{closure#1}, ()>::{closure#1} as core[940e698046960fd5]::ops::function::FnOnce<()>>::call_once::{shim:vtable#0}<unknown>
  222. 39.36 s gammaloop-nextest-core> at <unknown source file>:<unknown line>
  223. 39.36 s gammaloop-nextest-core> 14: <std[bcb96dfbba0ab899]::sys::thread::unix::Thread>::new::thread_start<unknown>
  224. 39.36 s gammaloop-nextest-core> at <unknown source file>:<unknown line>
  225. 39.36 s gammaloop-nextest-core> 15: start_thread<unknown>
  226. 39.36 s gammaloop-nextest-core> at <unknown source file>:<unknown line>
  227. 39.36 s gammaloop-nextest-core> 16: __clone3<unknown>
  228. 39.36 s gammaloop-nextest-core> at <unknown source file>:<unknown line>
  229. 39.36 s gammaloop-nextest-core>
  230. 39.36 s gammaloop-nextest-core> Run with COLORBT_SHOW_HIDDEN=1 environment variable to disable frame filtering.
  231. 39.36 s gammaloop-nextest-core> Run with RUST_BACKTRACE=full to include source snippets.
  232. 39.36 s gammaloop-nextest-core> =========================================
  233. 39.38 s gammaloop-nextest-core> Extracting 1 binary, 1 build script output directory, and 1 linked path to /build/nextest-archive-XQMP46
  234. 39.48 s gammaloop-nextest-core> Extracted 7 files to /build/nextest-archive-XQMP46 in 0.10s
  235. 39.50 s gammaloop-nextest-core> ------------
  236. 39.50 s gammaloop-nextest-core> Nextest run ID db82af5c-80cf-447c-9681-7173942e53a2 with nextest profile: ci_gammaloop
  237. 39.50 s gammaloop-nextest-core> Starting 105 tests across 1 binary
  238. 58.68 s gammaloop-nextest-core> ------------
  239. 58.68 s gammaloop-nextest-core> Summary [ 19.177s] 105 tests run: 105 passed, 0 skipped
  240. 58.72 s gammaloop-nextest-core>
  241. 58.72 s gammaloop-nextest-core> ========== nextest test summary ==========
  242. 58.72 s gammaloop-nextest-core> report: target/nextest/ci_gammaloop/junit.xml
  243. 58.72 s gammaloop-nextest-core> tests: 105, failures: 0, errors: 0
  244. 58.72 s gammaloop-nextest-core> No failing testcases found.
  245. 58.72 s gammaloop-nextest-core> =========================================
  246. 58.77 s [0 built (1 failed), 0.0error: Cannot build '/nix/store/7i3bc9vasq286igikm494rqdb64pilng-gammaloop-nextest-core.drv'.
  247. 58.77 s Reason: builder failed with exit code 100.
  248. 58.77 s Output paths:
  249. 58.77 s /nix/store/qy71i8wcdw8ab7bw8mzbn9n7pvbz0dql-gammaloop-nextest-core
  250. 58.77 s Last 229 log lines:
  251. 58.77 s > Extracting 4 binaries (including 1 non-test binary), 1 build script output directory, and 2 linked paths to /build/nextest-archive-X7JZCH
  252. 58.77 s > Extracted 20 files to /build/nextest-archive-X7JZCH in 0.69s
  253. 58.77 s > ------------
  254. 58.77 s > Nextest run ID 534566ea-69e2-4b9e-b216-d04f9e96f42a with nextest profile: ci_gammaloop
  255. 58.77 s > Starting 379 tests across 3 binaries
  256. 58.77 s > ------------
  257. 58.77 s > Summary [ 1.310s] 379 tests run: 379 passed, 0 skipped
  258. 58.77 s >
  259. 58.77 s > ========== nextest test summary ==========
  260. 58.77 s > report: target/nextest/ci_gammaloop/junit.xml
  261. 58.77 s > tests: 379, failures: 0, errors: 0
  262. 58.77 s > No failing testcases found.
  263. 58.77 s > =========================================
  264. 58.77 s > Extracting 1 binary and 1 linked path to /build/nextest-archive-B2fPxO
  265. 58.77 s > Extracted 7 files to /build/nextest-archive-B2fPxO in 0.06s
  266. 58.77 s > ------------
  267. 58.77 s > Nextest run ID baab1f5b-5c54-46f1-8d52-d653d83eab97 with nextest profile: ci_gammaloop
  268. 58.77 s > Starting 19 tests across 1 binary
  269. 58.77 s > ------------
  270. 58.77 s > Summary [ 0.012s] 19 tests run: 19 passed, 0 skipped
  271. 58.77 s >
  272. 58.77 s > ========== nextest test summary ==========
  273. 58.77 s > report: target/nextest/ci_gammaloop/junit.xml
  274. 58.77 s > tests: 19, failures: 0, errors: 0
  275. 58.77 s > No failing testcases found.
  276. 58.77 s > =========================================
  277. 58.77 s > Extracting 1 binary to /build/nextest-archive-aCrv37
  278. 58.77 s > Extracted 4 files to /build/nextest-archive-aCrv37 in 0.03s
  279. 58.77 s > ------------
  280. 58.77 s > Nextest run ID 57088720-cc7a-4d8c-821c-a5c7a47d31ac with nextest profile: ci_gammaloop
  281. 58.77 s > Starting 0 tests across 1 binary
  282. 58.77 s > ------------
  283. 58.77 s > Summary [ 0.000s] 0 tests run: 0 passed, 0 skipped
  284. 58.77 s >
  285. 58.77 s > ========== nextest test summary ==========
  286. 58.77 s > report: target/nextest/ci_gammaloop/junit.xml
  287. 58.77 s > tests: 0, failures: 0, errors: 0
  288. 58.77 s > No failing testcases found.
  289. 58.77 s > =========================================
  290. 58.77 s > Extracting 4 binaries, 1 build script output directory, and 2 linked paths to /build/nextest-archive-xOtrDC
  291. 58.77 s > Extracted 18 files to /build/nextest-archive-xOtrDC in 0.48s
  292. 58.77 s > ------------
  293. 58.77 s > Nextest run ID a4c45fde-a4c0-49d4-9f9c-4ec09e76a988 with nextest profile: ci_gammaloop
  294. 58.77 s > Starting 700 tests across 4 binaries (60 tests skipped, including 59 tests via profile.ci_gammaloop.default-filter)
  295. 58.77 s > FAIL [ 5.733s] (695/700) gammalooprs::test_renormalization finite_part_ghost_2loop
  296. 58.77 s > stdout ---
  297. 58.77 s >
  298. 58.77 s > running 1 test
  299. 58.77 s > test finite_part_ghost_2loop ... FAILED
  300. 58.77 s >
  301. 58.77 s > failures:
  302. 58.77 s >
  303. 58.77 s > failures:
  304. 58.77 s > finite_part_ghost_2loop
  305. 58.77 s >
  306. 58.77 s > test result: FAILED. 0 passed; 1 failed; 0 ignored; 0 measured; 6 filtered out; finished in 5.71s
  307. 58.77 s >
  308. 58.77 s > stderr ---
  309. 58.77 s > The application panicked (crashed).
  310. 58.77 s > Message: assertion failed: (align_to_rqft(&a, &model) - expected).expand().is_zero()
  311. 58.77 s > Location: crates/gammalooprs/tests/test_renormalization.rs:583
  312. 58.77 s >
  313. 58.77 s > ━━━━━━━━━━━━━━━━━━━━━━━━━━━━━━━━━━ BACKTRACE ━━━━━━━━━━━━━━━━━━━━━━━━━━━━━━━━━━━
  314. 58.77 s > 1: <color_eyre[51793ea62743adbd]::config::PanicHook>::panic_report<unknown>
  315. 58.77 s > at <unknown source file>:<unknown line>
  316. 58.77 s > 2: <color_eyre[51793ea62743adbd]::config::PanicHook>::into_panic_hook::{closure#0}<unknown>
  317. 58.77 s > at <unknown source file>:<unknown line>
  318. 58.77 s > 3: std[bcb96dfbba0ab899]::panicking::panic_with_hook<unknown>
  319. 58.77 s > at <unknown source file>:<unknown line>
  320. 58.77 s > 4: std[bcb96dfbba0ab899]::panicking::panic_handler::{closure#0}<unknown>
  321. 58.77 s > at <unknown source file>:<unknown line>
  322. 58.77 s > 5: std[bcb96dfbba0ab899]::sys::backtrace::__rust_end_short_backtrace::<std[bcb96dfbba0ab899]::panicking::panic_handler::{closure#0}, !><unknown>
  323. 58.77 s > at <unknown source file>:<unknown line>
  324. 58.77 s > 6: __rustc[6c289b9f9c454d21]::rust_begin_unwind<unknown>
  325. 58.77 s > at <unknown source file>:<unknown line>
  326. 58.77 s > 7: core[940e698046960fd5]::panicking::panic_fmt<unknown>
  327. 58.77 s > at <unknown source file>:<unknown line>
  328. 58.77 s > 8: core[940e698046960fd5]::panicking::panic<unknown>
  329. 58.77 s > at <unknown source file>:<unknown line>
  330. 58.77 s > 9: <test_renormalization[5812939ef1a04d89]::finite_part_ghost_2loop::{closure#0} as core[940e698046960fd5]::ops::function::FnOnce<()>>::call_once<unknown>
  331. 58.77 s > at <unknown source file>:<unknown line>
  332. 58.77 s > 10: test[75d6903177b1d7e9]::__rust_begin_short_backtrace::<core[940e698046960fd5]::result::Result<(), alloc[2ea6bcb46fca0c42]::string::String>, fn() -> core[940e698046960fd5]::result::Result<(), alloc[2ea6bcb46fca0c42]::string::String>><unknown>
  333. 58.77 s > at <unknown source file>:<unknown line>
  334. 58.77 s > 11: test[75d6903177b1d7e9]::run_test::{closure#0}<unknown>
  335. 58.77 s > at <unknown source file>:<unknown line>
  336. 58.77 s > 12: std[bcb96dfbba0ab899]::sys::backtrace::__rust_begin_short_backtrace::<test[75d6903177b1d7e9]::run_test::{closure#1}, ()><unknown>
  337. 58.77 s > at <unknown source file>:<unknown line>
  338. 58.77 s > 13: <std[bcb96dfbba0ab899]::thread::lifecycle::spawn_unchecked<test[75d6903177b1d7e9]::run_test::{closure#1}, ()>::{closure#1} as core[940e698046960fd5]::ops::function::FnOnce<()>>::call_once::{shim:vtable#0}<unknown>
  339. 58.77 s > at <unknown source file>:<unknown line>
  340. 58.77 s > 14: <std[bcb96dfbba0ab899]::sys::thread::unix::Thread>::new::thread_start<unknown>
  341. 58.77 s > at <unknown source file>:<unknown line>
  342. 58.77 s > 15: start_thread<unknown>
  343. 58.77 s > at <unknown source file>:<unknown line>
  344. 58.77 s > 16: __clone3<unknown>
  345. 58.77 s > at <unknown source file>:<unknown line>
  346. 58.77 s >
  347. 58.77 s > Run with COLORBT_SHOW_HIDDEN=1 environment variable to disable frame filtering.
  348. 58.77 s > Run with RUST_BACKTRACE=full to include source snippets.
  349. 58.77 s >
  350. 58.77 s > ------------
  351. 58.77 s > Summary [ 17.008s] 700 tests run: 699 passed, 1 failed, 60 skipped
  352. 58.77 s > FAIL [ 5.733s] (695/700) gammalooprs::test_renormalization finite_part_ghost_2loop
  353. 58.77 s > stdout ---
  354. 58.77 s >
  355. 58.77 s > running 1 test
  356. 58.77 s > test finite_part_ghost_2loop ... FAILED
  357. 58.77 s >
  358. 58.77 s > failures:
  359. 58.77 s >
  360. 58.77 s > failures:
  361. 58.77 s > finite_part_ghost_2loop
  362. 58.77 s >
  363. 58.77 s > test result: FAILED. 0 passed; 1 failed; 0 ignored; 0 measured; 6 filtered out; finished in 5.71s
  364. 58.77 s >
  365. 58.77 s > stderr ---
  366. 58.77 s > The application panicked (crashed).
  367. 58.77 s > Message: assertion failed: (align_to_rqft(&a, &model) - expected).expand().is_zero()
  368. 58.77 s > Location: crates/gammalooprs/tests/test_renormalization.rs:583
  369. 58.77 s >
  370. 58.77 s > ━━━━━━━━━━━━━━━━━━━━━━━━━━━━━━━━━━ BACKTRACE ━━━━━━━━━━━━━━━━━━━━━━━━━━━━━━━━━━━
  371. 58.77 s > 1: <color_eyre[51793ea62743adbd]::config::PanicHook>::panic_report<unknown>
  372. 58.77 s > at <unknown source file>:<unknown line>
  373. 58.77 s > 2: <color_eyre[51793ea62743adbd]::config::PanicHook>::into_panic_hook::{closure#0}<unknown>
  374. 58.77 s > at <unknown source file>:<unknown line>
  375. 58.77 s > 3: std[bcb96dfbba0ab899]::panicking::panic_with_hook<unknown>
  376. 58.77 s > at <unknown source file>:<unknown line>
  377. 58.77 s > 4: std[bcb96dfbba0ab899]::panicking::panic_handler::{closure#0}<unknown>
  378. 58.77 s > at <unknown source file>:<unknown line>
  379. 58.77 s > 5: std[bcb96dfbba0ab899]::sys::backtrace::__rust_end_short_backtrace::<std[bcb96dfbba0ab899]::panicking::panic_handler::{closure#0}, !><unknown>
  380. 58.77 s > at <unknown source file>:<unknown line>
  381. 58.77 s > 6: __rustc[6c289b9f9c454d21]::rust_begin_unwind<unknown>
  382. 58.77 s > at <unknown source file>:<unknown line>
  383. 58.77 s > 7: core[940e698046960fd5]::panicking::panic_fmt<unknown>
  384. 58.77 s > at <unknown source file>:<unknown line>
  385. 58.77 s > 8: core[940e698046960fd5]::panicking::panic<unknown>
  386. 58.77 s > at <unknown source file>:<unknown line>
  387. 58.77 s > 9: <test_renormalization[5812939ef1a04d89]::finite_part_ghost_2loop::{closure#0} as core[940e698046960fd5]::ops::function::FnOnce<()>>::call_once<unknown>
  388. 58.77 s > at <unknown source file>:<unknown line>
  389. 58.77 s > 10: test[75d6903177b1d7e9]::__rust_begin_short_backtrace::<core[940e698046960fd5]::result::Result<(), alloc[2ea6bcb46fca0c42]::string::String>, fn() -> core[940e698046960fd5]::result::Result<(), alloc[2ea6bcb46fca0c42]::string::String>><unknown>
  390. 58.77 s > at <unknown source file>:<unknown line>
  391. 58.77 s > 11: test[75d6903177b1d7e9]::run_test::{closure#0}<unknown>
  392. 58.77 s > at <unknown source file>:<unknown line>
  393. 58.77 s > 12: std[bcb96dfbba0ab899]::sys::backtrace::__rust_begin_short_backtrace::<test[75d6903177b1d7e9]::run_test::{closure#1}, ()><unknown>
  394. 58.77 s > at <unknown source file>:<unknown line>
  395. 58.77 s > 13: <std[bcb96dfbba0ab899]::thread::lifecycle::spawn_unchecked<test[75d6903177b1d7e9]::run_test::{closure#1}, ()>::{closure#1} as core[940e698046960fd5]::ops::function::FnOnce<()>>::call_once::{shim:vtable#0}<unknown>
  396. 58.77 s > at <unknown source file>:<unknown line>
  397. 58.77 s > 14: <std[bcb96dfbba0ab899]::sys::thread::unix::Thread>::new::thread_start<unknown>
  398. 58.77 s > at <unknown source file>:<unknown line>
  399. 58.77 s > 15: start_thread<unknown>
  400. 58.77 s > at <unknown source file>:<unknown line>
  401. 58.77 s > 16: __clone3<unknown>
  402. 58.77 s > at <unknown source file>:<unknown line>
  403. 58.77 s >
  404. 58.77 s > Run with COLORBT_SHOW_HIDDEN=1 environment variable to disable frame filtering.
  405. 58.77 s > Run with RUST_BACKTRACE=full to include source snippets.
  406. 58.77 s >
  407. 58.77 s > error: test run failed
  408. 58.77 s >
  409. 58.77 s > ========== nextest test summary ==========
  410. 58.77 s > report: target/nextest/ci_gammaloop/junit.xml
  411. 58.77 s > tests: 700, failures: 1, errors: 0
  412. 58.77 s >
  413. 58.77 s > 1. gammalooprs::test_renormalization::finite_part_ghost_2loop
  414. 58.77 s > failure: test failure with exit code 101
  415. 58.77 s > system-out
  416. 58.77 s > running 1 test
  417. 58.77 s > test finite_part_ghost_2loop ... FAILED
  418. 58.77 s >
  419. 58.77 s > failures:
  420. 58.77 s >
  421. 58.77 s > failures:
  422. 58.77 s > finite_part_ghost_2loop
  423. 58.77 s >
  424. 58.77 s > test result: FAILED. 0 passed; 1 failed; 0 ignored; 0 measured; 6 filtered out; finished in 5.71s
  425. 58.77 s > system-err
  426. 58.77 s > The application panicked (crashed).
  427. 58.77 s > Message: assertion failed: (align_to_rqft(&a, &model) - expected).expand().is_zero()
  428. 58.77 s > Location: crates/gammalooprs/tests/test_renormalization.rs:583
  429. 58.77 s >
  430. 58.77 s > ━━━━━━━━━━━━━━━━━━━━━━━━━━━━━━━━━━ BACKTRACE ━━━━━━━━━━━━━━━━━━━━━━━━━━━━━━━━━━━
  431. 58.77 s > 1: <color_eyre[51793ea62743adbd]::config::PanicHook>::panic_report<unknown>
  432. 58.77 s > at <unknown source file>:<unknown line>
  433. 58.77 s > 2: <color_eyre[51793ea62743adbd]::config::PanicHook>::into_panic_hook::{closure#0}<unknown>
  434. 58.77 s > at <unknown source file>:<unknown line>
  435. 58.77 s > 3: std[bcb96dfbba0ab899]::panicking::panic_with_hook<unknown>
  436. 58.77 s > at <unknown source file>:<unknown line>
  437. 58.77 s > 4: std[bcb96dfbba0ab899]::panicking::panic_handler::{closure#0}<unknown>
  438. 58.77 s > at <unknown source file>:<unknown line>
  439. 58.77 s > 5: std[bcb96dfbba0ab899]::sys::backtrace::__rust_end_short_backtrace::<std[bcb96dfbba0ab899]::panicking::panic_handler::{closure#0}, !><unknown>
  440. 58.77 s > at <unknown source file>:<unknown line>
  441. 58.77 s > 6: __rustc[6c289b9f9c454d21]::rust_begin_unwind<unknown>
  442. 58.77 s > at <unknown source file>:<unknown line>
  443. 58.77 s > 7: core[940e698046960fd5]::panicking::panic_fmt<unknown>
  444. 58.77 s > at <unknown source file>:<unknown line>
  445. 58.77 s > 8: core[940e698046960fd5]::panicking::panic<unknown>
  446. 58.77 s > at <unknown source file>:<unknown line>
  447. 58.77 s > 9: <test_renormalization[5812939ef1a04d89]::finite_part_ghost_2loop::{closure#0} as core[940e698046960fd5]::ops::function::FnOnce<()>>::call_once<unknown>
  448. 58.77 s > at <unknown source file>:<unknown line>
  449. 58.77 s > 10: test[75d6903177b1d7e9]::__rust_begin_short_backtrace::<core[940e698046960fd5]::result::Result<(), alloc[2ea6bcb46fca0c42]::string::String>, fn() -> core[940e698046960fd5]::result::Result<(), alloc[2ea6bcb46fca0c42]::string::String>><unknown>
  450. 58.77 s > at <unknown source file>:<unknown line>
  451. 58.77 s > 11: test[75d6903177b1d7e9]::run_test::{closure#0}<unknown>
  452. 58.77 s > at <unknown source file>:<unknown line>
  453. 58.77 s > 12: std[bcb96dfbba0ab899]::sys::backtrace::__rust_begin_short_backtrace::<test[75d6903177b1d7e9]::run_test::{closure#1}, ()><unknown>
  454. 58.77 s > at <unknown source file>:<unknown line>
  455. 58.77 s > 13: <std[bcb96dfbba0ab899]::thread::lifecycle::spawn_unchecked<test[75d6903177b1d7e9]::run_test::{closure#1}, ()>::{closure#1} as core[940e698046960fd5]::ops::function::FnOnce<()>>::call_once::{shim:vtable#0}<unknown>
  456. 58.77 s > at <unknown source file>:<unknown line>
  457. 58.77 s > 14: <std[bcb96dfbba0ab899]::sys::thread::unix::Thread>::new::thread_start<unknown>
  458. 58.77 s > at <unknown source file>:<unknown line>
  459. 58.77 s > 15: start_thread<unknown>
  460. 58.77 s > at <unknown source file>:<unknown line>
  461. 58.77 s > 16: __clone3<unknown>
  462. 58.77 s > at <unknown source file>:<unknown line>
  463. 58.77 s >
  464. 58.77 s > Run with COLORBT_SHOW_HIDDEN=1 environment variable to disable frame filtering.
  465. 58.77 s > Run with RUST_BACKTRACE=full to include source snippets.
  466. 58.77 s > =========================================
  467. 58.77 s > Extracting 1 binary, 1 build script output directory, and 1 linked path to /build/nextest-archive-XQMP46
  468. 58.77 s > Extracted 7 files to /build/nextest-archive-XQMP46 in 0.10s
  469. 58.77 s > ------------
  470. 58.77 s > Nextest run ID db82af5c-80cf-447c-9681-7173942e53a2 with nextest profile: ci_gammaloop
  471. 58.77 s > Starting 105 tests across 1 binary
  472. 58.77 s > ------------
  473. 58.77 s > Summary [ 19.177s] 105 tests run: 105 passed, 0 skipped
  474. 58.77 s >
  475. 58.77 s > ========== nextest test summary ==========
  476. 58.77 s > report: target/nextest/ci_gammaloop/junit.xml
  477. 58.77 s > tests: 105, failures: 0, errors: 0
  478. 58.77 s > No failing testcases found.
  479. 58.77 s > =========================================
  480. 58.77 s For full logs, run:
  481. 58.77 s nix log /nix/store/7i3bc9vasq286igikm494rqdb64pilng-gammaloop-nextest-core.drv
  482. 58.90 s Run failed.