0.00 s
$ /nix/store/9ypz3flqsrl5xl495mm8h645gadjsxi1-coreutils-9.11/bin/timeout --kill-after=15s 7200s /nix/store/23zk8sgzamrbmj1fday15szf7f2279s8-nix-2.34.7/bin/nix --extra-experimental-features nix-command --extra-experimental-features flakes flake clone git+https://github.com/alphal00p/gammaloop --dest /tmp/nix-ci-worker/stable-pwd/repo/
0.08 s
Cloning into '/tmp/nix-ci-worker/stable-pwd/repo'...
0.75 s
remote: Enumerating objects: 85207, done.
0.86 s
remote: Counting objects: 0% (1/8884)
remote: Counting objects: 1% (89/8884)
remote: Counting objects: 2% (178/8884)
remote: Counting objects: 3% (267/8884)
remote: Counting objects: 4% (356/8884)
remote: Counting objects: 5% (445/8884)
remote: Counting objects: 6% (534/8884)
remote: Counting objects: 7% (622/8884)
remote: Counting objects: 8% (711/8884)
remote: Counting objects: 9% (800/8884)
remote: Counting objects: 10% (889/8884)
remote: Counting objects: 11% (978/8884)
remote: Counting objects: 12% (1067/8884)
remote: Counting objects: 13% (1155/8884)
remote: Counting objects: 14% (1244/8884)
remote: Counting objects: 15% (1333/8884)
remote: Counting objects: 16% (1422/8884)
remote: Counting objects: 17% (1511/8884)
remote: Counting objects: 18% (1600/8884)
remote: Counting objects: 19% (1688/8884)
remote: Counting objects: 20% (1777/8884)
remote: Counting objects: 21% (1866/8884)
remote: Counting objects: 22% (1955/8884)
remote: Counting objects: 23% (2044/8884)
remote: Counting objects: 24% (2133/8884)
remote: Counting objects: 25% (2221/8884)
remote: Counting objects: 26% (2310/8884)
remote: Counting objects: 27% (2399/8884)
remote: Counting objects: 28% (2488/8884)
remote: Counting objects: 29% (2577/8884)
remote: Counting objects: 30% (2666/8884)
remote: Counting objects: 31% (2755/8884)
remote: Counting objects: 32% (2843/8884)
remote: Counting objects: 33% (2932/8884)
remote: Counting objects: 34% (3021/8884)
remote: Counting objects: 35% (3110/8884)
remote: Counting objects: 36% (3199/8884)
remote: Counting objects: 37% (3288/8884)
remote: Counting objects: 38% (3376/8884)
remote: Counting objects: 39% (3465/8884)
remote: Counting objects: 40% (3554/8884)
remote: Counting objects: 41% (3643/8884)
remote: Counting objects: 42% (3732/8884)
remote: Counting objects: 43% (3821/8884)
remote: Counting objects: 44% (3909/8884)
remote: Counting objects: 45% (3998/8884)
remote: Counting objects: 46% (4087/8884)
remote: Counting objects: 47% (4176/8884)
remote: Counting objects: 48% (4265/8884)
remote: Counting objects: 49% (4354/8884)
remote: Counting objects: 50% (4442/8884)
remote: Counting objects: 51% (4531/8884)
remote: Counting objects: 52% (4620/8884)
remote: Counting objects: 53% (4709/8884)
remote: Counting objects: 54% (4798/8884)
remote: Counting objects: 55% (4887/8884)
remote: Counting objects: 56% (4976/8884)
remote: Counting objects: 57% (5064/8884)
remote: Counting objects: 58% (5153/8884)
remote: Counting objects: 59% (5242/8884)
remote: Counting objects: 60% (5331/8884)
remote: Counting objects: 61% (5420/8884)
remote: Counting objects: 62% (5509/8884)
remote: Counting objects: 63% (5597/8884)
remote: Counting objects: 64% (5686/8884)
remote: Counting objects: 65% (5775/8884)
remote: Counting objects: 66% (5864/8884)
remote: Counting objects: 67% (5953/8884)
remote: Counting objects: 68% (6042/8884)
remote: Counting objects: 69% (6130/8884)
remote: Counting objects: 70% (6219/8884)
remote: Counting objects: 71% (6308/8884)
remote: Counting objects: 72% (6397/8884)
remote: Counting objects: 73% (6486/8884)
remote: Counting objects: 74% (6575/8884)
remote: Counting objects: 75% (6663/8884)
remote: Counting objects: 76% (6752/8884)
remote: Counting objects: 77% (6841/8884)
remote: Counting objects: 78% (6930/8884)
remote: Counting objects: 79% (7019/8884)
remote: Counting objects: 80% (7108/8884)
remote: Counting objects: 81% (7197/8884)
remote: Counting objects: 82% (7285/8884)
remote: Counting objects: 83% (7374/8884)
remote: Counting objects: 84% (7463/8884)
remote: Counting objects: 85% (7552/8884)
remote: Counting objects: 86% (7641/8884)
remote: Counting objects: 87% (7730/8884)
remote: Counting objects: 88% (7818/8884)
remote: Counting objects: 89% (7907/8884)
remote: Counting objects: 90% (7996/8884)
remote: Counting objects: 91% (8085/8884)
remote: Counting objects: 92% (8174/8884)
remote: Counting objects: 93% (8263/8884)
remote: Counting objects: 94% (8351/8884)
remote: Counting objects: 95% (8440/8884)
remote: Counting objects: 96% (8529/8884)
remote: Counting objects: 97% (8618/8884)
remote: Counting objects: 98% (8707/8884)
remote: Counting objects: 99% (8796/8884)
remote: Counting objects: 100% (8884/8884)
remote: Counting objects: 100% (8884/8884), done.
2.75 s
remote: Compressing objects: 0% (1/1932)
remote: Compressing objects: 1% (20/1932)
remote: Compressing objects: 2% (39/1932)
remote: Compressing objects: 3% (58/1932)
remote: Compressing objects: 4% (78/1932)
remote: Compressing objects: 5% (97/1932)
remote: Compressing objects: 6% (116/1932)
remote: Compressing objects: 7% (136/1932)
remote: Compressing objects: 8% (155/1932)
remote: Compressing objects: 9% (174/1932)
remote: Compressing objects: 10% (194/1932)
remote: Compressing objects: 10% (195/1932)
remote: Compressing objects: 11% (213/1932)
remote: Compressing objects: 12% (232/1932)
remote: Compressing objects: 13% (252/1932)
remote: Compressing objects: 14% (271/1932)
remote: Compressing objects: 15% (290/1932)
remote: Compressing objects: 16% (310/1932)
remote: Compressing objects: 17% (329/1932)
remote: Compressing objects: 18% (348/1932)
remote: Compressing objects: 19% (368/1932)
remote: Compressing objects: 20% (387/1932)
remote: Compressing objects: 21% (406/1932)
remote: Compressing objects: 22% (426/1932)
remote: Compressing objects: 23% (445/1932)
remote: Compressing objects: 24% (464/1932)
remote: Compressing objects: 25% (483/1932)
remote: Compressing objects: 26% (503/1932)
remote: Compressing objects: 27% (522/1932)
remote: Compressing objects: 28% (541/1932)
remote: Compressing objects: 29% (561/1932)
remote: Compressing objects: 30% (580/1932)
remote: Compressing objects: 31% (599/1932)
remote: Compressing objects: 32% (619/1932)
remote: Compressing objects: 33% (638/1932)
remote: Compressing objects: 34% (657/1932)
remote: Compressing objects: 35% (677/1932)
remote: Compressing objects: 36% (696/1932)
remote: Compressing objects: 37% (715/1932)
remote: Compressing objects: 38% (735/1932)
remote: Compressing objects: 39% (754/1932)
remote: Compressing objects: 40% (773/1932)
remote: Compressing objects: 41% (793/1932)
remote: Compressing objects: 42% (812/1932)
remote: Compressing objects: 43% (831/1932)
remote: Compressing objects: 44% (851/1932)
remote: Compressing objects: 45% (870/1932)
remote: Compressing objects: 46% (889/1932)
remote: Compressing objects: 47% (909/1932)
remote: Compressing objects: 48% (928/1932)
remote: Compressing objects: 49% (947/1932)
remote: Compressing objects: 50% (966/1932)
remote: Compressing objects: 51% (986/1932)
remote: Compressing objects: 52% (1005/1932)
remote: Compressing objects: 53% (1024/1932)
remote: Compressing objects: 54% (1044/1932)
remote: Compressing objects: 55% (1063/1932)
remote: Compressing objects: 56% (1082/1932)
remote: Compressing objects: 57% (1102/1932)
remote: Compressing objects: 58% (1121/1932)
remote: Compressing objects: 59% (1140/1932)
remote: Compressing objects: 60% (1160/1932)
remote: Compressing objects: 61% (1179/1932)
remote: Compressing objects: 62% (1198/1932)
remote: Compressing objects: 63% (1218/1932)
remote: Compressing objects: 64% (1237/1932)
remote: Compressing objects: 65% (1256/1932)
remote: Compressing objects: 66% (1276/1932)
remote: Compressing objects: 67% (1295/1932)
remote: Compressing objects: 68% (1314/1932)
remote: Compressing objects: 69% (1334/1932)
remote: Compressing objects: 70% (1353/1932)
remote: Compressing objects: 71% (1372/1932)
remote: Compressing objects: 72% (1392/1932)
remote: Compressing objects: 73% (1411/1932)
remote: Compressing objects: 74% (1430/1932)
remote: Compressing objects: 75% (1449/1932)
remote: Compressing objects: 76% (1469/1932)
remote: Compressing objects: 77% (1488/1932)
remote: Compressing objects: 78% (1507/1932)
remote: Compressing objects: 79% (1527/1932)
remote: Compressing objects: 80% (1546/1932)
remote: Compressing objects: 81% (1565/1932)
remote: Compressing objects: 82% (1585/1932)
remote: Compressing objects: 83% (1604/1932)
remote: Compressing objects: 84% (1623/1932)
remote: Compressing objects: 85% (1643/1932)
remote: Compressing objects: 86% (1662/1932)
remote: Compressing objects: 87% (1681/1932)
remote: Compressing objects: 88% (1701/1932)
remote: Compressing objects: 89% (1720/1932)
remote: Compressing objects: 90% (1739/1932)
remote: Compressing objects: 91% (1759/1932)
remote: Compressing objects: 92% (1778/1932)
remote: Compressing objects: 93% (1797/1932)
remote: Compressing objects: 94% (1817/1932)
remote: Compressing objects: 95% (1836/1932)
remote: Compressing objects: 96% (1855/1932)
remote: Compressing objects: 97% (1875/1932)
remote: Compressing objects: 98% (1894/1932)
remote: Compressing objects: 99% (1913/1932)
remote: Compressing objects: 100% (1932/1932)
remote: Compressing objects: 100% (1932/1932), done.
6.97 s
Receiving objects: 0% (1/85207)
Receiving objects: 1% (853/85207)
Receiving objects: 2% (1705/85207)
Receiving objects: 3% (2557/85207)
Receiving objects: 4% (3409/85207)
Receiving objects: 5% (4261/85207)
Receiving objects: 6% (5113/85207)
Receiving objects: 7% (5965/85207)
Receiving objects: 8% (6817/85207)
Receiving objects: 9% (7669/85207), 16.20 MiB | 32.39 MiB/s
Receiving objects: 10% (8521/85207), 16.20 MiB | 32.39 MiB/s
Receiving objects: 11% (9373/85207), 16.20 MiB | 32.39 MiB/s
Receiving objects: 12% (10225/85207), 16.20 MiB | 32.39 MiB/s
Receiving objects: 13% (11077/85207), 16.20 MiB | 32.39 MiB/s
Receiving objects: 14% (11929/85207), 16.20 MiB | 32.39 MiB/s
Receiving objects: 15% (12782/85207), 16.20 MiB | 32.39 MiB/s
Receiving objects: 16% (13634/85207), 16.20 MiB | 32.39 MiB/s
Receiving objects: 17% (14486/85207), 16.20 MiB | 32.39 MiB/s
Receiving objects: 18% (15338/85207), 16.20 MiB | 32.39 MiB/s
Receiving objects: 19% (16190/85207), 16.20 MiB | 32.39 MiB/s
Receiving objects: 20% (17042/85207), 16.20 MiB | 32.39 MiB/s
Receiving objects: 21% (17894/85207), 16.20 MiB | 32.39 MiB/s
Receiving objects: 22% (18746/85207), 16.20 MiB | 32.39 MiB/s
Receiving objects: 23% (19598/85207), 16.20 MiB | 32.39 MiB/s
Receiving objects: 24% (20450/85207), 16.20 MiB | 32.39 MiB/s
Receiving objects: 25% (21302/85207), 16.20 MiB | 32.39 MiB/s
Receiving objects: 26% (22154/85207), 16.20 MiB | 32.39 MiB/s
Receiving objects: 27% (23006/85207), 16.20 MiB | 32.39 MiB/s
Receiving objects: 28% (23858/85207), 16.20 MiB | 32.39 MiB/s
Receiving objects: 29% (24711/85207), 16.20 MiB | 32.39 MiB/s
Receiving objects: 30% (25563/85207), 16.20 MiB | 32.39 MiB/s
Receiving objects: 31% (26415/85207), 16.20 MiB | 32.39 MiB/s
Receiving objects: 32% (27267/85207), 16.20 MiB | 32.39 MiB/s
Receiving objects: 33% (28119/85207), 16.20 MiB | 32.39 MiB/s
Receiving objects: 34% (28971/85207), 16.20 MiB | 32.39 MiB/s
Receiving objects: 35% (29823/85207), 16.20 MiB | 32.39 MiB/s
Receiving objects: 36% (30675/85207), 16.20 MiB | 32.39 MiB/s
Receiving objects: 37% (31527/85207), 16.20 MiB | 32.39 MiB/s
Receiving objects: 38% (32379/85207), 16.20 MiB | 32.39 MiB/s
Receiving objects: 39% (33231/85207), 16.20 MiB | 32.39 MiB/s
Receiving objects: 40% (34083/85207), 16.20 MiB | 32.39 MiB/s
Receiving objects: 41% (34935/85207), 16.20 MiB | 32.39 MiB/s
Receiving objects: 42% (35787/85207), 16.20 MiB | 32.39 MiB/s
Receiving objects: 43% (36640/85207), 16.20 MiB | 32.39 MiB/s
Receiving objects: 43% (36683/85207), 37.87 MiB | 36.07 MiB/s
Receiving objects: 44% (37492/85207), 37.87 MiB | 36.07 MiB/s
Receiving objects: 45% (38344/85207), 37.87 MiB | 36.07 MiB/s
Receiving objects: 46% (39196/85207), 37.87 MiB | 36.07 MiB/s
Receiving objects: 47% (40048/85207), 37.87 MiB | 36.07 MiB/s
Receiving objects: 48% (40900/85207), 37.87 MiB | 36.07 MiB/s
Receiving objects: 49% (41752/85207), 37.87 MiB | 36.07 MiB/s
Receiving objects: 50% (42604/85207), 37.87 MiB | 36.07 MiB/s
Receiving objects: 51% (43456/85207), 37.87 MiB | 36.07 MiB/s
Receiving objects: 52% (44308/85207), 37.87 MiB | 36.07 MiB/s
Receiving objects: 53% (45160/85207), 37.87 MiB | 36.07 MiB/s
Receiving objects: 54% (46012/85207), 37.87 MiB | 36.07 MiB/s
Receiving objects: 55% (46864/85207), 57.21 MiB | 36.33 MiB/s
Receiving objects: 56% (47716/85207), 57.21 MiB | 36.33 MiB/s
Receiving objects: 57% (48568/85207), 57.21 MiB | 36.33 MiB/s
Receiving objects: 58% (49421/85207), 57.21 MiB | 36.33 MiB/s
Receiving objects: 59% (50273/85207), 57.21 MiB | 36.33 MiB/s
Receiving objects: 60% (51125/85207), 57.21 MiB | 36.33 MiB/s
Receiving objects: 60% (51281/85207), 57.21 MiB | 36.33 MiB/s
Receiving objects: 61% (51977/85207), 57.21 MiB | 36.33 MiB/s
Receiving objects: 62% (52829/85207), 57.21 MiB | 36.33 MiB/s
Receiving objects: 63% (53681/85207), 76.48 MiB | 36.44 MiB/s
Receiving objects: 64% (54533/85207), 76.48 MiB | 36.44 MiB/s
Receiving objects: 65% (55385/85207), 76.48 MiB | 36.44 MiB/s
Receiving objects: 66% (56237/85207), 76.48 MiB | 36.44 MiB/s
Receiving objects: 67% (57089/85207), 76.48 MiB | 36.44 MiB/s
Receiving objects: 68% (57941/85207), 95.85 MiB | 36.54 MiB/s
Receiving objects: 69% (58793/85207), 95.85 MiB | 36.54 MiB/s
Receiving objects: 70% (59645/85207), 95.85 MiB | 36.54 MiB/s
Receiving objects: 71% (60497/85207), 95.85 MiB | 36.54 MiB/s
Receiving objects: 71% (61018/85207), 95.85 MiB | 36.54 MiB/s
Receiving objects: 72% (61350/85207), 95.85 MiB | 36.54 MiB/s
Receiving objects: 73% (62202/85207), 95.85 MiB | 36.54 MiB/s
Receiving objects: 74% (63054/85207), 115.13 MiB | 36.58 MiB/s
Receiving objects: 75% (63906/85207), 115.13 MiB | 36.58 MiB/s
Receiving objects: 76% (64758/85207), 115.13 MiB | 36.58 MiB/s
Receiving objects: 77% (65610/85207), 115.13 MiB | 36.58 MiB/s
Receiving objects: 78% (66462/85207), 115.13 MiB | 36.58 MiB/s
Receiving objects: 79% (67314/85207), 115.13 MiB | 36.58 MiB/s
Receiving objects: 80% (68166/85207), 115.13 MiB | 36.58 MiB/s
Receiving objects: 81% (69018/85207), 134.36 MiB | 36.59 MiB/s
Receiving objects: 82% (69870/85207), 134.36 MiB | 36.59 MiB/s
Receiving objects: 83% (70722/85207), 134.36 MiB | 36.59 MiB/s
Receiving objects: 84% (71574/85207), 134.36 MiB | 36.59 MiB/s
Receiving objects: 85% (72426/85207), 134.36 MiB | 36.59 MiB/s
Receiving objects: 86% (73279/85207), 134.36 MiB | 36.59 MiB/s
Receiving objects: 87% (74131/85207), 134.36 MiB | 36.59 MiB/s
Receiving objects: 87% (74223/85207), 134.36 MiB | 36.59 MiB/s
Receiving objects: 88% (74983/85207), 134.36 MiB | 36.59 MiB/s
Receiving objects: 89% (75835/85207), 134.36 MiB | 36.59 MiB/s
Receiving objects: 90% (76687/85207), 134.36 MiB | 36.59 MiB/s
Receiving objects: 91% (77539/85207), 134.36 MiB | 36.59 MiB/s
Receiving objects: 92% (78391/85207), 134.36 MiB | 36.59 MiB/s
Receiving objects: 93% (79243/85207), 134.36 MiB | 36.59 MiB/s
Receiving objects: 94% (80095/85207), 134.36 MiB | 36.59 MiB/s
Receiving objects: 95% (80947/85207), 134.36 MiB | 36.59 MiB/s
Receiving objects: 96% (81799/85207), 134.36 MiB | 36.59 MiB/s
Receiving objects: 97% (82651/85207), 134.36 MiB | 36.59 MiB/s
Receiving objects: 98% (83503/85207), 134.36 MiB | 36.59 MiB/s
Receiving objects: 99% (84355/85207), 134.36 MiB | 36.59 MiB/s
remote: Total 85207 (delta 7739), reused 7031 (delta 6952), pack-reused 76323 (from 3)
6.97 s
Receiving objects: 100% (85207/85207), 153.88 MiB | 36.67 MiB/s
Receiving objects: 100% (85207/85207), 155.04 MiB | 36.70 MiB/s, done.
7.92 s
Resolving deltas: 0% (0/57685)
Resolving deltas: 1% (577/57685)
Resolving deltas: 2% (1154/57685)
Resolving deltas: 3% (1733/57685)
Resolving deltas: 4% (2308/57685)
Resolving deltas: 5% (2885/57685)
Resolving deltas: 6% (3462/57685)
Resolving deltas: 7% (4040/57685)
Resolving deltas: 8% (4615/57685)
Resolving deltas: 9% (5192/57685)
Resolving deltas: 10% (5769/57685)
Resolving deltas: 11% (6348/57685)
Resolving deltas: 12% (6923/57685)
Resolving deltas: 13% (7501/57685)
Resolving deltas: 14% (8076/57685)
Resolving deltas: 15% (8653/57685)
Resolving deltas: 16% (9230/57685)
Resolving deltas: 17% (9807/57685)
Resolving deltas: 18% (10384/57685)
Resolving deltas: 19% (10961/57685)
Resolving deltas: 20% (11537/57685)
Resolving deltas: 21% (12114/57685)
Resolving deltas: 22% (12691/57685)
Resolving deltas: 23% (13268/57685)
Resolving deltas: 24% (13845/57685)
Resolving deltas: 25% (14422/57685)
Resolving deltas: 26% (14999/57685)
Resolving deltas: 27% (15578/57685)
Resolving deltas: 28% (16153/57685)
Resolving deltas: 29% (16729/57685)
Resolving deltas: 30% (17306/57685)
Resolving deltas: 31% (17883/57685)
Resolving deltas: 32% (18460/57685)
Resolving deltas: 33% (19037/57685)
Resolving deltas: 34% (19614/57685)
Resolving deltas: 35% (20195/57685)
Resolving deltas: 36% (20768/57685)
Resolving deltas: 37% (21344/57685)
Resolving deltas: 38% (21921/57685)
Resolving deltas: 39% (22498/57685)
Resolving deltas: 40% (23074/57685)
Resolving deltas: 41% (23651/57685)
Resolving deltas: 42% (24228/57685)
Resolving deltas: 43% (24805/57685)
Resolving deltas: 44% (25382/57685)
Resolving deltas: 45% (25960/57685)
Resolving deltas: 46% (26536/57685)
Resolving deltas: 47% (27113/57685)
Resolving deltas: 48% (27690/57685)
Resolving deltas: 49% (28267/57685)
Resolving deltas: 50% (28844/57685)
Resolving deltas: 51% (29423/57685)
Resolving deltas: 52% (29998/57685)
Resolving deltas: 53% (30574/57685)
Resolving deltas: 54% (31150/57685)
Resolving deltas: 55% (31727/57685)
Resolving deltas: 56% (32304/57685)
Resolving deltas: 57% (32881/57685)
Resolving deltas: 58% (33458/57685)
Resolving deltas: 59% (34036/57685)
Resolving deltas: 60% (34613/57685)
Resolving deltas: 61% (35188/57685)
Resolving deltas: 62% (35768/57685)
Resolving deltas: 63% (36342/57685)
Resolving deltas: 64% (36923/57685)
Resolving deltas: 65% (37496/57685)
Resolving deltas: 66% (38074/57685)
Resolving deltas: 67% (38649/57685)
Resolving deltas: 68% (39226/57685)
Resolving deltas: 69% (39803/57685)
Resolving deltas: 70% (40380/57685)
Resolving deltas: 71% (40957/57685)
Resolving deltas: 72% (41535/57685)
Resolving deltas: 73% (42112/57685)
Resolving deltas: 74% (42687/57685)
Resolving deltas: 75% (43266/57685)
Resolving deltas: 76% (43841/57685)
Resolving deltas: 77% (44418/57685)
Resolving deltas: 78% (44995/57685)
Resolving deltas: 79% (45572/57685)
Resolving deltas: 80% (46148/57685)
Resolving deltas: 81% (46726/57685)
Resolving deltas: 82% (47302/57685)
Resolving deltas: 83% (47881/57685)
Resolving deltas: 84% (48456/57685)
Resolving deltas: 85% (49033/57685)
Resolving deltas: 86% (49610/57685)
Resolving deltas: 87% (50186/57685)
Resolving deltas: 88% (50763/57685)
Resolving deltas: 89% (51340/57685)
Resolving deltas: 90% (51917/57685)
Resolving deltas: 91% (52494/57685)
Resolving deltas: 92% (53071/57685)
Resolving deltas: 93% (53648/57685)
Resolving deltas: 94% (54224/57685)
Resolving deltas: 95% (54802/57685)
Resolving deltas: 96% (55378/57685)
Resolving deltas: 97% (55955/57685)
Resolving deltas: 98% (56532/57685)
Resolving deltas: 99% (57110/57685)
Resolving deltas: 100% (57685/57685)
Resolving deltas: 100% (57685/57685), done.
8.36 s
Fetching commit 03811d86006efd33beb74d3960a473554851637e for faster_uv_from_4d ...
8.36 s
$ /nix/store/bcnisk3ydfgv26v2gw3zlky24g00yww2-git-2.54.0/bin/git fetch origin 03811d86006efd33beb74d3960a473554851637e
8.80 s
From https://github.com/alphal00p/gammaloop
8.80 s
* branch 03811d86006efd33beb74d3960a473554851637e -> FETCH_HEAD
8.81 s
$ /nix/store/9ypz3flqsrl5xl495mm8h645gadjsxi1-coreutils-9.11/bin/timeout --kill-after=15s 7200s /nix/store/bcnisk3ydfgv26v2gw3zlky24g00yww2-git-2.54.0/bin/git -c advice.detachedHead=false checkout 03811d86006efd33beb74d3960a473554851637e
9.13 s
HEAD is now at 03811d860 record complete-forest progress and validation protocol
9.13 s
$ /nix/store/9ypz3flqsrl5xl495mm8h645gadjsxi1-coreutils-9.11/bin/timeout --kill-after=15s 7200s /nix/store/23zk8sgzamrbmj1fday15szf7f2279s8-nix-2.34.7/bin/nix --extra-experimental-features nix-command --extra-experimental-features flakes --log-format internal-json run .#packages.x86_64-linux.nix-ci-check-gammaloop-nextest-core --print-build-logs
13.85 s
18.71 s
evaluating derivation 'g
copying '/nix/store/qas7
evaluating derivation 'g
copying '/nix/store/qas7
evaluating derivation 'g
copying '/nix/store/qas7
evaluating derivation 'g
copying '/nix/store/qas7
evaluating derivation 'g
copying '/nix/store/qas7
evaluating derivation 'g
[0 /1 built]
[1 /0 /1 built] building g gammaloop-nextest-core> Extracting 4 binaries (including 1 non-test binary), 1 build script output directory, and 2 linked paths to /build/nextest-archive-NhjVjs
19.42 s
gammaloop-nextest-core> Extracted 20 files to /build/nextest-archive-NhjVjs in 0.71s
19.44 s
gammaloop-nextest-core> ------------
19.44 s
gammaloop-nextest-core> Nextest run ID c1f561c5-e1ec-436b-810d-ba61793df511 with nextest profile: ci_gammaloop
19.44 s
gammaloop-nextest-core> Starting 379 tests across 3 binaries
20.76 s
gammaloop-nextest-core> ------------
20.76 s
gammaloop-nextest-core> Summary [ 1.324s] 379 tests run: 379 passed , 0 skipped
20.90 s
gammaloop-nextest-core>
20.90 s
gammaloop-nextest-core> ========== nextest test summary ==========
20.90 s
gammaloop-nextest-core> report: target/nextest/ci_gammaloop/junit.xml
20.90 s
gammaloop-nextest-core> tests: 379, failures: 0, errors: 0
20.90 s
gammaloop-nextest-core> No failing testcases found.
20.90 s
gammaloop-nextest-core> =========================================
20.92 s
gammaloop-nextest-core> Extracting 1 binary and 1 linked path to /build/nextest-archive-sQy9Ad
20.98 s
gammaloop-nextest-core> Extracted 7 files to /build/nextest-archive-sQy9Ad in 0.07s
20.99 s
gammaloop-nextest-core> ------------
20.99 s
gammaloop-nextest-core> Nextest run ID 2d8a0708-b6f8-4fa4-93dd-3e5ab89da2a1 with nextest profile: ci_gammaloop
20.99 s
gammaloop-nextest-core> Starting 19 tests across 1 binary
21.01 s
gammaloop-nextest-core> ------------
21.01 s
gammaloop-nextest-core> Summary [ 0.018s] 19 tests run: 19 passed , 0 skipped
21.05 s
gammaloop-nextest-core>
21.05 s
gammaloop-nextest-core> ========== nextest test summary ==========
21.05 s
gammaloop-nextest-core> report: target/nextest/ci_gammaloop/junit.xml
21.05 s
gammaloop-nextest-core> tests: 19, failures: 0, errors: 0
21.05 s
gammaloop-nextest-core> No failing testcases found.
21.05 s
gammaloop-nextest-core> =========================================
21.06 s
gammaloop-nextest-core> Extracting 1 binary to /build/nextest-archive-gomXgu
21.09 s
gammaloop-nextest-core> Extracted 4 files to /build/nextest-archive-gomXgu in 0.03s
21.10 s
gammaloop-nextest-core> ------------
21.10 s
gammaloop-nextest-core> Nextest run ID b3a57aee-fd8c-457d-9cdb-6212c99b3e36 with nextest profile: ci_gammaloop
21.10 s
gammaloop-nextest-core> Starting 0 tests across 1 binary
21.10 s
gammaloop-nextest-core> ------------
21.10 s
gammaloop-nextest-core> Summary [ 0.000s] 0 tests run: 0 passed , 0 skipped
21.13 s
gammaloop-nextest-core>
21.13 s
gammaloop-nextest-core> ========== nextest test summary ==========
21.13 s
gammaloop-nextest-core> report: target/nextest/ci_gammaloop/junit.xml
21.13 s
gammaloop-nextest-core> tests: 0, failures: 0, errors: 0
21.13 s
gammaloop-nextest-core> No failing testcases found.
21.13 s
gammaloop-nextest-core> =========================================
21.15 s
gammaloop-nextest-core> Extracting 4 binaries, 1 build script output directory, and 2 linked paths to /build/nextest-archive-IIHEf8
21.63 s
gammaloop-nextest-core> Extracted 18 files to /build/nextest-archive-IIHEf8 in 0.49s
21.65 s
gammaloop-nextest-core> ------------
21.65 s
gammaloop-nextest-core> Nextest run ID fbc136cd-4317-4ed4-80b7-66a44ba407aa with nextest profile: ci_gammaloop
21.65 s
gammaloop-nextest-core> Starting 700 tests across 4 binaries (60 tests skipped , including 59 tests via profile.ci_gammaloop.default-filter )
28.61 s
gammaloop-nextest-core> FAIL [ 3.341s] (695/700) gammalooprs::test_renormalization finite_part_ghost_2loop
28.61 s
gammaloop-nextest-core> stdout ---
28.61 s
gammaloop-nextest-core>
28.61 s
gammaloop-nextest-core> running 1 test
28.61 s
gammaloop-nextest-core> test finite_part_ghost_2loop ... FAILED
28.61 s
gammaloop-nextest-core>
28.61 s
gammaloop-nextest-core> failures:
28.61 s
gammaloop-nextest-core>
28.61 s
gammaloop-nextest-core> failures:
28.61 s
gammaloop-nextest-core> finite_part_ghost_2loop
28.61 s
gammaloop-nextest-core>
28.61 s
gammaloop-nextest-core> test result: FAILED. 0 passed; 1 failed; 0 ignored; 0 measured; 6 filtered out; finished in 3.33s
28.61 s
gammaloop-nextest-core>
28.61 s
gammaloop-nextest-core> stderr ---
28.61 s
gammaloop-nextest-core> The application panicked (crashed).
28.61 s
gammaloop-nextest-core> Message: assertion failed: (align_to_rqft(&a, &model) - expected).expand().is_zero()
28.61 s
gammaloop-nextest-core> Location: crates/gammalooprs/tests/test_renormalization.rs :583
28.61 s
gammaloop-nextest-core>
28.61 s
gammaloop-nextest-core> ━━━━━━━━━━━━━━━━━━━━━━━━━━━━━━━━━━ BACKTRACE ━━━━━━━━━━━━━━━━━━━━━━━━━━━━━━━━━━━
28.61 s
gammaloop-nextest-core> 1: <color_eyre[51793ea62743adbd]::config::PanicHook>::panic_report <unknown>
28.61 s
gammaloop-nextest-core> at <unknown source file> :<unknown line>
28.61 s
gammaloop-nextest-core> 2: <color_eyre[51793ea62743adbd]::config::PanicHook>::into_panic_hook::{closure#0} <unknown>
28.61 s
gammaloop-nextest-core> at <unknown source file> :<unknown line>
28.61 s
gammaloop-nextest-core> 3: std[bcb96dfbba0ab899]::panicking::panic_with_hook <unknown>
28.61 s
gammaloop-nextest-core> at <unknown source file> :<unknown line>
28.61 s
gammaloop-nextest-core> 4: std[bcb96dfbba0ab899]::panicking::panic_handler::{closure#0} <unknown>
28.61 s
gammaloop-nextest-core> at <unknown source file> :<unknown line>
28.61 s
gammaloop-nextest-core> 5: std[bcb96dfbba0ab899]::sys::backtrace::__rust_end_short_backtrace::<std[bcb96dfbba0ab899]::panicking::panic_handler::{closure#0}, !> <unknown>
28.61 s
gammaloop-nextest-core> at <unknown source file> :<unknown line>
28.61 s
gammaloop-nextest-core> 6: __rustc[6c289b9f9c454d21]::rust_begin_unwind <unknown>
28.61 s
gammaloop-nextest-core> at <unknown source file> :<unknown line>
28.61 s
gammaloop-nextest-core> 7: core[940e698046960fd5]::panicking::panic_fmt <unknown>
28.61 s
gammaloop-nextest-core> at <unknown source file> :<unknown line>
28.61 s
gammaloop-nextest-core> 8: core[940e698046960fd5]::panicking::panic <unknown>
28.61 s
gammaloop-nextest-core> at <unknown source file> :<unknown line>
28.61 s
gammaloop-nextest-core> 9: <test_renormalization[5812939ef1a04d89]::finite_part_ghost_2loop::{closure#0} as core[940e698046960fd5]::ops::function::FnOnce<()>>::call_once <unknown>
28.61 s
gammaloop-nextest-core> at <unknown source file> :<unknown line>
28.61 s
gammaloop-nextest-core> 10: test[75d6903177b1d7e9]::__rust_begin_short_backtrace::<core[940e698046960fd5]::result::Result<(), alloc[2ea6bcb46fca0c42]::string::String>, fn() -> core[940e698046960fd5]::result::Result<(), alloc[2ea6bcb46fca0c42]::string::String>> <unknown>
28.61 s
gammaloop-nextest-core> at <unknown source file> :<unknown line>
28.61 s
gammaloop-nextest-core> 11: test[75d6903177b1d7e9]::run_test::{closure#0} <unknown>
28.61 s
gammaloop-nextest-core> at <unknown source file> :<unknown line>
28.61 s
gammaloop-nextest-core> 12: std[bcb96dfbba0ab899]::sys::backtrace::__rust_begin_short_backtrace::<test[75d6903177b1d7e9]::run_test::{closure#1}, ()> <unknown>
28.61 s
gammaloop-nextest-core> at <unknown source file> :<unknown line>
28.61 s
gammaloop-nextest-core> 13: <std[bcb96dfbba0ab899]::thread::lifecycle::spawn_unchecked<test[75d6903177b1d7e9]::run_test::{closure#1}, ()>::{closure#1} as core[940e698046960fd5]::ops::function::FnOnce<()>>::call_once::{shim:vtable#0} <unknown>
28.61 s
gammaloop-nextest-core> at <unknown source file> :<unknown line>
28.61 s
gammaloop-nextest-core> 14: <std[bcb96dfbba0ab899]::sys::thread::unix::Thread>::new::thread_start <unknown>
28.61 s
gammaloop-nextest-core> at <unknown source file> :<unknown line>
28.61 s
gammaloop-nextest-core> 15: start_thread <unknown>
28.61 s
gammaloop-nextest-core> at <unknown source file> :<unknown line>
28.61 s
gammaloop-nextest-core> 16: __clone3 <unknown>
28.61 s
gammaloop-nextest-core> at <unknown source file> :<unknown line>
28.61 s
gammaloop-nextest-core>
28.61 s
gammaloop-nextest-core> Run with COLORBT_SHOW_HIDDEN=1 environment variable to disable frame filtering.
28.61 s
gammaloop-nextest-core> Run with RUST_BACKTRACE=full to include source snippets.
28.61 s
gammaloop-nextest-core>
33.06 s
gammaloop-nextest-core> ------------
33.06 s
gammaloop-nextest-core> Summary [ 11.413s] 700 tests run: 699 passed , 1 failed , 60 skipped
33.06 s
gammaloop-nextest-core> FAIL [ 3.341s] (695/700) gammalooprs::test_renormalization finite_part_ghost_2loop
33.06 s
gammaloop-nextest-core> stdout ---
33.06 s
gammaloop-nextest-core>
33.06 s
gammaloop-nextest-core> running 1 test
33.06 s
gammaloop-nextest-core> test finite_part_ghost_2loop ... FAILED
33.06 s
gammaloop-nextest-core>
33.06 s
gammaloop-nextest-core> failures:
33.06 s
gammaloop-nextest-core>
33.06 s
gammaloop-nextest-core> failures:
33.06 s
gammaloop-nextest-core> finite_part_ghost_2loop
33.06 s
gammaloop-nextest-core>
33.06 s
gammaloop-nextest-core> test result: FAILED. 0 passed; 1 failed; 0 ignored; 0 measured; 6 filtered out; finished in 3.33s
33.06 s
gammaloop-nextest-core>
33.06 s
gammaloop-nextest-core> stderr ---
33.06 s
gammaloop-nextest-core> The application panicked (crashed).
33.06 s
gammaloop-nextest-core> Message: assertion failed: (align_to_rqft(&a, &model) - expected).expand().is_zero()
33.06 s
gammaloop-nextest-core> Location: crates/gammalooprs/tests/test_renormalization.rs :583
33.06 s
gammaloop-nextest-core>
33.06 s
gammaloop-nextest-core> ━━━━━━━━━━━━━━━━━━━━━━━━━━━━━━━━━━ BACKTRACE ━━━━━━━━━━━━━━━━━━━━━━━━━━━━━━━━━━━
33.06 s
gammaloop-nextest-core> 1: <color_eyre[51793ea62743adbd]::config::PanicHook>::panic_report <unknown>
33.06 s
gammaloop-nextest-core> at <unknown source file> :<unknown line>
33.06 s
gammaloop-nextest-core> 2: <color_eyre[51793ea62743adbd]::config::PanicHook>::into_panic_hook::{closure#0} <unknown>
33.06 s
gammaloop-nextest-core> at <unknown source file> :<unknown line>
33.06 s
gammaloop-nextest-core> 3: std[bcb96dfbba0ab899]::panicking::panic_with_hook <unknown>
33.06 s
gammaloop-nextest-core> at <unknown source file> :<unknown line>
33.06 s
gammaloop-nextest-core> 4: std[bcb96dfbba0ab899]::panicking::panic_handler::{closure#0} <unknown>
33.06 s
gammaloop-nextest-core> at <unknown source file> :<unknown line>
33.06 s
gammaloop-nextest-core> 5: std[bcb96dfbba0ab899]::sys::backtrace::__rust_end_short_backtrace::<std[bcb96dfbba0ab899]::panicking::panic_handler::{closure#0}, !> <unknown>
33.06 s
gammaloop-nextest-core> at <unknown source file> :<unknown line>
33.06 s
gammaloop-nextest-core> 6: __rustc[6c289b9f9c454d21]::rust_begin_unwind <unknown>
33.06 s
gammaloop-nextest-core> at <unknown source file> :<unknown line>
33.06 s
gammaloop-nextest-core> 7: core[940e698046960fd5]::panicking::panic_fmt <unknown>
33.06 s
gammaloop-nextest-core> at <unknown source file> :<unknown line>
33.06 s
gammaloop-nextest-core> 8: core[940e698046960fd5]::panicking::panic <unknown>
33.06 s
gammaloop-nextest-core> at <unknown source file> :<unknown line>
33.06 s
gammaloop-nextest-core> 9: <test_renormalization[5812939ef1a04d89]::finite_part_ghost_2loop::{closure#0} as core[940e698046960fd5]::ops::function::FnOnce<()>>::call_once <unknown>
33.06 s
gammaloop-nextest-core> at <unknown source file> :<unknown line>
33.06 s
gammaloop-nextest-core> 10: test[75d6903177b1d7e9]::__rust_begin_short_backtrace::<core[940e698046960fd5]::result::Result<(), alloc[2ea6bcb46fca0c42]::string::String>, fn() -> core[940e698046960fd5]::result::Result<(), alloc[2ea6bcb46fca0c42]::string::String>> <unknown>
33.06 s
gammaloop-nextest-core> at <unknown source file> :<unknown line>
33.06 s
gammaloop-nextest-core> 11: test[75d6903177b1d7e9]::run_test::{closure#0} <unknown>
33.06 s
gammaloop-nextest-core> at <unknown source file> :<unknown line>
33.06 s
gammaloop-nextest-core> 12: std[bcb96dfbba0ab899]::sys::backtrace::__rust_begin_short_backtrace::<test[75d6903177b1d7e9]::run_test::{closure#1}, ()> <unknown>
33.06 s
gammaloop-nextest-core> at <unknown source file> :<unknown line>
33.06 s
gammaloop-nextest-core> 13: <std[bcb96dfbba0ab899]::thread::lifecycle::spawn_unchecked<test[75d6903177b1d7e9]::run_test::{closure#1}, ()>::{closure#1} as core[940e698046960fd5]::ops::function::FnOnce<()>>::call_once::{shim:vtable#0} <unknown>
33.06 s
gammaloop-nextest-core> at <unknown source file> :<unknown line>
33.06 s
gammaloop-nextest-core> 14: <std[bcb96dfbba0ab899]::sys::thread::unix::Thread>::new::thread_start <unknown>
33.06 s
gammaloop-nextest-core> at <unknown source file> :<unknown line>
33.06 s
gammaloop-nextest-core> 15: start_thread <unknown>
33.06 s
gammaloop-nextest-core> at <unknown source file> :<unknown line>
33.06 s
gammaloop-nextest-core> 16: __clone3 <unknown>
33.06 s
gammaloop-nextest-core> at <unknown source file> :<unknown line>
33.06 s
gammaloop-nextest-core>
33.06 s
gammaloop-nextest-core> Run with COLORBT_SHOW_HIDDEN=1 environment variable to disable frame filtering.
33.06 s
gammaloop-nextest-core> Run with RUST_BACKTRACE=full to include source snippets.
33.06 s
gammaloop-nextest-core>
33.15 s
gammaloop-nextest-core> error : test run failed
33.18 s
gammaloop-nextest-core>
33.18 s
gammaloop-nextest-core> ========== nextest test summary ==========
33.18 s
gammaloop-nextest-core> report: target/nextest/ci_gammaloop/junit.xml
33.18 s
gammaloop-nextest-core> tests: 700, failures: 1, errors: 0
33.18 s
gammaloop-nextest-core>
33.18 s
gammaloop-nextest-core> 1. gammalooprs::test_renormalization::finite_part_ghost_2loop
33.18 s
gammaloop-nextest-core> failure: test failure with exit code 101
33.18 s
gammaloop-nextest-core> system-out
33.18 s
gammaloop-nextest-core> running 1 test
33.18 s
gammaloop-nextest-core> test finite_part_ghost_2loop ... FAILED
33.18 s
gammaloop-nextest-core>
33.18 s
gammaloop-nextest-core> failures:
33.18 s
gammaloop-nextest-core>
33.18 s
gammaloop-nextest-core> failures:
33.18 s
gammaloop-nextest-core> finite_part_ghost_2loop
33.18 s
gammaloop-nextest-core>
33.18 s
gammaloop-nextest-core> test result: FAILED. 0 passed; 1 failed; 0 ignored; 0 measured; 6 filtered out; finished in 3.33s
33.18 s
gammaloop-nextest-core> system-err
33.18 s
gammaloop-nextest-core> The application panicked (crashed).
33.18 s
gammaloop-nextest-core> Message: assertion failed: (align_to_rqft(&a, &model) - expected).expand().is_zero()
33.18 s
gammaloop-nextest-core> Location: crates/gammalooprs/tests/test_renormalization.rs:583
33.18 s
gammaloop-nextest-core>
33.18 s
gammaloop-nextest-core> ━━━━━━━━━━━━━━━━━━━━━━━━━━━━━━━━━━ BACKTRACE ━━━━━━━━━━━━━━━━━━━━━━━━━━━━━━━━━━━
33.18 s
gammaloop-nextest-core> 1: <color_eyre[51793ea62743adbd]::config::PanicHook>::panic_report<unknown>
33.18 s
gammaloop-nextest-core> at <unknown source file>:<unknown line>
33.18 s
gammaloop-nextest-core> 2: <color_eyre[51793ea62743adbd]::config::PanicHook>::into_panic_hook::{closure#0}<unknown>
33.18 s
gammaloop-nextest-core> at <unknown source file>:<unknown line>
33.18 s
gammaloop-nextest-core> 3: std[bcb96dfbba0ab899]::panicking::panic_with_hook<unknown>
33.18 s
gammaloop-nextest-core> at <unknown source file>:<unknown line>
33.18 s
gammaloop-nextest-core> 4: std[bcb96dfbba0ab899]::panicking::panic_handler::{closure#0}<unknown>
33.18 s
gammaloop-nextest-core> at <unknown source file>:<unknown line>
33.18 s
gammaloop-nextest-core> 5: std[bcb96dfbba0ab899]::sys::backtrace::__rust_end_short_backtrace::<std[bcb96dfbba0ab899]::panicking::panic_handler::{closure#0}, !><unknown>
33.18 s
gammaloop-nextest-core> at <unknown source file>:<unknown line>
33.18 s
gammaloop-nextest-core> 6: __rustc[6c289b9f9c454d21]::rust_begin_unwind<unknown>
33.18 s
gammaloop-nextest-core> at <unknown source file>:<unknown line>
33.18 s
gammaloop-nextest-core> 7: core[940e698046960fd5]::panicking::panic_fmt<unknown>
33.18 s
gammaloop-nextest-core> at <unknown source file>:<unknown line>
33.18 s
gammaloop-nextest-core> 8: core[940e698046960fd5]::panicking::panic<unknown>
33.18 s
gammaloop-nextest-core> at <unknown source file>:<unknown line>
33.18 s
gammaloop-nextest-core> 9: <test_renormalization[5812939ef1a04d89]::finite_part_ghost_2loop::{closure#0} as core[940e698046960fd5]::ops::function::FnOnce<()>>::call_once<unknown>
33.18 s
gammaloop-nextest-core> at <unknown source file>:<unknown line>
33.18 s
gammaloop-nextest-core> 10: test[75d6903177b1d7e9]::__rust_begin_short_backtrace::<core[940e698046960fd5]::result::Result<(), alloc[2ea6bcb46fca0c42]::string::String>, fn() -> core[940e698046960fd5]::result::Result<(), alloc[2ea6bcb46fca0c42]::string::String>><unknown>
33.18 s
gammaloop-nextest-core> at <unknown source file>:<unknown line>
33.18 s
gammaloop-nextest-core> 11: test[75d6903177b1d7e9]::run_test::{closure#0}<unknown>
33.18 s
gammaloop-nextest-core> at <unknown source file>:<unknown line>
33.18 s
gammaloop-nextest-core> 12: std[bcb96dfbba0ab899]::sys::backtrace::__rust_begin_short_backtrace::<test[75d6903177b1d7e9]::run_test::{closure#1}, ()><unknown>
33.18 s
gammaloop-nextest-core> at <unknown source file>:<unknown line>
33.18 s
gammaloop-nextest-core> 13: <std[bcb96dfbba0ab899]::thread::lifecycle::spawn_unchecked<test[75d6903177b1d7e9]::run_test::{closure#1}, ()>::{closure#1} as core[940e698046960fd5]::ops::function::FnOnce<()>>::call_once::{shim:vtable#0}<unknown>
33.18 s
gammaloop-nextest-core> at <unknown source file>:<unknown line>
33.18 s
gammaloop-nextest-core> 14: <std[bcb96dfbba0ab899]::sys::thread::unix::Thread>::new::thread_start<unknown>
33.18 s
gammaloop-nextest-core> at <unknown source file>:<unknown line>
33.18 s
gammaloop-nextest-core> 15: start_thread<unknown>
33.18 s
gammaloop-nextest-core> at <unknown source file>:<unknown line>
33.18 s
gammaloop-nextest-core> 16: __clone3<unknown>
33.18 s
gammaloop-nextest-core> at <unknown source file>:<unknown line>
33.18 s
gammaloop-nextest-core>
33.18 s
gammaloop-nextest-core> Run with COLORBT_SHOW_HIDDEN=1 environment variable to disable frame filtering.
33.18 s
gammaloop-nextest-core> Run with RUST_BACKTRACE=full to include source snippets.
33.18 s
gammaloop-nextest-core> =========================================
33.19 s
gammaloop-nextest-core> Extracting 1 binary, 1 build script output directory, and 1 linked path to /build/nextest-archive-zhRowh
33.26 s
gammaloop-nextest-core> Extracted 7 files to /build/nextest-archive-zhRowh in 0.08s
33.27 s
gammaloop-nextest-core> ------------
33.27 s
gammaloop-nextest-core> Nextest run ID 195ea33a-92d5-4edf-9660-54b9643abf7a with nextest profile: ci_gammaloop
33.27 s
gammaloop-nextest-core> Starting 105 tests across 1 binary
50.71 s
gammaloop-nextest-core> ------------
50.71 s
gammaloop-nextest-core> Summary [ 17.440s] 105 tests run: 105 passed , 0 skipped
50.75 s
gammaloop-nextest-core>
50.75 s
gammaloop-nextest-core> ========== nextest test summary ==========
50.75 s
gammaloop-nextest-core> report: target/nextest/ci_gammaloop/junit.xml
50.75 s
gammaloop-nextest-core> tests: 105, failures: 0, errors: 0
50.75 s
gammaloop-nextest-core> No failing testcases found.
50.75 s
gammaloop-nextest-core> =========================================
50.80 s
[0 built (1 failed )]error: Cannot build '/nix/store/7i3bc9vasq286igikm494rqdb64pilng-gammaloop-nextest-core.drv '.
50.80 s
Reason: builder failed with exit code 100 .
50.80 s
Output paths:
50.80 s
/nix/store/qy71i8wcdw8ab7bw8mzbn9n7pvbz0dql-gammaloop-nextest-core
50.80 s
Last 229 log lines:
50.80 s
> Extracting 4 binaries (including 1 non-test binary), 1 build script output directory, and 2 linked paths to /build/nextest-archive-NhjVjs
50.80 s
> Extracted 20 files to /build/nextest-archive-NhjVjs in 0.71s
50.80 s
> ------------
50.80 s
> Nextest run ID c1f561c5-e1ec-436b-810d-ba61793df511 with nextest profile: ci_gammaloop
50.80 s
> Starting 379 tests across 3 binaries
50.80 s
> ------------
50.80 s
> Summary [ 1.324s] 379 tests run: 379 passed , 0 skipped
50.80 s
>
50.80 s
> ========== nextest test summary ==========
50.80 s
> report: target/nextest/ci_gammaloop/junit.xml
50.80 s
> tests: 379, failures: 0, errors: 0
50.80 s
> No failing testcases found.
50.80 s
> =========================================
50.80 s
> Extracting 1 binary and 1 linked path to /build/nextest-archive-sQy9Ad
50.80 s
> Extracted 7 files to /build/nextest-archive-sQy9Ad in 0.07s
50.80 s
> ------------
50.80 s
> Nextest run ID 2d8a0708-b6f8-4fa4-93dd-3e5ab89da2a1 with nextest profile: ci_gammaloop
50.80 s
> Starting 19 tests across 1 binary
50.80 s
> ------------
50.80 s
> Summary [ 0.018s] 19 tests run: 19 passed , 0 skipped
50.80 s
>
50.80 s
> ========== nextest test summary ==========
50.80 s
> report: target/nextest/ci_gammaloop/junit.xml
50.80 s
> tests: 19, failures: 0, errors: 0
50.80 s
> No failing testcases found.
50.80 s
> =========================================
50.80 s
> Extracting 1 binary to /build/nextest-archive-gomXgu
50.80 s
> Extracted 4 files to /build/nextest-archive-gomXgu in 0.03s
50.80 s
> ------------
50.80 s
> Nextest run ID b3a57aee-fd8c-457d-9cdb-6212c99b3e36 with nextest profile: ci_gammaloop
50.80 s
> Starting 0 tests across 1 binary
50.80 s
> ------------
50.80 s
> Summary [ 0.000s] 0 tests run: 0 passed , 0 skipped
50.80 s
>
50.80 s
> ========== nextest test summary ==========
50.80 s
> report: target/nextest/ci_gammaloop/junit.xml
50.80 s
> tests: 0, failures: 0, errors: 0
50.80 s
> No failing testcases found.
50.80 s
> =========================================
50.80 s
> Extracting 4 binaries, 1 build script output directory, and 2 linked paths to /build/nextest-archive-IIHEf8
50.80 s
> Extracted 18 files to /build/nextest-archive-IIHEf8 in 0.49s
50.80 s
> ------------
50.80 s
> Nextest run ID fbc136cd-4317-4ed4-80b7-66a44ba407aa with nextest profile: ci_gammaloop
50.80 s
> Starting 700 tests across 4 binaries (60 tests skipped , including 59 tests via profile.ci_gammaloop.default-filter )
50.80 s
> FAIL [ 3.341s] (695/700) gammalooprs::test_renormalization finite_part_ghost_2loop
50.80 s
> stdout ---
50.80 s
>
50.80 s
> running 1 test
50.80 s
> test finite_part_ghost_2loop ... FAILED
50.80 s
>
50.80 s
> failures:
50.80 s
>
50.80 s
> failures:
50.80 s
> finite_part_ghost_2loop
50.80 s
>
50.80 s
> test result: FAILED. 0 passed; 1 failed; 0 ignored; 0 measured; 6 filtered out; finished in 3.33s
50.80 s
>
50.80 s
> stderr ---
50.80 s
> The application panicked (crashed).
50.80 s
> Message: assertion failed: (align_to_rqft(&a, &model) - expected).expand().is_zero()
50.80 s
> Location: crates/gammalooprs/tests/test_renormalization.rs :583
50.80 s
>
50.80 s
> ━━━━━━━━━━━━━━━━━━━━━━━━━━━━━━━━━━ BACKTRACE ━━━━━━━━━━━━━━━━━━━━━━━━━━━━━━━━━━━
50.80 s
> 1: <color_eyre[51793ea62743adbd]::config::PanicHook>::panic_report <unknown>
50.80 s
> at <unknown source file> :<unknown line>
50.80 s
> 2: <color_eyre[51793ea62743adbd]::config::PanicHook>::into_panic_hook::{closure#0} <unknown>
50.80 s
> at <unknown source file> :<unknown line>
50.80 s
> 3: std[bcb96dfbba0ab899]::panicking::panic_with_hook <unknown>
50.80 s
> at <unknown source file> :<unknown line>
50.80 s
> 4: std[bcb96dfbba0ab899]::panicking::panic_handler::{closure#0} <unknown>
50.80 s
> at <unknown source file> :<unknown line>
50.80 s
> 5: std[bcb96dfbba0ab899]::sys::backtrace::__rust_end_short_backtrace::<std[bcb96dfbba0ab899]::panicking::panic_handler::{closure#0}, !> <unknown>
50.80 s
> at <unknown source file> :<unknown line>
50.80 s
> 6: __rustc[6c289b9f9c454d21]::rust_begin_unwind <unknown>
50.80 s
> at <unknown source file> :<unknown line>
50.80 s
> 7: core[940e698046960fd5]::panicking::panic_fmt <unknown>
50.80 s
> at <unknown source file> :<unknown line>
50.80 s
> 8: core[940e698046960fd5]::panicking::panic <unknown>
50.80 s
> at <unknown source file> :<unknown line>
50.80 s
> 9: <test_renormalization[5812939ef1a04d89]::finite_part_ghost_2loop::{closure#0} as core[940e698046960fd5]::ops::function::FnOnce<()>>::call_once <unknown>
50.80 s
> at <unknown source file> :<unknown line>
50.80 s
> 10: test[75d6903177b1d7e9]::__rust_begin_short_backtrace::<core[940e698046960fd5]::result::Result<(), alloc[2ea6bcb46fca0c42]::string::String>, fn() -> core[940e698046960fd5]::result::Result<(), alloc[2ea6bcb46fca0c42]::string::String>> <unknown>
50.80 s
> at <unknown source file> :<unknown line>
50.80 s
> 11: test[75d6903177b1d7e9]::run_test::{closure#0} <unknown>
50.80 s
> at <unknown source file> :<unknown line>
50.80 s
> 12: std[bcb96dfbba0ab899]::sys::backtrace::__rust_begin_short_backtrace::<test[75d6903177b1d7e9]::run_test::{closure#1}, ()> <unknown>
50.80 s
> at <unknown source file> :<unknown line>
50.80 s
> 13: <std[bcb96dfbba0ab899]::thread::lifecycle::spawn_unchecked<test[75d6903177b1d7e9]::run_test::{closure#1}, ()>::{closure#1} as core[940e698046960fd5]::ops::function::FnOnce<()>>::call_once::{shim:vtable#0} <unknown>
50.80 s
> at <unknown source file> :<unknown line>
50.80 s
> 14: <std[bcb96dfbba0ab899]::sys::thread::unix::Thread>::new::thread_start <unknown>
50.80 s
> at <unknown source file> :<unknown line>
50.80 s
> 15: start_thread <unknown>
50.80 s
> at <unknown source file> :<unknown line>
50.80 s
> 16: __clone3 <unknown>
50.80 s
> at <unknown source file> :<unknown line>
50.80 s
>
50.80 s
> Run with COLORBT_SHOW_HIDDEN=1 environment variable to disable frame filtering.
50.80 s
> Run with RUST_BACKTRACE=full to include source snippets.
50.80 s
>
50.80 s
> ------------
50.80 s
> Summary [ 11.413s] 700 tests run: 699 passed , 1 failed , 60 skipped
50.80 s
> FAIL [ 3.341s] (695/700) gammalooprs::test_renormalization finite_part_ghost_2loop
50.80 s
> stdout ---
50.80 s
>
50.80 s
> running 1 test
50.80 s
> test finite_part_ghost_2loop ... FAILED
50.80 s
>
50.80 s
> failures:
50.80 s
>
50.80 s
> failures:
50.80 s
> finite_part_ghost_2loop
50.80 s
>
50.80 s
> test result: FAILED. 0 passed; 1 failed; 0 ignored; 0 measured; 6 filtered out; finished in 3.33s
50.80 s
>
50.80 s
> stderr ---
50.80 s
> The application panicked (crashed).
50.80 s
> Message: assertion failed: (align_to_rqft(&a, &model) - expected).expand().is_zero()
50.80 s
> Location: crates/gammalooprs/tests/test_renormalization.rs :583
50.80 s
>
50.80 s
> ━━━━━━━━━━━━━━━━━━━━━━━━━━━━━━━━━━ BACKTRACE ━━━━━━━━━━━━━━━━━━━━━━━━━━━━━━━━━━━
50.80 s
> 1: <color_eyre[51793ea62743adbd]::config::PanicHook>::panic_report <unknown>
50.80 s
> at <unknown source file> :<unknown line>
50.80 s
> 2: <color_eyre[51793ea62743adbd]::config::PanicHook>::into_panic_hook::{closure#0} <unknown>
50.80 s
> at <unknown source file> :<unknown line>
50.80 s
> 3: std[bcb96dfbba0ab899]::panicking::panic_with_hook <unknown>
50.80 s
> at <unknown source file> :<unknown line>
50.80 s
> 4: std[bcb96dfbba0ab899]::panicking::panic_handler::{closure#0} <unknown>
50.80 s
> at <unknown source file> :<unknown line>
50.80 s
> 5: std[bcb96dfbba0ab899]::sys::backtrace::__rust_end_short_backtrace::<std[bcb96dfbba0ab899]::panicking::panic_handler::{closure#0}, !> <unknown>
50.80 s
> at <unknown source file> :<unknown line>
50.80 s
> 6: __rustc[6c289b9f9c454d21]::rust_begin_unwind <unknown>
50.80 s
> at <unknown source file> :<unknown line>
50.80 s
> 7: core[940e698046960fd5]::panicking::panic_fmt <unknown>
50.80 s
> at <unknown source file> :<unknown line>
50.80 s
> 8: core[940e698046960fd5]::panicking::panic <unknown>
50.80 s
> at <unknown source file> :<unknown line>
50.80 s
> 9: <test_renormalization[5812939ef1a04d89]::finite_part_ghost_2loop::{closure#0} as core[940e698046960fd5]::ops::function::FnOnce<()>>::call_once <unknown>
50.80 s
> at <unknown source file> :<unknown line>
50.80 s
> 10: test[75d6903177b1d7e9]::__rust_begin_short_backtrace::<core[940e698046960fd5]::result::Result<(), alloc[2ea6bcb46fca0c42]::string::String>, fn() -> core[940e698046960fd5]::result::Result<(), alloc[2ea6bcb46fca0c42]::string::String>> <unknown>
50.80 s
> at <unknown source file> :<unknown line>
50.80 s
> 11: test[75d6903177b1d7e9]::run_test::{closure#0} <unknown>
50.80 s
> at <unknown source file> :<unknown line>
50.80 s
> 12: std[bcb96dfbba0ab899]::sys::backtrace::__rust_begin_short_backtrace::<test[75d6903177b1d7e9]::run_test::{closure#1}, ()> <unknown>
50.80 s
> at <unknown source file> :<unknown line>
50.80 s
> 13: <std[bcb96dfbba0ab899]::thread::lifecycle::spawn_unchecked<test[75d6903177b1d7e9]::run_test::{closure#1}, ()>::{closure#1} as core[940e698046960fd5]::ops::function::FnOnce<()>>::call_once::{shim:vtable#0} <unknown>
50.80 s
> at <unknown source file> :<unknown line>
50.80 s
> 14: <std[bcb96dfbba0ab899]::sys::thread::unix::Thread>::new::thread_start <unknown>
50.80 s
> at <unknown source file> :<unknown line>
50.80 s
> 15: start_thread <unknown>
50.80 s
> at <unknown source file> :<unknown line>
50.80 s
> 16: __clone3 <unknown>
50.80 s
> at <unknown source file> :<unknown line>
50.80 s
>
50.80 s
> Run with COLORBT_SHOW_HIDDEN=1 environment variable to disable frame filtering.
50.80 s
> Run with RUST_BACKTRACE=full to include source snippets.
50.80 s
>
50.80 s
> error : test run failed
50.80 s
>
50.80 s
> ========== nextest test summary ==========
50.80 s
> report: target/nextest/ci_gammaloop/junit.xml
50.80 s
> tests: 700, failures: 1, errors: 0
50.80 s
>
50.80 s
> 1. gammalooprs::test_renormalization::finite_part_ghost_2loop
50.80 s
> failure: test failure with exit code 101
50.80 s
> system-out
50.80 s
> running 1 test
50.80 s
> test finite_part_ghost_2loop ... FAILED
50.80 s
>
50.80 s
> failures:
50.80 s
>
50.80 s
> failures:
50.80 s
> finite_part_ghost_2loop
50.80 s
>
50.80 s
> test result: FAILED. 0 passed; 1 failed; 0 ignored; 0 measured; 6 filtered out; finished in 3.33s
50.80 s
> system-err
50.80 s
> The application panicked (crashed).
50.80 s
> Message: assertion failed: (align_to_rqft(&a, &model) - expected).expand().is_zero()
50.80 s
> Location: crates/gammalooprs/tests/test_renormalization.rs:583
50.80 s
>
50.80 s
> ━━━━━━━━━━━━━━━━━━━━━━━━━━━━━━━━━━ BACKTRACE ━━━━━━━━━━━━━━━━━━━━━━━━━━━━━━━━━━━
50.80 s
> 1: <color_eyre[51793ea62743adbd]::config::PanicHook>::panic_report<unknown>
50.80 s
> at <unknown source file>:<unknown line>
50.80 s
> 2: <color_eyre[51793ea62743adbd]::config::PanicHook>::into_panic_hook::{closure#0}<unknown>
50.80 s
> at <unknown source file>:<unknown line>
50.80 s
> 3: std[bcb96dfbba0ab899]::panicking::panic_with_hook<unknown>
50.80 s
> at <unknown source file>:<unknown line>
50.80 s
> 4: std[bcb96dfbba0ab899]::panicking::panic_handler::{closure#0}<unknown>
50.80 s
> at <unknown source file>:<unknown line>
50.80 s
> 5: std[bcb96dfbba0ab899]::sys::backtrace::__rust_end_short_backtrace::<std[bcb96dfbba0ab899]::panicking::panic_handler::{closure#0}, !><unknown>
50.80 s
> at <unknown source file>:<unknown line>
50.80 s
> 6: __rustc[6c289b9f9c454d21]::rust_begin_unwind<unknown>
50.80 s
> at <unknown source file>:<unknown line>
50.80 s
> 7: core[940e698046960fd5]::panicking::panic_fmt<unknown>
50.80 s
> at <unknown source file>:<unknown line>
50.80 s
> 8: core[940e698046960fd5]::panicking::panic<unknown>
50.80 s
> at <unknown source file>:<unknown line>
50.80 s
> 9: <test_renormalization[5812939ef1a04d89]::finite_part_ghost_2loop::{closure#0} as core[940e698046960fd5]::ops::function::FnOnce<()>>::call_once<unknown>
50.80 s
> at <unknown source file>:<unknown line>
50.80 s
> 10: test[75d6903177b1d7e9]::__rust_begin_short_backtrace::<core[940e698046960fd5]::result::Result<(), alloc[2ea6bcb46fca0c42]::string::String>, fn() -> core[940e698046960fd5]::result::Result<(), alloc[2ea6bcb46fca0c42]::string::String>><unknown>
50.80 s
> at <unknown source file>:<unknown line>
50.80 s
> 11: test[75d6903177b1d7e9]::run_test::{closure#0}<unknown>
50.80 s
> at <unknown source file>:<unknown line>
50.80 s
> 12: std[bcb96dfbba0ab899]::sys::backtrace::__rust_begin_short_backtrace::<test[75d6903177b1d7e9]::run_test::{closure#1}, ()><unknown>
50.80 s
> at <unknown source file>:<unknown line>
50.80 s
> 13: <std[bcb96dfbba0ab899]::thread::lifecycle::spawn_unchecked<test[75d6903177b1d7e9]::run_test::{closure#1}, ()>::{closure#1} as core[940e698046960fd5]::ops::function::FnOnce<()>>::call_once::{shim:vtable#0}<unknown>
50.80 s
> at <unknown source file>:<unknown line>
50.80 s
> 14: <std[bcb96dfbba0ab899]::sys::thread::unix::Thread>::new::thread_start<unknown>
50.80 s
> at <unknown source file>:<unknown line>
50.80 s
> 15: start_thread<unknown>
50.80 s
> at <unknown source file>:<unknown line>
50.80 s
> 16: __clone3<unknown>
50.80 s
> at <unknown source file>:<unknown line>
50.80 s
>
50.80 s
> Run with COLORBT_SHOW_HIDDEN=1 environment variable to disable frame filtering.
50.80 s
> Run with RUST_BACKTRACE=full to include source snippets.
50.80 s
> =========================================
50.80 s
> Extracting 1 binary, 1 build script output directory, and 1 linked path to /build/nextest-archive-zhRowh
50.80 s
> Extracted 7 files to /build/nextest-archive-zhRowh in 0.08s
50.80 s
> ------------
50.80 s
> Nextest run ID 195ea33a-92d5-4edf-9660-54b9643abf7a with nextest profile: ci_gammaloop
50.80 s
> Starting 105 tests across 1 binary
50.80 s
> ------------
50.80 s
> Summary [ 17.440s] 105 tests run: 105 passed , 0 skipped
50.80 s
>
50.80 s
> ========== nextest test summary ==========
50.80 s
> report: target/nextest/ci_gammaloop/junit.xml
50.80 s
> tests: 105, failures: 0, errors: 0
50.80 s
> No failing testcases found.
50.80 s
> =========================================
50.80 s
For full logs, run:
50.80 s
nix log /nix/store/7i3bc9vasq286igikm494rqdb64pilng-gammaloop-nextest-core.drv
50.95 s
Run failed.