0.00 s
$ /nix/store/9ypz3flqsrl5xl495mm8h645gadjsxi1-coreutils-9.11/bin/timeout --kill-after=15s 7200s /nix/store/23zk8sgzamrbmj1fday15szf7f2279s8-nix-2.34.7/bin/nix --extra-experimental-features nix-command --extra-experimental-features flakes flake clone git+https://github.com/alphal00p/gammaloop --dest /tmp/nix-ci-worker/stable-pwd/repo/
0.09 s
Cloning into '/tmp/nix-ci-worker/stable-pwd/repo'...
0.87 s
remote: Enumerating objects: 85887, done.
0.88 s
remote: Counting objects: 0% (1/8980)
remote: Counting objects: 1% (90/8980)
remote: Counting objects: 2% (180/8980)
remote: Counting objects: 3% (270/8980)
remote: Counting objects: 4% (360/8980)
remote: Counting objects: 5% (449/8980)
remote: Counting objects: 6% (539/8980)
remote: Counting objects: 7% (629/8980)
remote: Counting objects: 8% (719/8980)
remote: Counting objects: 9% (809/8980)
remote: Counting objects: 10% (898/8980)
remote: Counting objects: 11% (988/8980)
remote: Counting objects: 12% (1078/8980)
remote: Counting objects: 13% (1168/8980)
remote: Counting objects: 14% (1258/8980)
remote: Counting objects: 15% (1347/8980)
remote: Counting objects: 16% (1437/8980)
remote: Counting objects: 17% (1527/8980)
remote: Counting objects: 18% (1617/8980)
remote: Counting objects: 19% (1707/8980)
remote: Counting objects: 20% (1796/8980)
remote: Counting objects: 21% (1886/8980)
remote: Counting objects: 22% (1976/8980)
remote: Counting objects: 23% (2066/8980)
remote: Counting objects: 24% (2156/8980)
remote: Counting objects: 25% (2245/8980)
remote: Counting objects: 26% (2335/8980)
remote: Counting objects: 27% (2425/8980)
remote: Counting objects: 28% (2515/8980)
remote: Counting objects: 29% (2605/8980)
remote: Counting objects: 30% (2694/8980)
remote: Counting objects: 31% (2784/8980)
remote: Counting objects: 32% (2874/8980)
remote: Counting objects: 33% (2964/8980)
remote: Counting objects: 34% (3054/8980)
remote: Counting objects: 35% (3143/8980)
remote: Counting objects: 36% (3233/8980)
remote: Counting objects: 37% (3323/8980)
remote: Counting objects: 38% (3413/8980)
remote: Counting objects: 39% (3503/8980)
remote: Counting objects: 40% (3592/8980)
remote: Counting objects: 41% (3682/8980)
remote: Counting objects: 42% (3772/8980)
remote: Counting objects: 43% (3862/8980)
remote: Counting objects: 44% (3952/8980)
remote: Counting objects: 45% (4041/8980)
remote: Counting objects: 46% (4131/8980)
remote: Counting objects: 47% (4221/8980)
remote: Counting objects: 48% (4311/8980)
remote: Counting objects: 49% (4401/8980)
remote: Counting objects: 50% (4490/8980)
remote: Counting objects: 51% (4580/8980)
remote: Counting objects: 52% (4670/8980)
remote: Counting objects: 53% (4760/8980)
remote: Counting objects: 54% (4850/8980)
remote: Counting objects: 55% (4939/8980)
remote: Counting objects: 56% (5029/8980)
remote: Counting objects: 57% (5119/8980)
remote: Counting objects: 58% (5209/8980)
remote: Counting objects: 59% (5299/8980)
remote: Counting objects: 60% (5388/8980)
remote: Counting objects: 61% (5478/8980)
remote: Counting objects: 62% (5568/8980)
remote: Counting objects: 63% (5658/8980)
remote: Counting objects: 64% (5748/8980)
remote: Counting objects: 65% (5837/8980)
remote: Counting objects: 66% (5927/8980)
remote: Counting objects: 67% (6017/8980)
remote: Counting objects: 68% (6107/8980)
remote: Counting objects: 69% (6197/8980)
remote: Counting objects: 70% (6286/8980)
remote: Counting objects: 71% (6376/8980)
remote: Counting objects: 72% (6466/8980)
remote: Counting objects: 73% (6556/8980)
remote: Counting objects: 74% (6646/8980)
remote: Counting objects: 75% (6735/8980)
remote: Counting objects: 76% (6825/8980)
remote: Counting objects: 77% (6915/8980)
remote: Counting objects: 78% (7005/8980)
remote: Counting objects: 79% (7095/8980)
remote: Counting objects: 80% (7184/8980)
remote: Counting objects: 81% (7274/8980)
remote: Counting objects: 82% (7364/8980)
remote: Counting objects: 83% (7454/8980)
remote: Counting objects: 84% (7544/8980)
remote: Counting objects: 85% (7633/8980)
remote: Counting objects: 86% (7723/8980)
remote: Counting objects: 87% (7813/8980)
remote: Counting objects: 88% (7903/8980)
remote: Counting objects: 89% (7993/8980)
remote: Counting objects: 90% (8082/8980)
remote: Counting objects: 91% (8172/8980)
remote: Counting objects: 92% (8262/8980)
remote: Counting objects: 93% (8352/8980)
remote: Counting objects: 94% (8442/8980)
remote: Counting objects: 95% (8531/8980)
remote: Counting objects: 96% (8621/8980)
remote: Counting objects: 97% (8711/8980)
remote: Counting objects: 98% (8801/8980)
remote: Counting objects: 99% (8891/8980)
remote: Counting objects: 100% (8980/8980)
remote: Counting objects: 100% (8980/8980), done.
2.90 s
remote: Compressing objects: 0% (1/1989)
remote: Compressing objects: 1% (20/1989)
remote: Compressing objects: 2% (40/1989)
remote: Compressing objects: 3% (60/1989)
remote: Compressing objects: 4% (80/1989)
remote: Compressing objects: 5% (100/1989)
remote: Compressing objects: 6% (120/1989)
remote: Compressing objects: 7% (140/1989)
remote: Compressing objects: 8% (160/1989)
remote: Compressing objects: 9% (180/1989)
remote: Compressing objects: 10% (199/1989)
remote: Compressing objects: 10% (218/1989)
remote: Compressing objects: 11% (219/1989)
remote: Compressing objects: 12% (239/1989)
remote: Compressing objects: 13% (259/1989)
remote: Compressing objects: 14% (279/1989)
remote: Compressing objects: 15% (299/1989)
remote: Compressing objects: 16% (319/1989)
remote: Compressing objects: 17% (339/1989)
remote: Compressing objects: 18% (359/1989)
remote: Compressing objects: 19% (378/1989)
remote: Compressing objects: 20% (398/1989)
remote: Compressing objects: 21% (418/1989)
remote: Compressing objects: 22% (438/1989)
remote: Compressing objects: 23% (458/1989)
remote: Compressing objects: 24% (478/1989)
remote: Compressing objects: 25% (498/1989)
remote: Compressing objects: 26% (518/1989)
remote: Compressing objects: 27% (538/1989)
remote: Compressing objects: 28% (557/1989)
remote: Compressing objects: 29% (577/1989)
remote: Compressing objects: 30% (597/1989)
remote: Compressing objects: 31% (617/1989)
remote: Compressing objects: 32% (637/1989)
remote: Compressing objects: 33% (657/1989)
remote: Compressing objects: 34% (677/1989)
remote: Compressing objects: 35% (697/1989)
remote: Compressing objects: 36% (717/1989)
remote: Compressing objects: 37% (736/1989)
remote: Compressing objects: 38% (756/1989)
remote: Compressing objects: 39% (776/1989)
remote: Compressing objects: 40% (796/1989)
remote: Compressing objects: 41% (816/1989)
remote: Compressing objects: 42% (836/1989)
remote: Compressing objects: 43% (856/1989)
remote: Compressing objects: 44% (876/1989)
remote: Compressing objects: 45% (896/1989)
remote: Compressing objects: 46% (915/1989)
remote: Compressing objects: 47% (935/1989)
remote: Compressing objects: 48% (955/1989)
remote: Compressing objects: 49% (975/1989)
remote: Compressing objects: 50% (995/1989)
remote: Compressing objects: 51% (1015/1989)
remote: Compressing objects: 52% (1035/1989)
remote: Compressing objects: 53% (1055/1989)
remote: Compressing objects: 54% (1075/1989)
remote: Compressing objects: 55% (1094/1989)
remote: Compressing objects: 56% (1114/1989)
remote: Compressing objects: 57% (1134/1989)
remote: Compressing objects: 58% (1154/1989)
remote: Compressing objects: 59% (1174/1989)
remote: Compressing objects: 60% (1194/1989)
remote: Compressing objects: 61% (1214/1989)
remote: Compressing objects: 62% (1234/1989)
remote: Compressing objects: 63% (1254/1989)
remote: Compressing objects: 64% (1273/1989)
remote: Compressing objects: 65% (1293/1989)
remote: Compressing objects: 66% (1313/1989)
remote: Compressing objects: 67% (1333/1989)
remote: Compressing objects: 68% (1353/1989)
remote: Compressing objects: 69% (1373/1989)
remote: Compressing objects: 70% (1393/1989)
remote: Compressing objects: 71% (1413/1989)
remote: Compressing objects: 72% (1433/1989)
remote: Compressing objects: 73% (1452/1989)
remote: Compressing objects: 74% (1472/1989)
remote: Compressing objects: 75% (1492/1989)
remote: Compressing objects: 76% (1512/1989)
remote: Compressing objects: 77% (1532/1989)
remote: Compressing objects: 78% (1552/1989)
remote: Compressing objects: 79% (1572/1989)
remote: Compressing objects: 80% (1592/1989)
remote: Compressing objects: 80% (1597/1989)
remote: Compressing objects: 81% (1612/1989)
remote: Compressing objects: 82% (1631/1989)
remote: Compressing objects: 83% (1651/1989)
remote: Compressing objects: 84% (1671/1989)
remote: Compressing objects: 85% (1691/1989)
remote: Compressing objects: 86% (1711/1989)
remote: Compressing objects: 87% (1731/1989)
remote: Compressing objects: 88% (1751/1989)
remote: Compressing objects: 89% (1771/1989)
remote: Compressing objects: 90% (1791/1989)
remote: Compressing objects: 91% (1810/1989)
remote: Compressing objects: 92% (1830/1989)
remote: Compressing objects: 93% (1850/1989)
remote: Compressing objects: 94% (1870/1989)
remote: Compressing objects: 95% (1890/1989)
remote: Compressing objects: 96% (1910/1989)
remote: Compressing objects: 97% (1930/1989)
remote: Compressing objects: 98% (1950/1989)
remote: Compressing objects: 99% (1970/1989)
remote: Compressing objects: 100% (1989/1989)
remote: Compressing objects: 100% (1989/1989), done.
13.19 s
Receiving objects: 0% (1/85887)
Receiving objects: 1% (859/85887)
Receiving objects: 2% (1718/85887)
Receiving objects: 3% (2577/85887)
Receiving objects: 4% (3436/85887)
Receiving objects: 5% (4295/85887)
Receiving objects: 6% (5154/85887)
Receiving objects: 7% (6013/85887)
Receiving objects: 8% (6871/85887)
Receiving objects: 9% (7730/85887), 11.17 MiB | 22.32 MiB/s
Receiving objects: 10% (8589/85887), 11.17 MiB | 22.32 MiB/s
Receiving objects: 11% (9448/85887), 11.17 MiB | 22.32 MiB/s
Receiving objects: 12% (10307/85887), 11.17 MiB | 22.32 MiB/s
Receiving objects: 13% (11166/85887), 11.17 MiB | 22.32 MiB/s
Receiving objects: 14% (12025/85887), 11.17 MiB | 22.32 MiB/s
Receiving objects: 15% (12884/85887), 11.17 MiB | 22.32 MiB/s
Receiving objects: 16% (13742/85887), 11.17 MiB | 22.32 MiB/s
Receiving objects: 17% (14601/85887), 11.17 MiB | 22.32 MiB/s
Receiving objects: 18% (15460/85887), 11.17 MiB | 22.32 MiB/s
Receiving objects: 19% (16319/85887), 11.17 MiB | 22.32 MiB/s
Receiving objects: 20% (17178/85887), 11.17 MiB | 22.32 MiB/s
Receiving objects: 21% (18037/85887), 11.17 MiB | 22.32 MiB/s
Receiving objects: 22% (18896/85887), 11.17 MiB | 22.32 MiB/s
Receiving objects: 23% (19755/85887), 11.17 MiB | 22.32 MiB/s
Receiving objects: 24% (20613/85887), 11.17 MiB | 22.32 MiB/s
Receiving objects: 25% (21472/85887), 11.17 MiB | 22.32 MiB/s
Receiving objects: 26% (22331/85887), 11.17 MiB | 22.32 MiB/s
Receiving objects: 27% (23190/85887), 11.17 MiB | 22.32 MiB/s
Receiving objects: 28% (24049/85887), 11.17 MiB | 22.32 MiB/s
Receiving objects: 29% (24908/85887), 11.17 MiB | 22.32 MiB/s
Receiving objects: 30% (25767/85887), 11.17 MiB | 22.32 MiB/s
Receiving objects: 31% (26625/85887), 11.17 MiB | 22.32 MiB/s
Receiving objects: 32% (27484/85887), 11.17 MiB | 22.32 MiB/s
Receiving objects: 33% (28343/85887), 11.17 MiB | 22.32 MiB/s
Receiving objects: 34% (29202/85887), 11.17 MiB | 22.32 MiB/s
Receiving objects: 35% (30061/85887), 11.17 MiB | 22.32 MiB/s
Receiving objects: 36% (30920/85887), 11.17 MiB | 22.32 MiB/s
Receiving objects: 36% (31449/85887), 29.43 MiB | 28.83 MiB/s
Receiving objects: 37% (31779/85887), 29.43 MiB | 28.83 MiB/s
Receiving objects: 38% (32638/85887), 29.43 MiB | 28.83 MiB/s
Receiving objects: 39% (33496/85887), 29.43 MiB | 28.83 MiB/s
Receiving objects: 40% (34355/85887), 29.43 MiB | 28.83 MiB/s
Receiving objects: 41% (35214/85887), 29.43 MiB | 28.83 MiB/s
Receiving objects: 42% (36073/85887), 29.43 MiB | 28.83 MiB/s
Receiving objects: 43% (36932/85887), 29.43 MiB | 28.83 MiB/s
Receiving objects: 44% (37791/85887), 29.43 MiB | 28.83 MiB/s
Receiving objects: 45% (38650/85887), 29.43 MiB | 28.83 MiB/s
Receiving objects: 46% (39509/85887), 29.43 MiB | 28.83 MiB/s
Receiving objects: 47% (40367/85887), 45.63 MiB | 29.83 MiB/s
Receiving objects: 48% (41226/85887), 45.63 MiB | 29.83 MiB/s
Receiving objects: 49% (42085/85887), 45.63 MiB | 29.83 MiB/s
Receiving objects: 50% (42944/85887), 45.63 MiB | 29.83 MiB/s
Receiving objects: 51% (43803/85887), 45.63 MiB | 29.83 MiB/s
Receiving objects: 52% (44662/85887), 45.63 MiB | 29.83 MiB/s
Receiving objects: 53% (45521/85887), 45.63 MiB | 29.83 MiB/s
Receiving objects: 54% (46379/85887), 45.63 MiB | 29.83 MiB/s
Receiving objects: 55% (47238/85887), 45.63 MiB | 29.83 MiB/s
Receiving objects: 56% (48097/85887), 45.63 MiB | 29.83 MiB/s
Receiving objects: 56% (48635/85887), 45.63 MiB | 29.83 MiB/s
Receiving objects: 57% (48956/85887), 62.64 MiB | 30.69 MiB/s
Receiving objects: 58% (49815/85887), 62.64 MiB | 30.69 MiB/s
Receiving objects: 59% (50674/85887), 62.64 MiB | 30.69 MiB/s
Receiving objects: 60% (51533/85887), 62.64 MiB | 30.69 MiB/s
Receiving objects: 61% (52392/85887), 62.64 MiB | 30.69 MiB/s
Receiving objects: 62% (53250/85887), 75.87 MiB | 29.86 MiB/s
Receiving objects: 63% (54109/85887), 75.87 MiB | 29.86 MiB/s
Receiving objects: 64% (54968/85887), 75.87 MiB | 29.86 MiB/s
Receiving objects: 65% (55827/85887), 75.87 MiB | 29.86 MiB/s
Receiving objects: 66% (56686/85887), 75.87 MiB | 29.86 MiB/s
Receiving objects: 66% (57360/85887), 86.50 MiB | 28.42 MiB/s
Receiving objects: 66% (57382/85887), 95.04 MiB | 26.81 MiB/s
Receiving objects: 67% (57545/85887), 103.22 MiB | 25.52 MiB/s
Receiving objects: 68% (58404/85887), 103.22 MiB | 25.52 MiB/s
Receiving objects: 69% (59263/85887), 103.22 MiB | 25.52 MiB/s
Receiving objects: 70% (60121/85887), 103.22 MiB | 25.52 MiB/s
Receiving objects: 71% (60980/85887), 110.62 MiB | 24.33 MiB/s
Receiving objects: 72% (61839/85887), 110.62 MiB | 24.33 MiB/s
Receiving objects: 72% (61869/85887), 110.62 MiB | 24.33 MiB/s
Receiving objects: 73% (62698/85887), 114.35 MiB | 22.69 MiB/s
Receiving objects: 73% (63255/85887), 117.76 MiB | 19.51 MiB/s
Receiving objects: 74% (63557/85887), 121.43 MiB | 16.77 MiB/s
Receiving objects: 74% (64337/85887), 128.34 MiB | 11.64 MiB/s
Receiving objects: 75% (64416/85887), 128.34 MiB | 11.64 MiB/s
Receiving objects: 76% (65275/85887), 131.78 MiB | 10.04 MiB/s
Receiving objects: 77% (66133/85887), 131.78 MiB | 10.04 MiB/s
Receiving objects: 78% (66992/85887), 131.78 MiB | 10.04 MiB/s
Receiving objects: 79% (67851/85887), 131.78 MiB | 10.04 MiB/s
Receiving objects: 80% (68710/85887), 131.78 MiB | 10.04 MiB/s
Receiving objects: 80% (69195/85887), 131.78 MiB | 10.04 MiB/s
Receiving objects: 81% (69569/85887), 135.48 MiB | 8.97 MiB/s
Receiving objects: 82% (70428/85887), 135.48 MiB | 8.97 MiB/s
Receiving objects: 83% (71287/85887), 135.48 MiB | 8.97 MiB/s
Receiving objects: 84% (72146/85887), 135.48 MiB | 8.97 MiB/s
Receiving objects: 85% (73004/85887), 135.48 MiB | 8.97 MiB/s
Receiving objects: 86% (73863/85887), 139.50 MiB | 8.05 MiB/s
Receiving objects: 86% (74153/85887), 139.50 MiB | 8.05 MiB/s
Receiving objects: 87% (74722/85887), 143.83 MiB | 7.37 MiB/s
Receiving objects: 88% (75581/85887), 143.83 MiB | 7.37 MiB/s
Receiving objects: 89% (76440/85887), 148.50 MiB | 7.58 MiB/s
Receiving objects: 90% (77299/85887), 148.50 MiB | 7.58 MiB/s
Receiving objects: 91% (78158/85887), 148.50 MiB | 7.58 MiB/s
Receiving objects: 92% (79017/85887), 148.50 MiB | 7.58 MiB/s
Receiving objects: 93% (79875/85887), 148.50 MiB | 7.58 MiB/s
Receiving objects: 94% (80734/85887), 148.50 MiB | 7.58 MiB/s
Receiving objects: 95% (81593/85887), 148.50 MiB | 7.58 MiB/s
Receiving objects: 96% (82452/85887), 148.50 MiB | 7.58 MiB/s
Receiving objects: 97% (83311/85887), 148.50 MiB | 7.58 MiB/s
Receiving objects: 97% (83675/85887), 148.50 MiB | 7.58 MiB/s
Receiving objects: 98% (84170/85887), 148.50 MiB | 7.58 MiB/s
Receiving objects: 99% (85029/85887), 153.48 MiB | 7.92 MiB/s
remote: Total 85887 (delta 7809), reused 7097 (delta 6991), pack-reused 76907 (from 3)
13.19 s
Receiving objects: 100% (85887/85887), 153.48 MiB | 7.92 MiB/s
Receiving objects: 100% (85887/85887), 155.80 MiB | 15.15 MiB/s, done.
14.54 s
Resolving deltas: 0% (0/58257)
Resolving deltas: 1% (583/58257)
Resolving deltas: 2% (1166/58257)
Resolving deltas: 3% (1748/58257)
Resolving deltas: 4% (2331/58257)
Resolving deltas: 5% (2913/58257)
Resolving deltas: 6% (3496/58257)
Resolving deltas: 7% (4078/58257)
Resolving deltas: 8% (4661/58257)
Resolving deltas: 9% (5248/58257)
Resolving deltas: 10% (5829/58257)
Resolving deltas: 11% (6409/58257)
Resolving deltas: 12% (6991/58257)
Resolving deltas: 13% (7574/58257)
Resolving deltas: 14% (8156/58257)
Resolving deltas: 15% (8742/58257)
Resolving deltas: 16% (9322/58257)
Resolving deltas: 17% (9904/58257)
Resolving deltas: 18% (10487/58257)
Resolving deltas: 19% (11069/58257)
Resolving deltas: 20% (11652/58257)
Resolving deltas: 21% (12234/58257)
Resolving deltas: 22% (12817/58257)
Resolving deltas: 23% (13400/58257)
Resolving deltas: 24% (13982/58257)
Resolving deltas: 25% (14565/58257)
Resolving deltas: 26% (15148/58257)
Resolving deltas: 27% (15730/58257)
Resolving deltas: 28% (16312/58257)
Resolving deltas: 29% (16895/58257)
Resolving deltas: 30% (17478/58257)
Resolving deltas: 31% (18060/58257)
Resolving deltas: 32% (18643/58257)
Resolving deltas: 33% (19225/58257)
Resolving deltas: 34% (19808/58257)
Resolving deltas: 35% (20390/58257)
Resolving deltas: 36% (20974/58257)
Resolving deltas: 37% (21556/58257)
Resolving deltas: 38% (22138/58257)
Resolving deltas: 39% (22722/58257)
Resolving deltas: 40% (23303/58257)
Resolving deltas: 41% (23886/58257)
Resolving deltas: 42% (24468/58257)
Resolving deltas: 43% (25051/58257)
Resolving deltas: 44% (25634/58257)
Resolving deltas: 45% (26216/58257)
Resolving deltas: 46% (26799/58257)
Resolving deltas: 47% (27381/58257)
Resolving deltas: 48% (27964/58257)
Resolving deltas: 49% (28548/58257)
Resolving deltas: 50% (29129/58257)
Resolving deltas: 51% (29712/58257)
Resolving deltas: 52% (30294/58257)
Resolving deltas: 53% (30877/58257)
Resolving deltas: 54% (31459/58257)
Resolving deltas: 55% (32042/58257)
Resolving deltas: 56% (32625/58257)
Resolving deltas: 57% (33207/58257)
Resolving deltas: 58% (33790/58257)
Resolving deltas: 59% (34372/58257)
Resolving deltas: 60% (34955/58257)
Resolving deltas: 61% (35538/58257)
Resolving deltas: 62% (36120/58257)
Resolving deltas: 63% (36702/58257)
Resolving deltas: 64% (37285/58257)
Resolving deltas: 65% (37868/58257)
Resolving deltas: 66% (38451/58257)
Resolving deltas: 67% (39033/58257)
Resolving deltas: 68% (39617/58257)
Resolving deltas: 69% (40198/58257)
Resolving deltas: 70% (40780/58257)
Resolving deltas: 71% (41363/58257)
Resolving deltas: 72% (41946/58257)
Resolving deltas: 73% (42528/58257)
Resolving deltas: 74% (43111/58257)
Resolving deltas: 74% (43439/58257)
Resolving deltas: 75% (43693/58257)
Resolving deltas: 76% (44276/58257)
Resolving deltas: 77% (44859/58257)
Resolving deltas: 78% (45441/58257)
Resolving deltas: 79% (46024/58257)
Resolving deltas: 80% (46606/58257)
Resolving deltas: 81% (47189/58257)
Resolving deltas: 82% (47771/58257)
Resolving deltas: 83% (48354/58257)
Resolving deltas: 84% (48938/58257)
Resolving deltas: 85% (49519/58257)
Resolving deltas: 86% (50102/58257)
Resolving deltas: 87% (50684/58257)
Resolving deltas: 88% (51267/58257)
Resolving deltas: 89% (51849/58257)
Resolving deltas: 90% (52432/58257)
Resolving deltas: 91% (53014/58257)
Resolving deltas: 92% (53597/58257)
Resolving deltas: 93% (54180/58257)
Resolving deltas: 94% (54762/58257)
Resolving deltas: 95% (55345/58257)
Resolving deltas: 96% (55927/58257)
Resolving deltas: 97% (56510/58257)
Resolving deltas: 98% (57092/58257)
Resolving deltas: 99% (57675/58257)
Resolving deltas: 100% (58257/58257)
Resolving deltas: 100% (58257/58257), done.
14.87 s
Fetching commit 1aaff9f8fbdea00653c1c35b8c9535b04e3fc668 for faster_uv_from_4d ...
14.87 s
$ /nix/store/bcnisk3ydfgv26v2gw3zlky24g00yww2-git-2.54.0/bin/git fetch origin 1aaff9f8fbdea00653c1c35b8c9535b04e3fc668
15.37 s
From https://github.com/alphal00p/gammaloop
15.37 s
* branch 1aaff9f8fbdea00653c1c35b8c9535b04e3fc668 -> FETCH_HEAD
15.39 s
$ /nix/store/9ypz3flqsrl5xl495mm8h645gadjsxi1-coreutils-9.11/bin/timeout --kill-after=15s 7200s /nix/store/bcnisk3ydfgv26v2gw3zlky24g00yww2-git-2.54.0/bin/git -c advice.detachedHead=false checkout 1aaff9f8fbdea00653c1c35b8c9535b04e3fc668
15.55 s
HEAD is now at 1aaff9f8f record complete gl262 tensor preprocessing
15.55 s
$ /nix/store/9ypz3flqsrl5xl495mm8h645gadjsxi1-coreutils-9.11/bin/timeout --kill-after=15s 7200s /nix/store/23zk8sgzamrbmj1fday15szf7f2279s8-nix-2.34.7/bin/nix --extra-experimental-features nix-command --extra-experimental-features flakes --log-format internal-json run .#packages.x86_64-linux.nix-ci-check-gammaloop-nextest-core --print-build-logs
15.67 s
error (ignored): SQLite database '/var/cache/nix-ci-worker/eval-cache-v6/14c78e823cd4d0fc551532c088fc1d39eb847190cddeb65ce1f200a0835328ec.sqlite ' is busy
20.49 s
20.69 s
Downloading cached gammaloop-nextest-binaries-core-gammaloop-api from https://cache.nix-ci.com
20.69 s
Downloading cached gammaloop-nextest-binaries-core-gammaloop-tracing-filter from https://cache.nix-ci.com
20.69 s
Downloading cached gammaloop-nextest-binaries-core-gammaloop-tracing-filter-macros from https://cache.nix-ci.com
20.69 s
Downloading cached gammaloop-nextest-binaries-core-gammalooprs from https://cache.nix-ci.com
20.69 s
Downloading cached gammaloop-nextest-binaries-core-three-dimensional-reps from https://cache.nix-ci.com
21.03 s
Downloaded cached gammaloop-nextest-binaries-core-gammaloop-tracing-filter-macros (1.7 MiB) in 336ms
21.03 s
Progress: 0 of 1 built, 1 of 7 downloaded from cache (4 downloading)
21.28 s
Downloaded cached gammaloop-nextest-binaries-core-three-dimensional-reps (9.5 MiB) in 591ms
21.28 s
Progress: 0 of 1 built, 2 of 7 downloaded from cache (3 downloading)
21.43 s
Downloaded cached gammaloop-nextest-binaries-core-gammaloop-tracing-filter (8.1 MiB) in 743ms
21.43 s
Progress: 0 of 1 built, 3 of 7 downloaded from cache (2 downloading)
23.80 s
Downloaded cached gammaloop-nextest-binaries-core-gammaloop-api (120.9 MiB) in 3.1s
23.80 s
Progress: 0 of 1 built, 4 of 7 downloaded from cache (1 downloading)
23.90 s
Downloaded cached gammaloop-nextest-binaries-core-gammalooprs (88.1 MiB) in 3.2s
23.90 s
Progress: 0 of 1 built, 5 of 7 downloaded from cache
23.90 s
Downloading cached gammaloop-nextest-binaries-core from https://cache.nix-ci.com
23.95 s
Downloaded cached gammaloop-nextest-binaries-core (2032 B) in 52ms
23.95 s
Progress: 0 of 1 built, 6 of 7 downloaded from cache
23.95 s
Downloading cached nix-ci-check-gammaloop-nextest-core from https://cache.nix-ci.com
23.99 s
Downloaded cached nix-ci-check-gammaloop-nextest-core (1016 B) in 43ms
23.99 s
Progress: 0 of 1 built, 7 of 7 downloaded from cache
33.65 s
evaluating derivation 'g
copying '/nix/store/2xyx
evaluating derivation 'g
copying '/nix/store/2xyx
evaluating derivation 'g
copying '/nix/store/2xyx
evaluating derivation 'g
copying '/nix/store/2xyx
evaluating derivation 'g
copying '/nix/store/2xyx
evaluating derivation 'g
copying '/nix/store/2xyx
evaluating derivation 'g
copying '/nix/store/2xyx
evaluating derivation 'g
querying gammaloop-nexte
querying info about miss
querying gammaloop-nexte
[0.0 KiB DL] querying ne
[2.2 KiB DL] querying fl
[3.2 KiB DL] querying nt
[4.8 KiB DL] querying gf
[6.2 KiB DL] querying gf
[0 /7 built, 8 /0 /16 copie
[0 /7 built, 6 /2 /16 copie
[0 /6 built, 5 /5 /16 copie
[0 /6 built, 5 /6 /16 copie
[0 /6 built, 4 /7 /16 copie
[0 /6 built, 4 /8 /16 copie
[0 /5 built, 3 /9 /16 copie
[0 /5 built, 3 /10 /16 copi
[0 /5 built, 3 /11 /16 copi
[0 /4 built, 2 /12 /16 copi
[0 /4 built, 2 /13 /16 copi
[0 /3 built, 1 /14 /16 copi
[0 /2 built, 1 /15 /16 copi
[0 /1 built, 16 copied (4
[1 /0 /1 built, 16 copied gammaloop-nextest-core> Extracting 4 binaries (including 1 non-test binary), 1 build script output directory, and 2 linked paths to /build/nextest-archive-uodyo6
34.59 s
gammaloop-nextest-core> Extracted 20 files to /build/nextest-archive-uodyo6 in 0.94s
34.60 s
gammaloop-nextest-core> ------------
34.60 s
gammaloop-nextest-core> Nextest run ID f0b647b0-d9b4-470a-8811-5a2e8b4e611e with nextest profile: ci_gammaloop
34.60 s
gammaloop-nextest-core> Starting 379 tests across 3 binaries
36.16 s
gammaloop-nextest-core> ------------
36.16 s
gammaloop-nextest-core> Summary [ 1.560s] 379 tests run: 379 passed , 0 skipped
36.32 s
gammaloop-nextest-core>
36.32 s
gammaloop-nextest-core> ========== nextest test summary ==========
36.32 s
gammaloop-nextest-core> report: target/nextest/ci_gammaloop/junit.xml
36.32 s
gammaloop-nextest-core> tests: 379, failures: 0, errors: 0
36.32 s
gammaloop-nextest-core> No failing testcases found.
36.32 s
gammaloop-nextest-core> =========================================
36.34 s
gammaloop-nextest-core> Extracting 1 binary and 1 linked path to /build/nextest-archive-lqBl2E
36.42 s
gammaloop-nextest-core> Extracted 7 files to /build/nextest-archive-lqBl2E in 0.08s
36.44 s
gammaloop-nextest-core> ------------
36.44 s
gammaloop-nextest-core> Nextest run ID f845bdf5-80b8-45b6-8ea9-804f43e8a3e8 with nextest profile: ci_gammaloop
36.44 s
gammaloop-nextest-core> Starting 19 tests across 1 binary
36.46 s
gammaloop-nextest-core> ------------
36.46 s
gammaloop-nextest-core> Summary [ 0.020s] 19 tests run: 19 passed , 0 skipped
36.50 s
gammaloop-nextest-core>
36.50 s
gammaloop-nextest-core> ========== nextest test summary ==========
36.50 s
gammaloop-nextest-core> report: target/nextest/ci_gammaloop/junit.xml
36.50 s
gammaloop-nextest-core> tests: 19, failures: 0, errors: 0
36.50 s
gammaloop-nextest-core> No failing testcases found.
36.50 s
gammaloop-nextest-core> =========================================
36.52 s
gammaloop-nextest-core> Extracting 1 binary to /build/nextest-archive-eUxQWC
36.55 s
gammaloop-nextest-core> Extracted 4 files to /build/nextest-archive-eUxQWC in 0.03s
36.56 s
gammaloop-nextest-core> ------------
36.56 s
gammaloop-nextest-core> Nextest run ID 2efd6162-a2a2-4d01-9eab-a0d3bffce852 with nextest profile: ci_gammaloop
36.56 s
gammaloop-nextest-core> Starting 0 tests across 1 binary
36.56 s
gammaloop-nextest-core> ------------
36.56 s
gammaloop-nextest-core> Summary [ 0.000s] 0 tests run: 0 passed , 0 skipped
36.60 s
gammaloop-nextest-core>
36.60 s
gammaloop-nextest-core> ========== nextest test summary ==========
36.60 s
gammaloop-nextest-core> report: target/nextest/ci_gammaloop/junit.xml
36.60 s
gammaloop-nextest-core> tests: 0, failures: 0, errors: 0
36.60 s
gammaloop-nextest-core> No failing testcases found.
36.60 s
gammaloop-nextest-core> =========================================
36.62 s
gammaloop-nextest-core> Extracting 4 binaries, 1 build script output directory, and 2 linked paths to /build/nextest-archive-A0aKGP
37.22 s
gammaloop-nextest-core> Extracted 18 files to /build/nextest-archive-A0aKGP in 0.60s
37.24 s
gammaloop-nextest-core> ------------
37.24 s
gammaloop-nextest-core> Nextest run ID 7bf51568-84d1-43a6-b477-a7ed26b503e7 with nextest profile: ci_gammaloop
37.24 s
gammaloop-nextest-core> Starting 705 tests across 4 binaries (60 tests skipped , including 59 tests via profile.ci_gammaloop.default-filter )
45.82 s
gammaloop-nextest-core> FAIL [ 4.058s] (700/705) gammalooprs::test_renormalization finite_part_ghost_2loop
45.82 s
gammaloop-nextest-core> stdout ---
45.82 s
gammaloop-nextest-core>
45.82 s
gammaloop-nextest-core> running 1 test
45.82 s
gammaloop-nextest-core> test finite_part_ghost_2loop ... FAILED
45.82 s
gammaloop-nextest-core>
45.82 s
gammaloop-nextest-core> failures:
45.82 s
gammaloop-nextest-core>
45.82 s
gammaloop-nextest-core> failures:
45.82 s
gammaloop-nextest-core> finite_part_ghost_2loop
45.82 s
gammaloop-nextest-core>
45.82 s
gammaloop-nextest-core> test result: FAILED. 0 passed; 1 failed; 0 ignored; 0 measured; 6 filtered out; finished in 4.05s
45.82 s
gammaloop-nextest-core>
45.82 s
gammaloop-nextest-core> stderr ---
45.82 s
gammaloop-nextest-core> The application panicked (crashed).
45.82 s
gammaloop-nextest-core> Message: assertion failed: (align_to_rqft(&a, &model) - expected).expand().is_zero()
45.82 s
gammaloop-nextest-core> Location: crates/gammalooprs/tests/test_renormalization.rs :583
45.82 s
gammaloop-nextest-core>
45.82 s
gammaloop-nextest-core> ━━━━━━━━━━━━━━━━━━━━━━━━━━━━━━━━━━ BACKTRACE ━━━━━━━━━━━━━━━━━━━━━━━━━━━━━━━━━━━
45.82 s
gammaloop-nextest-core> 1: <color_eyre[51793ea62743adbd]::config::PanicHook>::panic_report <unknown>
45.82 s
gammaloop-nextest-core> at <unknown source file> :<unknown line>
45.82 s
gammaloop-nextest-core> 2: <color_eyre[51793ea62743adbd]::config::PanicHook>::into_panic_hook::{closure#0} <unknown>
45.82 s
gammaloop-nextest-core> at <unknown source file> :<unknown line>
45.82 s
gammaloop-nextest-core> 3: std[bcb96dfbba0ab899]::panicking::panic_with_hook <unknown>
45.82 s
gammaloop-nextest-core> at <unknown source file> :<unknown line>
45.82 s
gammaloop-nextest-core> 4: std[bcb96dfbba0ab899]::panicking::panic_handler::{closure#0} <unknown>
45.82 s
gammaloop-nextest-core> at <unknown source file> :<unknown line>
45.82 s
gammaloop-nextest-core> 5: std[bcb96dfbba0ab899]::sys::backtrace::__rust_end_short_backtrace::<std[bcb96dfbba0ab899]::panicking::panic_handler::{closure#0}, !> <unknown>
45.82 s
gammaloop-nextest-core> at <unknown source file> :<unknown line>
45.82 s
gammaloop-nextest-core> 6: __rustc[6c289b9f9c454d21]::rust_begin_unwind <unknown>
45.82 s
gammaloop-nextest-core> at <unknown source file> :<unknown line>
45.82 s
gammaloop-nextest-core> 7: core[940e698046960fd5]::panicking::panic_fmt <unknown>
45.82 s
gammaloop-nextest-core> at <unknown source file> :<unknown line>
45.82 s
gammaloop-nextest-core> 8: core[940e698046960fd5]::panicking::panic <unknown>
45.82 s
gammaloop-nextest-core> at <unknown source file> :<unknown line>
45.82 s
gammaloop-nextest-core> 9: <test_renormalization[5812939ef1a04d89]::finite_part_ghost_2loop::{closure#0} as core[940e698046960fd5]::ops::function::FnOnce<()>>::call_once <unknown>
45.82 s
gammaloop-nextest-core> at <unknown source file> :<unknown line>
45.82 s
gammaloop-nextest-core> 10: test[75d6903177b1d7e9]::__rust_begin_short_backtrace::<core[940e698046960fd5]::result::Result<(), alloc[2ea6bcb46fca0c42]::string::String>, fn() -> core[940e698046960fd5]::result::Result<(), alloc[2ea6bcb46fca0c42]::string::String>> <unknown>
45.82 s
gammaloop-nextest-core> at <unknown source file> :<unknown line>
45.82 s
gammaloop-nextest-core> 11: test[75d6903177b1d7e9]::run_test::{closure#0} <unknown>
45.82 s
gammaloop-nextest-core> at <unknown source file> :<unknown line>
45.82 s
gammaloop-nextest-core> 12: std[bcb96dfbba0ab899]::sys::backtrace::__rust_begin_short_backtrace::<test[75d6903177b1d7e9]::run_test::{closure#1}, ()> <unknown>
45.82 s
gammaloop-nextest-core> at <unknown source file> :<unknown line>
45.82 s
gammaloop-nextest-core> 13: <std[bcb96dfbba0ab899]::thread::lifecycle::spawn_unchecked<test[75d6903177b1d7e9]::run_test::{closure#1}, ()>::{closure#1} as core[940e698046960fd5]::ops::function::FnOnce<()>>::call_once::{shim:vtable#0} <unknown>
45.82 s
gammaloop-nextest-core> at <unknown source file> :<unknown line>
45.82 s
gammaloop-nextest-core> 14: <std[bcb96dfbba0ab899]::sys::thread::unix::Thread>::new::thread_start <unknown>
45.82 s
gammaloop-nextest-core> at <unknown source file> :<unknown line>
45.82 s
gammaloop-nextest-core> 15: start_thread <unknown>
45.82 s
gammaloop-nextest-core> at <unknown source file> :<unknown line>
45.82 s
gammaloop-nextest-core> 16: __clone3 <unknown>
45.82 s
gammaloop-nextest-core> at <unknown source file> :<unknown line>
45.82 s
gammaloop-nextest-core>
45.82 s
gammaloop-nextest-core> Run with COLORBT_SHOW_HIDDEN=1 environment variable to disable frame filtering.
45.82 s
gammaloop-nextest-core> Run with RUST_BACKTRACE=full to include source snippets.
45.82 s
gammaloop-nextest-core>
51.55 s
gammaloop-nextest-core> ------------
51.55 s
gammaloop-nextest-core> Summary [ 14.319s] 705 tests run: 704 passed , 1 failed , 60 skipped
51.55 s
gammaloop-nextest-core> FAIL [ 4.058s] (700/705) gammalooprs::test_renormalization finite_part_ghost_2loop
51.55 s
gammaloop-nextest-core> stdout ---
51.55 s
gammaloop-nextest-core>
51.55 s
gammaloop-nextest-core> running 1 test
51.55 s
gammaloop-nextest-core> test finite_part_ghost_2loop ... FAILED
51.55 s
gammaloop-nextest-core>
51.55 s
gammaloop-nextest-core> failures:
51.55 s
gammaloop-nextest-core>
51.55 s
gammaloop-nextest-core> failures:
51.55 s
gammaloop-nextest-core> finite_part_ghost_2loop
51.55 s
gammaloop-nextest-core>
51.55 s
gammaloop-nextest-core> test result: FAILED. 0 passed; 1 failed; 0 ignored; 0 measured; 6 filtered out; finished in 4.05s
51.55 s
gammaloop-nextest-core>
51.55 s
gammaloop-nextest-core> stderr ---
51.55 s
gammaloop-nextest-core> The application panicked (crashed).
51.55 s
gammaloop-nextest-core> Message: assertion failed: (align_to_rqft(&a, &model) - expected).expand().is_zero()
51.55 s
gammaloop-nextest-core> Location: crates/gammalooprs/tests/test_renormalization.rs :583
51.55 s
gammaloop-nextest-core>
51.55 s
gammaloop-nextest-core> ━━━━━━━━━━━━━━━━━━━━━━━━━━━━━━━━━━ BACKTRACE ━━━━━━━━━━━━━━━━━━━━━━━━━━━━━━━━━━━
51.55 s
gammaloop-nextest-core> 1: <color_eyre[51793ea62743adbd]::config::PanicHook>::panic_report <unknown>
51.55 s
gammaloop-nextest-core> at <unknown source file> :<unknown line>
51.55 s
gammaloop-nextest-core> 2: <color_eyre[51793ea62743adbd]::config::PanicHook>::into_panic_hook::{closure#0} <unknown>
51.55 s
gammaloop-nextest-core> at <unknown source file> :<unknown line>
51.55 s
gammaloop-nextest-core> 3: std[bcb96dfbba0ab899]::panicking::panic_with_hook <unknown>
51.55 s
gammaloop-nextest-core> at <unknown source file> :<unknown line>
51.55 s
gammaloop-nextest-core> 4: std[bcb96dfbba0ab899]::panicking::panic_handler::{closure#0} <unknown>
51.55 s
gammaloop-nextest-core> at <unknown source file> :<unknown line>
51.55 s
gammaloop-nextest-core> 5: std[bcb96dfbba0ab899]::sys::backtrace::__rust_end_short_backtrace::<std[bcb96dfbba0ab899]::panicking::panic_handler::{closure#0}, !> <unknown>
51.55 s
gammaloop-nextest-core> at <unknown source file> :<unknown line>
51.55 s
gammaloop-nextest-core> 6: __rustc[6c289b9f9c454d21]::rust_begin_unwind <unknown>
51.55 s
gammaloop-nextest-core> at <unknown source file> :<unknown line>
51.55 s
gammaloop-nextest-core> 7: core[940e698046960fd5]::panicking::panic_fmt <unknown>
51.55 s
gammaloop-nextest-core> at <unknown source file> :<unknown line>
51.55 s
gammaloop-nextest-core> 8: core[940e698046960fd5]::panicking::panic <unknown>
51.55 s
gammaloop-nextest-core> at <unknown source file> :<unknown line>
51.55 s
gammaloop-nextest-core> 9: <test_renormalization[5812939ef1a04d89]::finite_part_ghost_2loop::{closure#0} as core[940e698046960fd5]::ops::function::FnOnce<()>>::call_once <unknown>
51.55 s
gammaloop-nextest-core> at <unknown source file> :<unknown line>
51.55 s
gammaloop-nextest-core> 10: test[75d6903177b1d7e9]::__rust_begin_short_backtrace::<core[940e698046960fd5]::result::Result<(), alloc[2ea6bcb46fca0c42]::string::String>, fn() -> core[940e698046960fd5]::result::Result<(), alloc[2ea6bcb46fca0c42]::string::String>> <unknown>
51.56 s
gammaloop-nextest-core> at <unknown source file> :<unknown line>
51.56 s
gammaloop-nextest-core> 11: test[75d6903177b1d7e9]::run_test::{closure#0} <unknown>
51.56 s
gammaloop-nextest-core> at <unknown source file> :<unknown line>
51.56 s
gammaloop-nextest-core> 12: std[bcb96dfbba0ab899]::sys::backtrace::__rust_begin_short_backtrace::<test[75d6903177b1d7e9]::run_test::{closure#1}, ()> <unknown>
51.56 s
gammaloop-nextest-core> at <unknown source file> :<unknown line>
51.56 s
gammaloop-nextest-core> 13: <std[bcb96dfbba0ab899]::thread::lifecycle::spawn_unchecked<test[75d6903177b1d7e9]::run_test::{closure#1}, ()>::{closure#1} as core[940e698046960fd5]::ops::function::FnOnce<()>>::call_once::{shim:vtable#0} <unknown>
51.56 s
gammaloop-nextest-core> at <unknown source file> :<unknown line>
51.56 s
gammaloop-nextest-core> 14: <std[bcb96dfbba0ab899]::sys::thread::unix::Thread>::new::thread_start <unknown>
51.56 s
gammaloop-nextest-core> at <unknown source file> :<unknown line>
51.56 s
gammaloop-nextest-core> 15: start_thread <unknown>
51.56 s
gammaloop-nextest-core> at <unknown source file> :<unknown line>
51.56 s
gammaloop-nextest-core> 16: __clone3 <unknown>
51.56 s
gammaloop-nextest-core> at <unknown source file> :<unknown line>
51.56 s
gammaloop-nextest-core>
51.56 s
gammaloop-nextest-core> Run with COLORBT_SHOW_HIDDEN=1 environment variable to disable frame filtering.
51.56 s
gammaloop-nextest-core> Run with RUST_BACKTRACE=full to include source snippets.
51.56 s
gammaloop-nextest-core>
51.66 s
gammaloop-nextest-core> error : test run failed
51.71 s
gammaloop-nextest-core>
51.71 s
gammaloop-nextest-core> ========== nextest test summary ==========
51.71 s
gammaloop-nextest-core> report: target/nextest/ci_gammaloop/junit.xml
51.71 s
gammaloop-nextest-core> tests: 705, failures: 1, errors: 0
51.71 s
gammaloop-nextest-core>
51.71 s
gammaloop-nextest-core> 1. gammalooprs::test_renormalization::finite_part_ghost_2loop
51.71 s
gammaloop-nextest-core> failure: test failure with exit code 101
51.71 s
gammaloop-nextest-core> system-out
51.71 s
gammaloop-nextest-core> running 1 test
51.71 s
gammaloop-nextest-core> test finite_part_ghost_2loop ... FAILED
51.71 s
gammaloop-nextest-core>
51.71 s
gammaloop-nextest-core> failures:
51.71 s
gammaloop-nextest-core>
51.71 s
gammaloop-nextest-core> failures:
51.71 s
gammaloop-nextest-core> finite_part_ghost_2loop
51.71 s
gammaloop-nextest-core>
51.71 s
gammaloop-nextest-core> test result: FAILED. 0 passed; 1 failed; 0 ignored; 0 measured; 6 filtered out; finished in 4.05s
51.71 s
gammaloop-nextest-core> system-err
51.71 s
gammaloop-nextest-core> The application panicked (crashed).
51.71 s
gammaloop-nextest-core> Message: assertion failed: (align_to_rqft(&a, &model) - expected).expand().is_zero()
51.71 s
gammaloop-nextest-core> Location: crates/gammalooprs/tests/test_renormalization.rs:583
51.71 s
gammaloop-nextest-core>
51.71 s
gammaloop-nextest-core> ━━━━━━━━━━━━━━━━━━━━━━━━━━━━━━━━━━ BACKTRACE ━━━━━━━━━━━━━━━━━━━━━━━━━━━━━━━━━━━
51.71 s
gammaloop-nextest-core> 1: <color_eyre[51793ea62743adbd]::config::PanicHook>::panic_report<unknown>
51.71 s
gammaloop-nextest-core> at <unknown source file>:<unknown line>
51.71 s
gammaloop-nextest-core> 2: <color_eyre[51793ea62743adbd]::config::PanicHook>::into_panic_hook::{closure#0}<unknown>
51.71 s
gammaloop-nextest-core> at <unknown source file>:<unknown line>
51.71 s
gammaloop-nextest-core> 3: std[bcb96dfbba0ab899]::panicking::panic_with_hook<unknown>
51.71 s
gammaloop-nextest-core> at <unknown source file>:<unknown line>
51.71 s
gammaloop-nextest-core> 4: std[bcb96dfbba0ab899]::panicking::panic_handler::{closure#0}<unknown>
51.71 s
gammaloop-nextest-core> at <unknown source file>:<unknown line>
51.71 s
gammaloop-nextest-core> 5: std[bcb96dfbba0ab899]::sys::backtrace::__rust_end_short_backtrace::<std[bcb96dfbba0ab899]::panicking::panic_handler::{closure#0}, !><unknown>
51.71 s
gammaloop-nextest-core> at <unknown source file>:<unknown line>
51.71 s
gammaloop-nextest-core> 6: __rustc[6c289b9f9c454d21]::rust_begin_unwind<unknown>
51.71 s
gammaloop-nextest-core> at <unknown source file>:<unknown line>
51.71 s
gammaloop-nextest-core> 7: core[940e698046960fd5]::panicking::panic_fmt<unknown>
51.71 s
gammaloop-nextest-core> at <unknown source file>:<unknown line>
51.71 s
gammaloop-nextest-core> 8: core[940e698046960fd5]::panicking::panic<unknown>
51.71 s
gammaloop-nextest-core> at <unknown source file>:<unknown line>
51.71 s
gammaloop-nextest-core> 9: <test_renormalization[5812939ef1a04d89]::finite_part_ghost_2loop::{closure#0} as core[940e698046960fd5]::ops::function::FnOnce<()>>::call_once<unknown>
51.71 s
gammaloop-nextest-core> at <unknown source file>:<unknown line>
51.71 s
gammaloop-nextest-core> 10: test[75d6903177b1d7e9]::__rust_begin_short_backtrace::<core[940e698046960fd5]::result::Result<(), alloc[2ea6bcb46fca0c42]::string::String>, fn() -> core[940e698046960fd5]::result::Result<(), alloc[2ea6bcb46fca0c42]::string::String>><unknown>
51.71 s
gammaloop-nextest-core> at <unknown source file>:<unknown line>
51.71 s
gammaloop-nextest-core> 11: test[75d6903177b1d7e9]::run_test::{closure#0}<unknown>
51.71 s
gammaloop-nextest-core> at <unknown source file>:<unknown line>
51.71 s
gammaloop-nextest-core> 12: std[bcb96dfbba0ab899]::sys::backtrace::__rust_begin_short_backtrace::<test[75d6903177b1d7e9]::run_test::{closure#1}, ()><unknown>
51.71 s
gammaloop-nextest-core> at <unknown source file>:<unknown line>
51.71 s
gammaloop-nextest-core> 13: <std[bcb96dfbba0ab899]::thread::lifecycle::spawn_unchecked<test[75d6903177b1d7e9]::run_test::{closure#1}, ()>::{closure#1} as core[940e698046960fd5]::ops::function::FnOnce<()>>::call_once::{shim:vtable#0}<unknown>
51.71 s
gammaloop-nextest-core> at <unknown source file>:<unknown line>
51.71 s
gammaloop-nextest-core> 14: <std[bcb96dfbba0ab899]::sys::thread::unix::Thread>::new::thread_start<unknown>
51.71 s
gammaloop-nextest-core> at <unknown source file>:<unknown line>
51.71 s
gammaloop-nextest-core> 15: start_thread<unknown>
51.71 s
gammaloop-nextest-core> at <unknown source file>:<unknown line>
51.71 s
gammaloop-nextest-core> 16: __clone3<unknown>
51.71 s
gammaloop-nextest-core> at <unknown source file>:<unknown line>
51.71 s
gammaloop-nextest-core>
51.71 s
gammaloop-nextest-core> Run with COLORBT_SHOW_HIDDEN=1 environment variable to disable frame filtering.
51.71 s
gammaloop-nextest-core> Run with RUST_BACKTRACE=full to include source snippets.
51.71 s
gammaloop-nextest-core> =========================================
51.73 s
gammaloop-nextest-core> Extracting 1 binary, 1 build script output directory, and 1 linked path to /build/nextest-archive-gBmex8
51.86 s
gammaloop-nextest-core> Extracted 7 files to /build/nextest-archive-gBmex8 in 0.12s
51.87 s
gammaloop-nextest-core> ------------
51.87 s
gammaloop-nextest-core> Nextest run ID 94285d7d-ef56-453f-b4f1-5e634d2e94ae with nextest profile: ci_gammaloop
51.87 s
gammaloop-nextest-core> Starting 105 tests across 1 binary
80.29 s
gammaloop-nextest-core> ------------
80.29 s
gammaloop-nextest-core> Summary [ 28.415s] 105 tests run: 105 passed , 0 skipped
80.35 s
gammaloop-nextest-core>
80.35 s
gammaloop-nextest-core> ========== nextest test summary ==========
80.35 s
gammaloop-nextest-core> report: target/nextest/ci_gammaloop/junit.xml
80.35 s
gammaloop-nextest-core> tests: 105, failures: 0, errors: 0
80.35 s
gammaloop-nextest-core> No failing testcases found.
80.35 s
gammaloop-nextest-core> =========================================
80.41 s
[0 built (1 failed ), 16 error: Cannot build '/nix/store/v0qh5n7q6ba5h5v37ywwp5q1jfzjvc33-gammaloop-nextest-core.drv '.
80.41 s
Reason: builder failed with exit code 100 .
80.41 s
Output paths:
80.41 s
/nix/store/q4cjrrnkw10yi6ir1lnvg6rhgm20mwwz-gammaloop-nextest-core
80.41 s
Last 229 log lines:
80.41 s
> Extracting 4 binaries (including 1 non-test binary), 1 build script output directory, and 2 linked paths to /build/nextest-archive-uodyo6
80.41 s
> Extracted 20 files to /build/nextest-archive-uodyo6 in 0.94s
80.41 s
> ------------
80.41 s
> Nextest run ID f0b647b0-d9b4-470a-8811-5a2e8b4e611e with nextest profile: ci_gammaloop
80.41 s
> Starting 379 tests across 3 binaries
80.41 s
> ------------
80.41 s
> Summary [ 1.560s] 379 tests run: 379 passed , 0 skipped
80.41 s
>
80.41 s
> ========== nextest test summary ==========
80.41 s
> report: target/nextest/ci_gammaloop/junit.xml
80.41 s
> tests: 379, failures: 0, errors: 0
80.41 s
> No failing testcases found.
80.41 s
> =========================================
80.41 s
> Extracting 1 binary and 1 linked path to /build/nextest-archive-lqBl2E
80.41 s
> Extracted 7 files to /build/nextest-archive-lqBl2E in 0.08s
80.41 s
> ------------
80.41 s
> Nextest run ID f845bdf5-80b8-45b6-8ea9-804f43e8a3e8 with nextest profile: ci_gammaloop
80.41 s
> Starting 19 tests across 1 binary
80.41 s
> ------------
80.41 s
> Summary [ 0.020s] 19 tests run: 19 passed , 0 skipped
80.41 s
>
80.41 s
> ========== nextest test summary ==========
80.41 s
> report: target/nextest/ci_gammaloop/junit.xml
80.41 s
> tests: 19, failures: 0, errors: 0
80.41 s
> No failing testcases found.
80.41 s
> =========================================
80.41 s
> Extracting 1 binary to /build/nextest-archive-eUxQWC
80.41 s
> Extracted 4 files to /build/nextest-archive-eUxQWC in 0.03s
80.41 s
> ------------
80.41 s
> Nextest run ID 2efd6162-a2a2-4d01-9eab-a0d3bffce852 with nextest profile: ci_gammaloop
80.41 s
> Starting 0 tests across 1 binary
80.41 s
> ------------
80.41 s
> Summary [ 0.000s] 0 tests run: 0 passed , 0 skipped
80.41 s
>
80.41 s
> ========== nextest test summary ==========
80.41 s
> report: target/nextest/ci_gammaloop/junit.xml
80.41 s
> tests: 0, failures: 0, errors: 0
80.41 s
> No failing testcases found.
80.41 s
> =========================================
80.41 s
> Extracting 4 binaries, 1 build script output directory, and 2 linked paths to /build/nextest-archive-A0aKGP
80.41 s
> Extracted 18 files to /build/nextest-archive-A0aKGP in 0.60s
80.41 s
> ------------
80.41 s
> Nextest run ID 7bf51568-84d1-43a6-b477-a7ed26b503e7 with nextest profile: ci_gammaloop
80.41 s
> Starting 705 tests across 4 binaries (60 tests skipped , including 59 tests via profile.ci_gammaloop.default-filter )
80.41 s
> FAIL [ 4.058s] (700/705) gammalooprs::test_renormalization finite_part_ghost_2loop
80.41 s
> stdout ---
80.41 s
>
80.41 s
> running 1 test
80.41 s
> test finite_part_ghost_2loop ... FAILED
80.41 s
>
80.41 s
> failures:
80.41 s
>
80.41 s
> failures:
80.41 s
> finite_part_ghost_2loop
80.41 s
>
80.41 s
> test result: FAILED. 0 passed; 1 failed; 0 ignored; 0 measured; 6 filtered out; finished in 4.05s
80.41 s
>
80.41 s
> stderr ---
80.41 s
> The application panicked (crashed).
80.41 s
> Message: assertion failed: (align_to_rqft(&a, &model) - expected).expand().is_zero()
80.41 s
> Location: crates/gammalooprs/tests/test_renormalization.rs :583
80.41 s
>
80.41 s
> ━━━━━━━━━━━━━━━━━━━━━━━━━━━━━━━━━━ BACKTRACE ━━━━━━━━━━━━━━━━━━━━━━━━━━━━━━━━━━━
80.41 s
> 1: <color_eyre[51793ea62743adbd]::config::PanicHook>::panic_report <unknown>
80.41 s
> at <unknown source file> :<unknown line>
80.41 s
> 2: <color_eyre[51793ea62743adbd]::config::PanicHook>::into_panic_hook::{closure#0} <unknown>
80.41 s
> at <unknown source file> :<unknown line>
80.41 s
> 3: std[bcb96dfbba0ab899]::panicking::panic_with_hook <unknown>
80.41 s
> at <unknown source file> :<unknown line>
80.41 s
> 4: std[bcb96dfbba0ab899]::panicking::panic_handler::{closure#0} <unknown>
80.41 s
> at <unknown source file> :<unknown line>
80.41 s
> 5: std[bcb96dfbba0ab899]::sys::backtrace::__rust_end_short_backtrace::<std[bcb96dfbba0ab899]::panicking::panic_handler::{closure#0}, !> <unknown>
80.41 s
> at <unknown source file> :<unknown line>
80.41 s
> 6: __rustc[6c289b9f9c454d21]::rust_begin_unwind <unknown>
80.41 s
> at <unknown source file> :<unknown line>
80.41 s
> 7: core[940e698046960fd5]::panicking::panic_fmt <unknown>
80.41 s
> at <unknown source file> :<unknown line>
80.41 s
> 8: core[940e698046960fd5]::panicking::panic <unknown>
80.41 s
> at <unknown source file> :<unknown line>
80.41 s
> 9: <test_renormalization[5812939ef1a04d89]::finite_part_ghost_2loop::{closure#0} as core[940e698046960fd5]::ops::function::FnOnce<()>>::call_once <unknown>
80.41 s
> at <unknown source file> :<unknown line>
80.41 s
> 10: test[75d6903177b1d7e9]::__rust_begin_short_backtrace::<core[940e698046960fd5]::result::Result<(), alloc[2ea6bcb46fca0c42]::string::String>, fn() -> core[940e698046960fd5]::result::Result<(), alloc[2ea6bcb46fca0c42]::string::String>> <unknown>
80.41 s
> at <unknown source file> :<unknown line>
80.41 s
> 11: test[75d6903177b1d7e9]::run_test::{closure#0} <unknown>
80.41 s
> at <unknown source file> :<unknown line>
80.41 s
> 12: std[bcb96dfbba0ab899]::sys::backtrace::__rust_begin_short_backtrace::<test[75d6903177b1d7e9]::run_test::{closure#1}, ()> <unknown>
80.41 s
> at <unknown source file> :<unknown line>
80.41 s
> 13: <std[bcb96dfbba0ab899]::thread::lifecycle::spawn_unchecked<test[75d6903177b1d7e9]::run_test::{closure#1}, ()>::{closure#1} as core[940e698046960fd5]::ops::function::FnOnce<()>>::call_once::{shim:vtable#0} <unknown>
80.41 s
> at <unknown source file> :<unknown line>
80.41 s
> 14: <std[bcb96dfbba0ab899]::sys::thread::unix::Thread>::new::thread_start <unknown>
80.41 s
> at <unknown source file> :<unknown line>
80.41 s
> 15: start_thread <unknown>
80.41 s
> at <unknown source file> :<unknown line>
80.41 s
> 16: __clone3 <unknown>
80.41 s
> at <unknown source file> :<unknown line>
80.41 s
>
80.41 s
> Run with COLORBT_SHOW_HIDDEN=1 environment variable to disable frame filtering.
80.41 s
> Run with RUST_BACKTRACE=full to include source snippets.
80.41 s
>
80.41 s
> ------------
80.41 s
> Summary [ 14.319s] 705 tests run: 704 passed , 1 failed , 60 skipped
80.41 s
> FAIL [ 4.058s] (700/705) gammalooprs::test_renormalization finite_part_ghost_2loop
80.41 s
> stdout ---
80.41 s
>
80.41 s
> running 1 test
80.41 s
> test finite_part_ghost_2loop ... FAILED
80.41 s
>
80.41 s
> failures:
80.41 s
>
80.41 s
> failures:
80.41 s
> finite_part_ghost_2loop
80.41 s
>
80.41 s
> test result: FAILED. 0 passed; 1 failed; 0 ignored; 0 measured; 6 filtered out; finished in 4.05s
80.41 s
>
80.41 s
> stderr ---
80.41 s
> The application panicked (crashed).
80.41 s
> Message: assertion failed: (align_to_rqft(&a, &model) - expected).expand().is_zero()
80.41 s
> Location: crates/gammalooprs/tests/test_renormalization.rs :583
80.41 s
>
80.41 s
> ━━━━━━━━━━━━━━━━━━━━━━━━━━━━━━━━━━ BACKTRACE ━━━━━━━━━━━━━━━━━━━━━━━━━━━━━━━━━━━
80.41 s
> 1: <color_eyre[51793ea62743adbd]::config::PanicHook>::panic_report <unknown>
80.41 s
> at <unknown source file> :<unknown line>
80.41 s
> 2: <color_eyre[51793ea62743adbd]::config::PanicHook>::into_panic_hook::{closure#0} <unknown>
80.41 s
> at <unknown source file> :<unknown line>
80.41 s
> 3: std[bcb96dfbba0ab899]::panicking::panic_with_hook <unknown>
80.41 s
> at <unknown source file> :<unknown line>
80.41 s
> 4: std[bcb96dfbba0ab899]::panicking::panic_handler::{closure#0} <unknown>
80.41 s
> at <unknown source file> :<unknown line>
80.41 s
> 5: std[bcb96dfbba0ab899]::sys::backtrace::__rust_end_short_backtrace::<std[bcb96dfbba0ab899]::panicking::panic_handler::{closure#0}, !> <unknown>
80.41 s
> at <unknown source file> :<unknown line>
80.41 s
> 6: __rustc[6c289b9f9c454d21]::rust_begin_unwind <unknown>
80.41 s
> at <unknown source file> :<unknown line>
80.41 s
> 7: core[940e698046960fd5]::panicking::panic_fmt <unknown>
80.41 s
> at <unknown source file> :<unknown line>
80.41 s
> 8: core[940e698046960fd5]::panicking::panic <unknown>
80.41 s
> at <unknown source file> :<unknown line>
80.41 s
> 9: <test_renormalization[5812939ef1a04d89]::finite_part_ghost_2loop::{closure#0} as core[940e698046960fd5]::ops::function::FnOnce<()>>::call_once <unknown>
80.41 s
> at <unknown source file> :<unknown line>
80.41 s
> 10: test[75d6903177b1d7e9]::__rust_begin_short_backtrace::<core[940e698046960fd5]::result::Result<(), alloc[2ea6bcb46fca0c42]::string::String>, fn() -> core[940e698046960fd5]::result::Result<(), alloc[2ea6bcb46fca0c42]::string::String>> <unknown>
80.41 s
> at <unknown source file> :<unknown line>
80.41 s
> 11: test[75d6903177b1d7e9]::run_test::{closure#0} <unknown>
80.41 s
> at <unknown source file> :<unknown line>
80.41 s
> 12: std[bcb96dfbba0ab899]::sys::backtrace::__rust_begin_short_backtrace::<test[75d6903177b1d7e9]::run_test::{closure#1}, ()> <unknown>
80.41 s
> at <unknown source file> :<unknown line>
80.41 s
> 13: <std[bcb96dfbba0ab899]::thread::lifecycle::spawn_unchecked<test[75d6903177b1d7e9]::run_test::{closure#1}, ()>::{closure#1} as core[940e698046960fd5]::ops::function::FnOnce<()>>::call_once::{shim:vtable#0} <unknown>
80.41 s
> at <unknown source file> :<unknown line>
80.41 s
> 14: <std[bcb96dfbba0ab899]::sys::thread::unix::Thread>::new::thread_start <unknown>
80.41 s
> at <unknown source file> :<unknown line>
80.41 s
> 15: start_thread <unknown>
80.41 s
> at <unknown source file> :<unknown line>
80.41 s
> 16: __clone3 <unknown>
80.41 s
> at <unknown source file> :<unknown line>
80.41 s
>
80.41 s
> Run with COLORBT_SHOW_HIDDEN=1 environment variable to disable frame filtering.
80.41 s
> Run with RUST_BACKTRACE=full to include source snippets.
80.41 s
>
80.41 s
> error : test run failed
80.41 s
>
80.41 s
> ========== nextest test summary ==========
80.41 s
> report: target/nextest/ci_gammaloop/junit.xml
80.41 s
> tests: 705, failures: 1, errors: 0
80.41 s
>
80.41 s
> 1. gammalooprs::test_renormalization::finite_part_ghost_2loop
80.41 s
> failure: test failure with exit code 101
80.41 s
> system-out
80.41 s
> running 1 test
80.41 s
> test finite_part_ghost_2loop ... FAILED
80.41 s
>
80.41 s
> failures:
80.41 s
>
80.41 s
> failures:
80.41 s
> finite_part_ghost_2loop
80.41 s
>
80.41 s
> test result: FAILED. 0 passed; 1 failed; 0 ignored; 0 measured; 6 filtered out; finished in 4.05s
80.41 s
> system-err
80.41 s
> The application panicked (crashed).
80.41 s
> Message: assertion failed: (align_to_rqft(&a, &model) - expected).expand().is_zero()
80.41 s
> Location: crates/gammalooprs/tests/test_renormalization.rs:583
80.41 s
>
80.41 s
> ━━━━━━━━━━━━━━━━━━━━━━━━━━━━━━━━━━ BACKTRACE ━━━━━━━━━━━━━━━━━━━━━━━━━━━━━━━━━━━
80.41 s
> 1: <color_eyre[51793ea62743adbd]::config::PanicHook>::panic_report<unknown>
80.41 s
> at <unknown source file>:<unknown line>
80.41 s
> 2: <color_eyre[51793ea62743adbd]::config::PanicHook>::into_panic_hook::{closure#0}<unknown>
80.41 s
> at <unknown source file>:<unknown line>
80.41 s
> 3: std[bcb96dfbba0ab899]::panicking::panic_with_hook<unknown>
80.41 s
> at <unknown source file>:<unknown line>
80.41 s
> 4: std[bcb96dfbba0ab899]::panicking::panic_handler::{closure#0}<unknown>
80.41 s
> at <unknown source file>:<unknown line>
80.41 s
> 5: std[bcb96dfbba0ab899]::sys::backtrace::__rust_end_short_backtrace::<std[bcb96dfbba0ab899]::panicking::panic_handler::{closure#0}, !><unknown>
80.41 s
> at <unknown source file>:<unknown line>
80.41 s
> 6: __rustc[6c289b9f9c454d21]::rust_begin_unwind<unknown>
80.41 s
> at <unknown source file>:<unknown line>
80.41 s
> 7: core[940e698046960fd5]::panicking::panic_fmt<unknown>
80.41 s
> at <unknown source file>:<unknown line>
80.41 s
> 8: core[940e698046960fd5]::panicking::panic<unknown>
80.41 s
> at <unknown source file>:<unknown line>
80.41 s
> 9: <test_renormalization[5812939ef1a04d89]::finite_part_ghost_2loop::{closure#0} as core[940e698046960fd5]::ops::function::FnOnce<()>>::call_once<unknown>
80.41 s
> at <unknown source file>:<unknown line>
80.41 s
> 10: test[75d6903177b1d7e9]::__rust_begin_short_backtrace::<core[940e698046960fd5]::result::Result<(), alloc[2ea6bcb46fca0c42]::string::String>, fn() -> core[940e698046960fd5]::result::Result<(), alloc[2ea6bcb46fca0c42]::string::String>><unknown>
80.41 s
> at <unknown source file>:<unknown line>
80.41 s
> 11: test[75d6903177b1d7e9]::run_test::{closure#0}<unknown>
80.41 s
> at <unknown source file>:<unknown line>
80.41 s
> 12: std[bcb96dfbba0ab899]::sys::backtrace::__rust_begin_short_backtrace::<test[75d6903177b1d7e9]::run_test::{closure#1}, ()><unknown>
80.41 s
> at <unknown source file>:<unknown line>
80.41 s
> 13: <std[bcb96dfbba0ab899]::thread::lifecycle::spawn_unchecked<test[75d6903177b1d7e9]::run_test::{closure#1}, ()>::{closure#1} as core[940e698046960fd5]::ops::function::FnOnce<()>>::call_once::{shim:vtable#0}<unknown>
80.41 s
> at <unknown source file>:<unknown line>
80.41 s
> 14: <std[bcb96dfbba0ab899]::sys::thread::unix::Thread>::new::thread_start<unknown>
80.41 s
> at <unknown source file>:<unknown line>
80.41 s
> 15: start_thread<unknown>
80.41 s
> at <unknown source file>:<unknown line>
80.41 s
> 16: __clone3<unknown>
80.41 s
> at <unknown source file>:<unknown line>
80.41 s
>
80.41 s
> Run with COLORBT_SHOW_HIDDEN=1 environment variable to disable frame filtering.
80.41 s
> Run with RUST_BACKTRACE=full to include source snippets.
80.41 s
> =========================================
80.41 s
> Extracting 1 binary, 1 build script output directory, and 1 linked path to /build/nextest-archive-gBmex8
80.41 s
> Extracted 7 files to /build/nextest-archive-gBmex8 in 0.12s
80.41 s
> ------------
80.41 s
> Nextest run ID 94285d7d-ef56-453f-b4f1-5e634d2e94ae with nextest profile: ci_gammaloop
80.41 s
> Starting 105 tests across 1 binary
80.41 s
> ------------
80.41 s
> Summary [ 28.415s] 105 tests run: 105 passed , 0 skipped
80.41 s
>
80.41 s
> ========== nextest test summary ==========
80.41 s
> report: target/nextest/ci_gammaloop/junit.xml
80.41 s
> tests: 105, failures: 0, errors: 0
80.41 s
> No failing testcases found.
80.41 s
> =========================================
80.41 s
For full logs, run:
80.41 s
nix log /nix/store/v0qh5n7q6ba5h5v37ywwp5q1jfzjvc33-gammaloop-nextest-core.drv
80.59 s
Run failed.