1. 0.01 s $ /nix/store/9ypz3flqsrl5xl495mm8h645gadjsxi1-coreutils-9.11/bin/timeout --kill-after=15s 7200s /nix/store/23zk8sgzamrbmj1fday15szf7f2279s8-nix-2.34.7/bin/nix --extra-experimental-features nix-command --extra-experimental-features flakes flake clone git+https://github.com/alphal00p/gammaloop --dest /tmp/nix-ci-worker/stable-pwd/repo/
  2. 0.15 s Cloning into '/tmp/nix-ci-worker/stable-pwd/repo'...
  3. 0.99 s remote: Enumerating objects: 85887, done.
  4. 1.11 s remote: Counting objects: 0% (1/8980) remote: Counting objects: 1% (90/8980) remote: Counting objects: 2% (180/8980) remote: Counting objects: 3% (270/8980) remote: Counting objects: 4% (360/8980) remote: Counting objects: 5% (449/8980) remote: Counting objects: 6% (539/8980) remote: Counting objects: 7% (629/8980) remote: Counting objects: 8% (719/8980) remote: Counting objects: 9% (809/8980) remote: Counting objects: 10% (898/8980) remote: Counting objects: 11% (988/8980) remote: Counting objects: 12% (1078/8980) remote: Counting objects: 13% (1168/8980) remote: Counting objects: 14% (1258/8980) remote: Counting objects: 15% (1347/8980) remote: Counting objects: 16% (1437/8980) remote: Counting objects: 17% (1527/8980) remote: Counting objects: 18% (1617/8980) remote: Counting objects: 19% (1707/8980) remote: Counting objects: 20% (1796/8980) remote: Counting objects: 21% (1886/8980) remote: Counting objects: 22% (1976/8980) remote: Counting objects: 23% (2066/8980) remote: Counting objects: 24% (2156/8980) remote: Counting objects: 25% (2245/8980) remote: Counting objects: 26% (2335/8980) remote: Counting objects: 27% (2425/8980) remote: Counting objects: 28% (2515/8980) remote: Counting objects: 29% (2605/8980) remote: Counting objects: 30% (2694/8980) remote: Counting objects: 31% (2784/8980) remote: Counting objects: 32% (2874/8980) remote: Counting objects: 33% (2964/8980) remote: Counting objects: 34% (3054/8980) remote: Counting objects: 35% (3143/8980) remote: Counting objects: 36% (3233/8980) remote: Counting objects: 37% (3323/8980) remote: Counting objects: 38% (3413/8980) remote: Counting objects: 39% (3503/8980) remote: Counting objects: 40% (3592/8980) remote: Counting objects: 41% (3682/8980) remote: Counting objects: 42% (3772/8980) remote: Counting objects: 43% (3862/8980) remote: Counting objects: 44% (3952/8980) remote: Counting objects: 45% (4041/8980) remote: Counting objects: 46% (4131/8980) remote: Counting objects: 47% (4221/8980) remote: Counting objects: 48% (4311/8980) remote: Counting objects: 49% (4401/8980) remote: Counting objects: 50% (4490/8980) remote: Counting objects: 51% (4580/8980) remote: Counting objects: 52% (4670/8980) remote: Counting objects: 53% (4760/8980) remote: Counting objects: 54% (4850/8980) remote: Counting objects: 55% (4939/8980) remote: Counting objects: 56% (5029/8980) remote: Counting objects: 57% (5119/8980) remote: Counting objects: 58% (5209/8980) remote: Counting objects: 59% (5299/8980) remote: Counting objects: 60% (5388/8980) remote: Counting objects: 61% (5478/8980) remote: Counting objects: 62% (5568/8980) remote: Counting objects: 63% (5658/8980) remote: Counting objects: 64% (5748/8980) remote: Counting objects: 65% (5837/8980) remote: Counting objects: 66% (5927/8980) remote: Counting objects: 67% (6017/8980) remote: Counting objects: 68% (6107/8980) remote: Counting objects: 69% (6197/8980) remote: Counting objects: 70% (6286/8980) remote: Counting objects: 71% (6376/8980) remote: Counting objects: 72% (6466/8980) remote: Counting objects: 73% (6556/8980) remote: Counting objects: 74% (6646/8980) remote: Counting objects: 75% (6735/8980) remote: Counting objects: 76% (6825/8980) remote: Counting objects: 77% (6915/8980) remote: Counting objects: 78% (7005/8980) remote: Counting objects: 79% (7095/8980) remote: Counting objects: 80% (7184/8980) remote: Counting objects: 81% (7274/8980) remote: Counting objects: 82% (7364/8980) remote: Counting objects: 83% (7454/8980) remote: Counting objects: 84% (7544/8980) remote: Counting objects: 85% (7633/8980) remote: Counting objects: 86% (7723/8980) remote: Counting objects: 87% (7813/8980) remote: Counting objects: 88% (7903/8980) remote: Counting objects: 89% (7993/8980) remote: Counting objects: 90% (8082/8980) remote: Counting objects: 91% (8172/8980) remote: Counting objects: 92% (8262/8980) remote: Counting objects: 93% (8352/8980) remote: Counting objects: 94% (8442/8980) remote: Counting objects: 95% (8531/8980) remote: Counting objects: 96% (8621/8980) remote: Counting objects: 97% (8711/8980) remote: Counting objects: 98% (8801/8980) remote: Counting objects: 99% (8891/8980) remote: Counting objects: 100% (8980/8980) remote: Counting objects: 100% (8980/8980), done.
  5. 3.04 s remote: Compressing objects: 0% (1/1989) remote: Compressing objects: 1% (20/1989) remote: Compressing objects: 2% (40/1989) remote: Compressing objects: 3% (60/1989) remote: Compressing objects: 4% (80/1989) remote: Compressing objects: 5% (100/1989) remote: Compressing objects: 6% (120/1989) remote: Compressing objects: 7% (140/1989) remote: Compressing objects: 8% (160/1989) remote: Compressing objects: 9% (180/1989) remote: Compressing objects: 10% (199/1989) remote: Compressing objects: 10% (216/1989) remote: Compressing objects: 11% (219/1989) remote: Compressing objects: 12% (239/1989) remote: Compressing objects: 13% (259/1989) remote: Compressing objects: 14% (279/1989) remote: Compressing objects: 15% (299/1989) remote: Compressing objects: 16% (319/1989) remote: Compressing objects: 17% (339/1989) remote: Compressing objects: 18% (359/1989) remote: Compressing objects: 19% (378/1989) remote: Compressing objects: 20% (398/1989) remote: Compressing objects: 21% (418/1989) remote: Compressing objects: 22% (438/1989) remote: Compressing objects: 23% (458/1989) remote: Compressing objects: 24% (478/1989) remote: Compressing objects: 25% (498/1989) remote: Compressing objects: 26% (518/1989) remote: Compressing objects: 27% (538/1989) remote: Compressing objects: 28% (557/1989) remote: Compressing objects: 29% (577/1989) remote: Compressing objects: 30% (597/1989) remote: Compressing objects: 31% (617/1989) remote: Compressing objects: 32% (637/1989) remote: Compressing objects: 33% (657/1989) remote: Compressing objects: 34% (677/1989) remote: Compressing objects: 35% (697/1989) remote: Compressing objects: 36% (717/1989) remote: Compressing objects: 37% (736/1989) remote: Compressing objects: 38% (756/1989) remote: Compressing objects: 39% (776/1989) remote: Compressing objects: 40% (796/1989) remote: Compressing objects: 41% (816/1989) remote: Compressing objects: 42% (836/1989) remote: Compressing objects: 43% (856/1989) remote: Compressing objects: 44% (876/1989) remote: Compressing objects: 45% (896/1989) remote: Compressing objects: 46% (915/1989) remote: Compressing objects: 47% (935/1989) remote: Compressing objects: 48% (955/1989) remote: Compressing objects: 48% (961/1989) remote: Compressing objects: 49% (975/1989) remote: Compressing objects: 50% (995/1989) remote: Compressing objects: 51% (1015/1989) remote: Compressing objects: 52% (1035/1989) remote: Compressing objects: 53% (1055/1989) remote: Compressing objects: 54% (1075/1989) remote: Compressing objects: 55% (1094/1989) remote: Compressing objects: 56% (1114/1989) remote: Compressing objects: 57% (1134/1989) remote: Compressing objects: 58% (1154/1989) remote: Compressing objects: 59% (1174/1989) remote: Compressing objects: 60% (1194/1989) remote: Compressing objects: 61% (1214/1989) remote: Compressing objects: 62% (1234/1989) remote: Compressing objects: 63% (1254/1989) remote: Compressing objects: 64% (1273/1989) remote: Compressing objects: 65% (1293/1989) remote: Compressing objects: 66% (1313/1989) remote: Compressing objects: 67% (1333/1989) remote: Compressing objects: 68% (1353/1989) remote: Compressing objects: 69% (1373/1989) remote: Compressing objects: 70% (1393/1989) remote: Compressing objects: 71% (1413/1989) remote: Compressing objects: 72% (1433/1989) remote: Compressing objects: 73% (1452/1989) remote: Compressing objects: 74% (1472/1989) remote: Compressing objects: 75% (1492/1989) remote: Compressing objects: 76% (1512/1989) remote: Compressing objects: 77% (1532/1989) remote: Compressing objects: 78% (1552/1989) remote: Compressing objects: 79% (1572/1989) remote: Compressing objects: 80% (1592/1989) remote: Compressing objects: 81% (1612/1989) remote: Compressing objects: 82% (1631/1989) remote: Compressing objects: 83% (1651/1989) remote: Compressing objects: 84% (1671/1989) remote: Compressing objects: 85% (1691/1989) remote: Compressing objects: 86% (1711/1989) remote: Compressing objects: 87% (1731/1989) remote: Compressing objects: 88% (1751/1989) remote: Compressing objects: 89% (1771/1989) remote: Compressing objects: 90% (1791/1989) remote: Compressing objects: 91% (1810/1989) remote: Compressing objects: 92% (1830/1989) remote: Compressing objects: 93% (1850/1989) remote: Compressing objects: 94% (1870/1989) remote: Compressing objects: 95% (1890/1989) remote: Compressing objects: 96% (1910/1989) remote: Compressing objects: 97% (1930/1989) remote: Compressing objects: 98% (1950/1989) remote: Compressing objects: 99% (1970/1989) remote: Compressing objects: 100% (1989/1989) remote: Compressing objects: 100% (1989/1989), done.
  6. 8.58 s Receiving objects: 0% (1/85887) Receiving objects: 1% (859/85887) Receiving objects: 2% (1718/85887) Receiving objects: 3% (2577/85887) Receiving objects: 4% (3436/85887) Receiving objects: 5% (4295/85887) Receiving objects: 6% (5154/85887), 9.02 MiB | 18.01 MiB/s Receiving objects: 7% (6013/85887), 9.02 MiB | 18.01 MiB/s Receiving objects: 8% (6871/85887), 9.02 MiB | 18.01 MiB/s Receiving objects: 9% (7730/85887), 9.02 MiB | 18.01 MiB/s Receiving objects: 10% (8589/85887), 9.02 MiB | 18.01 MiB/s Receiving objects: 11% (9448/85887), 9.02 MiB | 18.01 MiB/s Receiving objects: 12% (10307/85887), 9.02 MiB | 18.01 MiB/s Receiving objects: 13% (11166/85887), 9.02 MiB | 18.01 MiB/s Receiving objects: 14% (12025/85887), 9.02 MiB | 18.01 MiB/s Receiving objects: 15% (12884/85887), 9.02 MiB | 18.01 MiB/s Receiving objects: 16% (13742/85887), 9.02 MiB | 18.01 MiB/s Receiving objects: 17% (14601/85887), 9.02 MiB | 18.01 MiB/s Receiving objects: 18% (15460/85887), 9.02 MiB | 18.01 MiB/s Receiving objects: 19% (16319/85887), 9.02 MiB | 18.01 MiB/s Receiving objects: 20% (17178/85887), 9.02 MiB | 18.01 MiB/s Receiving objects: 21% (18037/85887), 9.02 MiB | 18.01 MiB/s Receiving objects: 22% (18896/85887), 9.02 MiB | 18.01 MiB/s Receiving objects: 23% (19755/85887), 9.02 MiB | 18.01 MiB/s Receiving objects: 24% (20613/85887), 9.02 MiB | 18.01 MiB/s Receiving objects: 25% (21472/85887), 9.02 MiB | 18.01 MiB/s Receiving objects: 26% (22331/85887), 9.02 MiB | 18.01 MiB/s Receiving objects: 26% (22497/85887), 9.02 MiB | 18.01 MiB/s Receiving objects: 27% (23190/85887), 23.04 MiB | 23.03 MiB/s Receiving objects: 28% (24049/85887), 23.04 MiB | 23.03 MiB/s Receiving objects: 29% (24908/85887), 23.04 MiB | 23.03 MiB/s Receiving objects: 30% (25767/85887), 23.04 MiB | 23.03 MiB/s Receiving objects: 31% (26625/85887), 23.04 MiB | 23.03 MiB/s Receiving objects: 32% (27484/85887), 23.04 MiB | 23.03 MiB/s Receiving objects: 33% (28343/85887), 23.04 MiB | 23.03 MiB/s Receiving objects: 34% (29202/85887), 23.04 MiB | 23.03 MiB/s Receiving objects: 35% (30061/85887), 23.04 MiB | 23.03 MiB/s Receiving objects: 36% (30920/85887), 23.04 MiB | 23.03 MiB/s Receiving objects: 37% (31779/85887), 23.04 MiB | 23.03 MiB/s Receiving objects: 38% (32638/85887), 23.04 MiB | 23.03 MiB/s Receiving objects: 39% (33496/85887), 23.04 MiB | 23.03 MiB/s Receiving objects: 40% (34355/85887), 23.04 MiB | 23.03 MiB/s Receiving objects: 41% (35214/85887), 23.04 MiB | 23.03 MiB/s Receiving objects: 42% (36073/85887), 23.04 MiB | 23.03 MiB/s Receiving objects: 43% (36932/85887), 23.04 MiB | 23.03 MiB/s Receiving objects: 44% (37791/85887), 40.15 MiB | 26.75 MiB/s Receiving objects: 45% (38650/85887), 40.15 MiB | 26.75 MiB/s Receiving objects: 46% (39509/85887), 40.15 MiB | 26.75 MiB/s Receiving objects: 47% (40367/85887), 40.15 MiB | 26.75 MiB/s Receiving objects: 48% (41226/85887), 40.15 MiB | 26.75 MiB/s Receiving objects: 49% (42085/85887), 40.15 MiB | 26.75 MiB/s Receiving objects: 50% (42944/85887), 40.15 MiB | 26.75 MiB/s Receiving objects: 51% (43803/85887), 40.15 MiB | 26.75 MiB/s Receiving objects: 51% (44392/85887), 40.15 MiB | 26.75 MiB/s Receiving objects: 52% (44662/85887), 53.41 MiB | 26.69 MiB/s Receiving objects: 53% (45521/85887), 53.41 MiB | 26.69 MiB/s Receiving objects: 54% (46379/85887), 53.41 MiB | 26.69 MiB/s Receiving objects: 55% (47238/85887), 53.41 MiB | 26.69 MiB/s Receiving objects: 56% (48097/85887), 53.41 MiB | 26.69 MiB/s Receiving objects: 57% (48956/85887), 53.41 MiB | 26.69 MiB/s Receiving objects: 58% (49815/85887), 67.40 MiB | 26.95 MiB/s Receiving objects: 59% (50674/85887), 67.40 MiB | 26.95 MiB/s Receiving objects: 60% (51533/85887), 67.40 MiB | 26.95 MiB/s Receiving objects: 61% (52392/85887), 67.40 MiB | 26.95 MiB/s Receiving objects: 62% (53250/85887), 67.40 MiB | 26.95 MiB/s Receiving objects: 63% (54109/85887), 67.40 MiB | 26.95 MiB/s Receiving objects: 64% (54968/85887), 67.40 MiB | 26.95 MiB/s Receiving objects: 65% (55827/85887), 67.40 MiB | 26.95 MiB/s Receiving objects: 65% (56351/85887), 67.40 MiB | 26.95 MiB/s Receiving objects: 66% (56686/85887), 81.45 MiB | 27.13 MiB/s Receiving objects: 67% (57545/85887), 95.96 MiB | 27.40 MiB/s Receiving objects: 68% (58404/85887), 95.96 MiB | 27.40 MiB/s Receiving objects: 69% (59263/85887), 95.96 MiB | 27.40 MiB/s Receiving objects: 70% (60121/85887), 95.96 MiB | 27.40 MiB/s Receiving objects: 70% (60577/85887), 95.96 MiB | 27.40 MiB/s Receiving objects: 71% (60980/85887), 110.55 MiB | 27.62 MiB/s Receiving objects: 72% (61839/85887), 110.55 MiB | 27.62 MiB/s Receiving objects: 73% (62698/85887), 110.55 MiB | 27.62 MiB/s Receiving objects: 74% (63557/85887), 110.55 MiB | 27.62 MiB/s Receiving objects: 75% (64416/85887), 125.35 MiB | 27.83 MiB/s Receiving objects: 76% (65275/85887), 125.35 MiB | 27.83 MiB/s Receiving objects: 77% (66133/85887), 125.35 MiB | 27.83 MiB/s Receiving objects: 78% (66992/85887), 125.35 MiB | 27.83 MiB/s Receiving objects: 79% (67851/85887), 125.35 MiB | 27.83 MiB/s Receiving objects: 80% (68710/85887), 125.35 MiB | 27.83 MiB/s Receiving objects: 81% (69569/85887), 125.35 MiB | 27.83 MiB/s Receiving objects: 82% (70428/85887), 125.35 MiB | 27.83 MiB/s Receiving objects: 83% (71287/85887), 125.35 MiB | 27.83 MiB/s Receiving objects: 84% (72146/85887), 125.35 MiB | 27.83 MiB/s Receiving objects: 85% (73004/85887), 125.35 MiB | 27.83 MiB/s Receiving objects: 86% (73863/85887), 125.35 MiB | 27.83 MiB/s Receiving objects: 86% (74036/85887), 125.35 MiB | 27.83 MiB/s Receiving objects: 87% (74722/85887), 140.41 MiB | 29.18 MiB/s Receiving objects: 88% (75581/85887), 140.41 MiB | 29.18 MiB/s Receiving objects: 89% (76440/85887), 140.41 MiB | 29.18 MiB/s Receiving objects: 90% (77299/85887), 140.41 MiB | 29.18 MiB/s Receiving objects: 91% (78158/85887), 140.41 MiB | 29.18 MiB/s Receiving objects: 92% (79017/85887), 140.41 MiB | 29.18 MiB/s Receiving objects: 93% (79875/85887), 140.41 MiB | 29.18 MiB/s Receiving objects: 94% (80734/85887), 140.41 MiB | 29.18 MiB/s Receiving objects: 95% (81593/85887), 140.41 MiB | 29.18 MiB/s Receiving objects: 96% (82452/85887), 140.41 MiB | 29.18 MiB/s Receiving objects: 97% (83311/85887), 140.41 MiB | 29.18 MiB/s Receiving objects: 98% (84170/85887), 140.41 MiB | 29.18 MiB/s Receiving objects: 99% (85029/85887), 140.41 MiB | 29.18 MiB/s remote: Total 85887 (delta 7809), reused 7097 (delta 6991), pack-reused 76907 (from 3)
  7. 8.59 s Receiving objects: 100% (85887/85887), 155.39 MiB | 29.39 MiB/s Receiving objects: 100% (85887/85887), 155.80 MiB | 28.22 MiB/s, done.
  8. 10.32 s Resolving deltas: 0% (0/58257) Resolving deltas: 1% (583/58257) Resolving deltas: 2% (1166/58257) Resolving deltas: 3% (1748/58257) Resolving deltas: 4% (2331/58257) Resolving deltas: 5% (2913/58257) Resolving deltas: 6% (3496/58257) Resolving deltas: 7% (4078/58257) Resolving deltas: 8% (4661/58257) Resolving deltas: 9% (5244/58257) Resolving deltas: 10% (5826/58257) Resolving deltas: 11% (6409/58257) Resolving deltas: 12% (6992/58257) Resolving deltas: 13% (7574/58257) Resolving deltas: 14% (8156/58257) Resolving deltas: 15% (8739/58257) Resolving deltas: 16% (9322/58257) Resolving deltas: 17% (9904/58257) Resolving deltas: 18% (10487/58257) Resolving deltas: 19% (11069/58257) Resolving deltas: 20% (11653/58257) Resolving deltas: 21% (12236/58257) Resolving deltas: 22% (12817/58257) Resolving deltas: 23% (13400/58257) Resolving deltas: 24% (13982/58257) Resolving deltas: 25% (14565/58257) Resolving deltas: 26% (15148/58257) Resolving deltas: 27% (15730/58257) Resolving deltas: 28% (16312/58257) Resolving deltas: 29% (16895/58257) Resolving deltas: 30% (17478/58257) Resolving deltas: 31% (18060/58257) Resolving deltas: 32% (18643/58257) Resolving deltas: 33% (19225/58257) Resolving deltas: 34% (19808/58257) Resolving deltas: 35% (20390/58257) Resolving deltas: 36% (20974/58257) Resolving deltas: 37% (21558/58257) Resolving deltas: 38% (22140/58257) Resolving deltas: 39% (22721/58257) Resolving deltas: 40% (23303/58257) Resolving deltas: 41% (23886/58257) Resolving deltas: 42% (24468/58257) Resolving deltas: 43% (25052/58257) Resolving deltas: 44% (25634/58257) Resolving deltas: 45% (26216/58257) Resolving deltas: 46% (26799/58257) Resolving deltas: 47% (27383/58257) Resolving deltas: 48% (27965/58257) Resolving deltas: 49% (28546/58257) Resolving deltas: 50% (29129/58257) Resolving deltas: 51% (29712/58257) Resolving deltas: 52% (30294/58257) Resolving deltas: 53% (30877/58257) Resolving deltas: 54% (31459/58257) Resolving deltas: 55% (32042/58257) Resolving deltas: 56% (32624/58257) Resolving deltas: 57% (33207/58257) Resolving deltas: 58% (33790/58257) Resolving deltas: 59% (34373/58257) Resolving deltas: 60% (34955/58257) Resolving deltas: 60% (35421/58257) Resolving deltas: 61% (35537/58257) Resolving deltas: 62% (36120/58257) Resolving deltas: 63% (36702/58257) Resolving deltas: 64% (37285/58257) Resolving deltas: 65% (37868/58257) Resolving deltas: 66% (38450/58257) Resolving deltas: 67% (39033/58257) Resolving deltas: 68% (39615/58257) Resolving deltas: 69% (40198/58257) Resolving deltas: 70% (40781/58257) Resolving deltas: 71% (41366/58257) Resolving deltas: 72% (41946/58257) Resolving deltas: 73% (42528/58257) Resolving deltas: 74% (43111/58257) Resolving deltas: 75% (43693/58257) Resolving deltas: 76% (44276/58257) Resolving deltas: 77% (44858/58257) Resolving deltas: 78% (45443/58257) Resolving deltas: 79% (46024/58257) Resolving deltas: 80% (46606/58257) Resolving deltas: 81% (47189/58257) Resolving deltas: 82% (47771/58257) Resolving deltas: 83% (48354/58257) Resolving deltas: 84% (48936/58257) Resolving deltas: 85% (49519/58257) Resolving deltas: 86% (50103/58257) Resolving deltas: 87% (50684/58257) Resolving deltas: 88% (51267/58257) Resolving deltas: 89% (51849/58257) Resolving deltas: 90% (52432/58257) Resolving deltas: 91% (53015/58257) Resolving deltas: 92% (53597/58257) Resolving deltas: 93% (54180/58257) Resolving deltas: 94% (54762/58257) Resolving deltas: 95% (55345/58257) Resolving deltas: 96% (55928/58257) Resolving deltas: 97% (56510/58257) Resolving deltas: 98% (57092/58257) Resolving deltas: 99% (57675/58257) Resolving deltas: 100% (58257/58257) Resolving deltas: 100% (58257/58257), done.
  9. 10.79 s Fetching commit 1aaff9f8fbdea00653c1c35b8c9535b04e3fc668 for faster_uv_from_4d ...
  10. 10.79 s $ /nix/store/bcnisk3ydfgv26v2gw3zlky24g00yww2-git-2.54.0/bin/git fetch origin 1aaff9f8fbdea00653c1c35b8c9535b04e3fc668
  11. 11.32 s From https://github.com/alphal00p/gammaloop
  12. 11.32 s * branch 1aaff9f8fbdea00653c1c35b8c9535b04e3fc668 -> FETCH_HEAD
  13. 11.33 s $ /nix/store/9ypz3flqsrl5xl495mm8h645gadjsxi1-coreutils-9.11/bin/timeout --kill-after=15s 7200s /nix/store/bcnisk3ydfgv26v2gw3zlky24g00yww2-git-2.54.0/bin/git -c advice.detachedHead=false checkout 1aaff9f8fbdea00653c1c35b8c9535b04e3fc668
  14. 11.80 s HEAD is now at 1aaff9f8f record complete gl262 tensor preprocessing
  15. 11.81 s $ /nix/store/9ypz3flqsrl5xl495mm8h645gadjsxi1-coreutils-9.11/bin/timeout --kill-after=15s 7200s /nix/store/23zk8sgzamrbmj1fday15szf7f2279s8-nix-2.34.7/bin/nix --extra-experimental-features nix-command --extra-experimental-features flakes --log-format internal-json run .#packages.x86_64-linux.nix-ci-check-gammaloop-nextest-core --print-build-logs
  16. 19.06 s
  17. 26.83 s evaluating derivation 'g copying '/nix/store/2xyx evaluating derivation 'g copying '/nix/store/2xyx evaluating derivation 'g copying '/nix/store/2xyx evaluating derivation 'g copying '/nix/store/2xyx evaluating derivation 'g copying '/nix/store/2xyx evaluating derivation 'g copying '/nix/store/2xyx evaluating derivation 'g copying '/nix/store/2xyx evaluating derivation 'g copying '/nix/store/2xyx evaluating derivation 'g copying '/nix/store/2xyx evaluating derivation 'g copying '/nix/store/2xyx evaluating derivation 'g [0/1 built] [1/0/1 built] building ggammaloop-nextest-core> Extracting 4 binaries (including 1 non-test binary), 1 build script output directory, and 2 linked paths to /build/nextest-archive-vXyjd8
  18. 28.11 s gammaloop-nextest-core> Extracted 20 files to /build/nextest-archive-vXyjd8 in 1.28s
  19. 28.12 s gammaloop-nextest-core> ------------
  20. 28.13 s gammaloop-nextest-core> Nextest run ID 0a7b4996-4bc0-4ae2-b787-6a5e88002509 with nextest profile: ci_gammaloop
  21. 28.13 s gammaloop-nextest-core> Starting 379 tests across 3 binaries
  22. 29.89 s gammaloop-nextest-core> ------------
  23. 29.89 s gammaloop-nextest-core> Summary [ 1.767s] 379 tests run: 379 passed, 0 skipped
  24. 30.06 s gammaloop-nextest-core>
  25. 30.06 s gammaloop-nextest-core> ========== nextest test summary ==========
  26. 30.06 s gammaloop-nextest-core> report: target/nextest/ci_gammaloop/junit.xml
  27. 30.06 s gammaloop-nextest-core> tests: 379, failures: 0, errors: 0
  28. 30.06 s gammaloop-nextest-core> No failing testcases found.
  29. 30.06 s gammaloop-nextest-core> =========================================
  30. 30.08 s gammaloop-nextest-core> Extracting 1 binary and 1 linked path to /build/nextest-archive-aChLrK
  31. 30.17 s gammaloop-nextest-core> Extracted 7 files to /build/nextest-archive-aChLrK in 0.10s
  32. 30.19 s gammaloop-nextest-core> ------------
  33. 30.19 s gammaloop-nextest-core> Nextest run ID 086ad534-4ff0-4ee1-931b-a5e92124fd1c with nextest profile: ci_gammaloop
  34. 30.19 s gammaloop-nextest-core> Starting 19 tests across 1 binary
  35. 30.20 s gammaloop-nextest-core> ------------
  36. 30.20 s gammaloop-nextest-core> Summary [ 0.015s] 19 tests run: 19 passed, 0 skipped
  37. 30.25 s gammaloop-nextest-core>
  38. 30.25 s gammaloop-nextest-core> ========== nextest test summary ==========
  39. 30.25 s gammaloop-nextest-core> report: target/nextest/ci_gammaloop/junit.xml
  40. 30.25 s gammaloop-nextest-core> tests: 19, failures: 0, errors: 0
  41. 30.25 s gammaloop-nextest-core> No failing testcases found.
  42. 30.25 s gammaloop-nextest-core> =========================================
  43. 30.27 s gammaloop-nextest-core> Extracting 1 binary to /build/nextest-archive-UZGGn6
  44. 30.31 s gammaloop-nextest-core> Extracted 4 files to /build/nextest-archive-UZGGn6 in 0.05s
  45. 30.33 s gammaloop-nextest-core> ------------
  46. 30.33 s gammaloop-nextest-core> Nextest run ID dd641cca-38c5-4057-b4cc-97bba0be11b4 with nextest profile: ci_gammaloop
  47. 30.33 s gammaloop-nextest-core> Starting 0 tests across 1 binary
  48. 30.33 s gammaloop-nextest-core> ------------
  49. 30.33 s gammaloop-nextest-core> Summary [ 0.000s] 0 tests run: 0 passed, 0 skipped
  50. 30.37 s gammaloop-nextest-core>
  51. 30.37 s gammaloop-nextest-core> ========== nextest test summary ==========
  52. 30.37 s gammaloop-nextest-core> report: target/nextest/ci_gammaloop/junit.xml
  53. 30.37 s gammaloop-nextest-core> tests: 0, failures: 0, errors: 0
  54. 30.37 s gammaloop-nextest-core> No failing testcases found.
  55. 30.37 s gammaloop-nextest-core> =========================================
  56. 30.39 s gammaloop-nextest-core> Extracting 4 binaries, 1 build script output directory, and 2 linked paths to /build/nextest-archive-Qs0wlp
  57. 31.09 s gammaloop-nextest-core> Extracted 18 files to /build/nextest-archive-Qs0wlp in 0.70s
  58. 31.11 s gammaloop-nextest-core> ------------
  59. 31.11 s gammaloop-nextest-core> Nextest run ID 310b5ed2-478c-4704-b601-06a61f883660 with nextest profile: ci_gammaloop
  60. 31.11 s gammaloop-nextest-core> Starting 705 tests across 4 binaries (60 tests skipped, including 59 tests via profile.ci_gammaloop.default-filter)
  61. 46.74 s gammaloop-nextest-core> FAIL [ 8.793s] (700/705) gammalooprs::test_renormalization finite_part_ghost_2loop
  62. 46.74 s gammaloop-nextest-core> stdout ---
  63. 46.74 s gammaloop-nextest-core>
  64. 46.74 s gammaloop-nextest-core> running 1 test
  65. 46.74 s gammaloop-nextest-core> test finite_part_ghost_2loop ... FAILED
  66. 46.74 s gammaloop-nextest-core>
  67. 46.74 s gammaloop-nextest-core> failures:
  68. 46.74 s gammaloop-nextest-core>
  69. 46.74 s gammaloop-nextest-core> failures:
  70. 46.74 s gammaloop-nextest-core> finite_part_ghost_2loop
  71. 46.74 s gammaloop-nextest-core>
  72. 46.74 s gammaloop-nextest-core> test result: FAILED. 0 passed; 1 failed; 0 ignored; 0 measured; 6 filtered out; finished in 8.60s
  73. 46.74 s gammaloop-nextest-core>
  74. 46.74 s gammaloop-nextest-core> stderr ---
  75. 46.74 s gammaloop-nextest-core> The application panicked (crashed).
  76. 46.74 s gammaloop-nextest-core> Message: assertion failed: (align_to_rqft(&a, &model) - expected).expand().is_zero()
  77. 46.74 s gammaloop-nextest-core> Location: crates/gammalooprs/tests/test_renormalization.rs:583
  78. 46.74 s gammaloop-nextest-core>
  79. 46.74 s gammaloop-nextest-core> ━━━━━━━━━━━━━━━━━━━━━━━━━━━━━━━━━━ BACKTRACE ━━━━━━━━━━━━━━━━━━━━━━━━━━━━━━━━━━━
  80. 46.74 s gammaloop-nextest-core> 1: <color_eyre[51793ea62743adbd]::config::PanicHook>::panic_report<unknown>
  81. 46.74 s gammaloop-nextest-core> at <unknown source file>:<unknown line>
  82. 46.74 s gammaloop-nextest-core> 2: <color_eyre[51793ea62743adbd]::config::PanicHook>::into_panic_hook::{closure#0}<unknown>
  83. 46.74 s gammaloop-nextest-core> at <unknown source file>:<unknown line>
  84. 46.74 s gammaloop-nextest-core> 3: std[bcb96dfbba0ab899]::panicking::panic_with_hook<unknown>
  85. 46.74 s gammaloop-nextest-core> at <unknown source file>:<unknown line>
  86. 46.74 s gammaloop-nextest-core> 4: std[bcb96dfbba0ab899]::panicking::panic_handler::{closure#0}<unknown>
  87. 46.74 s gammaloop-nextest-core> at <unknown source file>:<unknown line>
  88. 46.74 s gammaloop-nextest-core> 5: std[bcb96dfbba0ab899]::sys::backtrace::__rust_end_short_backtrace::<std[bcb96dfbba0ab899]::panicking::panic_handler::{closure#0}, !><unknown>
  89. 46.74 s gammaloop-nextest-core> at <unknown source file>:<unknown line>
  90. 46.74 s gammaloop-nextest-core> 6: __rustc[6c289b9f9c454d21]::rust_begin_unwind<unknown>
  91. 46.74 s gammaloop-nextest-core> at <unknown source file>:<unknown line>
  92. 46.74 s gammaloop-nextest-core> 7: core[940e698046960fd5]::panicking::panic_fmt<unknown>
  93. 46.74 s gammaloop-nextest-core> at <unknown source file>:<unknown line>
  94. 46.74 s gammaloop-nextest-core> 8: core[940e698046960fd5]::panicking::panic<unknown>
  95. 46.74 s gammaloop-nextest-core> at <unknown source file>:<unknown line>
  96. 46.74 s gammaloop-nextest-core> 9: <test_renormalization[5812939ef1a04d89]::finite_part_ghost_2loop::{closure#0} as core[940e698046960fd5]::ops::function::FnOnce<()>>::call_once<unknown>
  97. 46.74 s gammaloop-nextest-core> at <unknown source file>:<unknown line>
  98. 46.74 s gammaloop-nextest-core> 10: test[75d6903177b1d7e9]::__rust_begin_short_backtrace::<core[940e698046960fd5]::result::Result<(), alloc[2ea6bcb46fca0c42]::string::String>, fn() -> core[940e698046960fd5]::result::Result<(), alloc[2ea6bcb46fca0c42]::string::String>><unknown>
  99. 46.74 s gammaloop-nextest-core> at <unknown source file>:<unknown line>
  100. 46.74 s gammaloop-nextest-core> 11: test[75d6903177b1d7e9]::run_test::{closure#0}<unknown>
  101. 46.74 s gammaloop-nextest-core> at <unknown source file>:<unknown line>
  102. 46.74 s gammaloop-nextest-core> 12: std[bcb96dfbba0ab899]::sys::backtrace::__rust_begin_short_backtrace::<test[75d6903177b1d7e9]::run_test::{closure#1}, ()><unknown>
  103. 46.74 s gammaloop-nextest-core> at <unknown source file>:<unknown line>
  104. 46.74 s gammaloop-nextest-core> 13: <std[bcb96dfbba0ab899]::thread::lifecycle::spawn_unchecked<test[75d6903177b1d7e9]::run_test::{closure#1}, ()>::{closure#1} as core[940e698046960fd5]::ops::function::FnOnce<()>>::call_once::{shim:vtable#0}<unknown>
  105. 46.74 s gammaloop-nextest-core> at <unknown source file>:<unknown line>
  106. 46.74 s gammaloop-nextest-core> 14: <std[bcb96dfbba0ab899]::sys::thread::unix::Thread>::new::thread_start<unknown>
  107. 46.74 s gammaloop-nextest-core> at <unknown source file>:<unknown line>
  108. 46.74 s gammaloop-nextest-core> 15: start_thread<unknown>
  109. 46.74 s gammaloop-nextest-core> at <unknown source file>:<unknown line>
  110. 46.74 s gammaloop-nextest-core> 16: __clone3<unknown>
  111. 46.74 s gammaloop-nextest-core> at <unknown source file>:<unknown line>
  112. 46.74 s gammaloop-nextest-core>
  113. 46.74 s gammaloop-nextest-core> Run with COLORBT_SHOW_HIDDEN=1 environment variable to disable frame filtering.
  114. 46.74 s gammaloop-nextest-core> Run with RUST_BACKTRACE=full to include source snippets.
  115. 46.74 s gammaloop-nextest-core>
  116. 56.99 s gammaloop-nextest-core> ------------
  117. 56.99 s gammaloop-nextest-core> Summary [ 25.883s] 705 tests run: 704 passed, 1 failed, 60 skipped
  118. 56.99 s gammaloop-nextest-core> FAIL [ 8.793s] (700/705) gammalooprs::test_renormalization finite_part_ghost_2loop
  119. 56.99 s gammaloop-nextest-core> stdout ---
  120. 56.99 s gammaloop-nextest-core>
  121. 56.99 s gammaloop-nextest-core> running 1 test
  122. 56.99 s gammaloop-nextest-core> test finite_part_ghost_2loop ... FAILED
  123. 56.99 s gammaloop-nextest-core>
  124. 56.99 s gammaloop-nextest-core> failures:
  125. 56.99 s gammaloop-nextest-core>
  126. 56.99 s gammaloop-nextest-core> failures:
  127. 56.99 s gammaloop-nextest-core> finite_part_ghost_2loop
  128. 56.99 s gammaloop-nextest-core>
  129. 56.99 s gammaloop-nextest-core> test result: FAILED. 0 passed; 1 failed; 0 ignored; 0 measured; 6 filtered out; finished in 8.60s
  130. 56.99 s gammaloop-nextest-core>
  131. 56.99 s gammaloop-nextest-core> stderr ---
  132. 56.99 s gammaloop-nextest-core> The application panicked (crashed).
  133. 56.99 s gammaloop-nextest-core> Message: assertion failed: (align_to_rqft(&a, &model) - expected).expand().is_zero()
  134. 56.99 s gammaloop-nextest-core> Location: crates/gammalooprs/tests/test_renormalization.rs:583
  135. 56.99 s gammaloop-nextest-core>
  136. 56.99 s gammaloop-nextest-core> ━━━━━━━━━━━━━━━━━━━━━━━━━━━━━━━━━━ BACKTRACE ━━━━━━━━━━━━━━━━━━━━━━━━━━━━━━━━━━━
  137. 56.99 s gammaloop-nextest-core> 1: <color_eyre[51793ea62743adbd]::config::PanicHook>::panic_report<unknown>
  138. 56.99 s gammaloop-nextest-core> at <unknown source file>:<unknown line>
  139. 56.99 s gammaloop-nextest-core> 2: <color_eyre[51793ea62743adbd]::config::PanicHook>::into_panic_hook::{closure#0}<unknown>
  140. 56.99 s gammaloop-nextest-core> at <unknown source file>:<unknown line>
  141. 56.99 s gammaloop-nextest-core> 3: std[bcb96dfbba0ab899]::panicking::panic_with_hook<unknown>
  142. 56.99 s gammaloop-nextest-core> at <unknown source file>:<unknown line>
  143. 56.99 s gammaloop-nextest-core> 4: std[bcb96dfbba0ab899]::panicking::panic_handler::{closure#0}<unknown>
  144. 56.99 s gammaloop-nextest-core> at <unknown source file>:<unknown line>
  145. 56.99 s gammaloop-nextest-core> 5: std[bcb96dfbba0ab899]::sys::backtrace::__rust_end_short_backtrace::<std[bcb96dfbba0ab899]::panicking::panic_handler::{closure#0}, !><unknown>
  146. 56.99 s gammaloop-nextest-core> at <unknown source file>:<unknown line>
  147. 56.99 s gammaloop-nextest-core> 6: __rustc[6c289b9f9c454d21]::rust_begin_unwind<unknown>
  148. 56.99 s gammaloop-nextest-core> at <unknown source file>:<unknown line>
  149. 56.99 s gammaloop-nextest-core> 7: core[940e698046960fd5]::panicking::panic_fmt<unknown>
  150. 56.99 s gammaloop-nextest-core> at <unknown source file>:<unknown line>
  151. 56.99 s gammaloop-nextest-core> 8: core[940e698046960fd5]::panicking::panic<unknown>
  152. 56.99 s gammaloop-nextest-core> at <unknown source file>:<unknown line>
  153. 56.99 s gammaloop-nextest-core> 9: <test_renormalization[5812939ef1a04d89]::finite_part_ghost_2loop::{closure#0} as core[940e698046960fd5]::ops::function::FnOnce<()>>::call_once<unknown>
  154. 56.99 s gammaloop-nextest-core> at <unknown source file>:<unknown line>
  155. 56.99 s gammaloop-nextest-core> 10: test[75d6903177b1d7e9]::__rust_begin_short_backtrace::<core[940e698046960fd5]::result::Result<(), alloc[2ea6bcb46fca0c42]::string::String>, fn() -> core[940e698046960fd5]::result::Result<(), alloc[2ea6bcb46fca0c42]::string::String>><unknown>
  156. 56.99 s gammaloop-nextest-core> at <unknown source file>:<unknown line>
  157. 56.99 s gammaloop-nextest-core> 11: test[75d6903177b1d7e9]::run_test::{closure#0}<unknown>
  158. 56.99 s gammaloop-nextest-core> at <unknown source file>:<unknown line>
  159. 56.99 s gammaloop-nextest-core> 12: std[bcb96dfbba0ab899]::sys::backtrace::__rust_begin_short_backtrace::<test[75d6903177b1d7e9]::run_test::{closure#1}, ()><unknown>
  160. 56.99 s gammaloop-nextest-core> at <unknown source file>:<unknown line>
  161. 56.99 s gammaloop-nextest-core> 13: <std[bcb96dfbba0ab899]::thread::lifecycle::spawn_unchecked<test[75d6903177b1d7e9]::run_test::{closure#1}, ()>::{closure#1} as core[940e698046960fd5]::ops::function::FnOnce<()>>::call_once::{shim:vtable#0}<unknown>
  162. 56.99 s gammaloop-nextest-core> at <unknown source file>:<unknown line>
  163. 56.99 s gammaloop-nextest-core> 14: <std[bcb96dfbba0ab899]::sys::thread::unix::Thread>::new::thread_start<unknown>
  164. 56.99 s gammaloop-nextest-core> at <unknown source file>:<unknown line>
  165. 56.99 s gammaloop-nextest-core> 15: start_thread<unknown>
  166. 56.99 s gammaloop-nextest-core> at <unknown source file>:<unknown line>
  167. 56.99 s gammaloop-nextest-core> 16: __clone3<unknown>
  168. 56.99 s gammaloop-nextest-core> at <unknown source file>:<unknown line>
  169. 56.99 s gammaloop-nextest-core>
  170. 56.99 s gammaloop-nextest-core> Run with COLORBT_SHOW_HIDDEN=1 environment variable to disable frame filtering.
  171. 56.99 s gammaloop-nextest-core> Run with RUST_BACKTRACE=full to include source snippets.
  172. 56.99 s gammaloop-nextest-core>
  173. 57.07 s gammaloop-nextest-core> error: test run failed
  174. 57.10 s gammaloop-nextest-core>
  175. 57.10 s gammaloop-nextest-core> ========== nextest test summary ==========
  176. 57.10 s gammaloop-nextest-core> report: target/nextest/ci_gammaloop/junit.xml
  177. 57.10 s gammaloop-nextest-core> tests: 705, failures: 1, errors: 0
  178. 57.10 s gammaloop-nextest-core>
  179. 57.10 s gammaloop-nextest-core> 1. gammalooprs::test_renormalization::finite_part_ghost_2loop
  180. 57.10 s gammaloop-nextest-core> failure: test failure with exit code 101
  181. 57.10 s gammaloop-nextest-core> system-out
  182. 57.10 s gammaloop-nextest-core> running 1 test
  183. 57.10 s gammaloop-nextest-core> test finite_part_ghost_2loop ... FAILED
  184. 57.10 s gammaloop-nextest-core>
  185. 57.10 s gammaloop-nextest-core> failures:
  186. 57.10 s gammaloop-nextest-core>
  187. 57.10 s gammaloop-nextest-core> failures:
  188. 57.10 s gammaloop-nextest-core> finite_part_ghost_2loop
  189. 57.10 s gammaloop-nextest-core>
  190. 57.10 s gammaloop-nextest-core> test result: FAILED. 0 passed; 1 failed; 0 ignored; 0 measured; 6 filtered out; finished in 8.60s
  191. 57.10 s gammaloop-nextest-core> system-err
  192. 57.10 s gammaloop-nextest-core> The application panicked (crashed).
  193. 57.10 s gammaloop-nextest-core> Message: assertion failed: (align_to_rqft(&a, &model) - expected).expand().is_zero()
  194. 57.10 s gammaloop-nextest-core> Location: crates/gammalooprs/tests/test_renormalization.rs:583
  195. 57.10 s gammaloop-nextest-core>
  196. 57.10 s gammaloop-nextest-core> ━━━━━━━━━━━━━━━━━━━━━━━━━━━━━━━━━━ BACKTRACE ━━━━━━━━━━━━━━━━━━━━━━━━━━━━━━━━━━━
  197. 57.10 s gammaloop-nextest-core> 1: <color_eyre[51793ea62743adbd]::config::PanicHook>::panic_report<unknown>
  198. 57.10 s gammaloop-nextest-core> at <unknown source file>:<unknown line>
  199. 57.10 s gammaloop-nextest-core> 2: <color_eyre[51793ea62743adbd]::config::PanicHook>::into_panic_hook::{closure#0}<unknown>
  200. 57.10 s gammaloop-nextest-core> at <unknown source file>:<unknown line>
  201. 57.10 s gammaloop-nextest-core> 3: std[bcb96dfbba0ab899]::panicking::panic_with_hook<unknown>
  202. 57.10 s gammaloop-nextest-core> at <unknown source file>:<unknown line>
  203. 57.10 s gammaloop-nextest-core> 4: std[bcb96dfbba0ab899]::panicking::panic_handler::{closure#0}<unknown>
  204. 57.10 s gammaloop-nextest-core> at <unknown source file>:<unknown line>
  205. 57.10 s gammaloop-nextest-core> 5: std[bcb96dfbba0ab899]::sys::backtrace::__rust_end_short_backtrace::<std[bcb96dfbba0ab899]::panicking::panic_handler::{closure#0}, !><unknown>
  206. 57.10 s gammaloop-nextest-core> at <unknown source file>:<unknown line>
  207. 57.10 s gammaloop-nextest-core> 6: __rustc[6c289b9f9c454d21]::rust_begin_unwind<unknown>
  208. 57.10 s gammaloop-nextest-core> at <unknown source file>:<unknown line>
  209. 57.10 s gammaloop-nextest-core> 7: core[940e698046960fd5]::panicking::panic_fmt<unknown>
  210. 57.10 s gammaloop-nextest-core> at <unknown source file>:<unknown line>
  211. 57.10 s gammaloop-nextest-core> 8: core[940e698046960fd5]::panicking::panic<unknown>
  212. 57.10 s gammaloop-nextest-core> at <unknown source file>:<unknown line>
  213. 57.10 s gammaloop-nextest-core> 9: <test_renormalization[5812939ef1a04d89]::finite_part_ghost_2loop::{closure#0} as core[940e698046960fd5]::ops::function::FnOnce<()>>::call_once<unknown>
  214. 57.10 s gammaloop-nextest-core> at <unknown source file>:<unknown line>
  215. 57.10 s gammaloop-nextest-core> 10: test[75d6903177b1d7e9]::__rust_begin_short_backtrace::<core[940e698046960fd5]::result::Result<(), alloc[2ea6bcb46fca0c42]::string::String>, fn() -> core[940e698046960fd5]::result::Result<(), alloc[2ea6bcb46fca0c42]::string::String>><unknown>
  216. 57.10 s gammaloop-nextest-core> at <unknown source file>:<unknown line>
  217. 57.10 s gammaloop-nextest-core> 11: test[75d6903177b1d7e9]::run_test::{closure#0}<unknown>
  218. 57.10 s gammaloop-nextest-core> at <unknown source file>:<unknown line>
  219. 57.10 s gammaloop-nextest-core> 12: std[bcb96dfbba0ab899]::sys::backtrace::__rust_begin_short_backtrace::<test[75d6903177b1d7e9]::run_test::{closure#1}, ()><unknown>
  220. 57.10 s gammaloop-nextest-core> at <unknown source file>:<unknown line>
  221. 57.10 s gammaloop-nextest-core> 13: <std[bcb96dfbba0ab899]::thread::lifecycle::spawn_unchecked<test[75d6903177b1d7e9]::run_test::{closure#1}, ()>::{closure#1} as core[940e698046960fd5]::ops::function::FnOnce<()>>::call_once::{shim:vtable#0}<unknown>
  222. 57.10 s gammaloop-nextest-core> at <unknown source file>:<unknown line>
  223. 57.10 s gammaloop-nextest-core> 14: <std[bcb96dfbba0ab899]::sys::thread::unix::Thread>::new::thread_start<unknown>
  224. 57.10 s gammaloop-nextest-core> at <unknown source file>:<unknown line>
  225. 57.10 s gammaloop-nextest-core> 15: start_thread<unknown>
  226. 57.10 s gammaloop-nextest-core> at <unknown source file>:<unknown line>
  227. 57.10 s gammaloop-nextest-core> 16: __clone3<unknown>
  228. 57.10 s gammaloop-nextest-core> at <unknown source file>:<unknown line>
  229. 57.10 s gammaloop-nextest-core>
  230. 57.10 s gammaloop-nextest-core> Run with COLORBT_SHOW_HIDDEN=1 environment variable to disable frame filtering.
  231. 57.10 s gammaloop-nextest-core> Run with RUST_BACKTRACE=full to include source snippets.
  232. 57.10 s gammaloop-nextest-core> =========================================
  233. 57.12 s gammaloop-nextest-core> Extracting 1 binary, 1 build script output directory, and 1 linked path to /build/nextest-archive-vpBtm4
  234. 57.22 s gammaloop-nextest-core> Extracted 7 files to /build/nextest-archive-vpBtm4 in 0.09s
  235. 57.25 s gammaloop-nextest-core> ------------
  236. 57.25 s gammaloop-nextest-core> Nextest run ID b1c0bb81-0ea0-4c6e-a4ff-afd48ab200f2 with nextest profile: ci_gammaloop
  237. 57.25 s gammaloop-nextest-core> Starting 105 tests across 1 binary
  238. 88.69 s gammaloop-nextest-core> ------------
  239. 88.69 s gammaloop-nextest-core> Summary [ 31.435s] 105 tests run: 105 passed, 0 skipped
  240. 88.77 s gammaloop-nextest-core>
  241. 88.77 s gammaloop-nextest-core> ========== nextest test summary ==========
  242. 88.77 s gammaloop-nextest-core> report: target/nextest/ci_gammaloop/junit.xml
  243. 88.77 s gammaloop-nextest-core> tests: 105, failures: 0, errors: 0
  244. 88.77 s gammaloop-nextest-core> No failing testcases found.
  245. 88.77 s gammaloop-nextest-core> =========================================
  246. 88.87 s [0 built (1 failed)]error: Cannot build '/nix/store/v0qh5n7q6ba5h5v37ywwp5q1jfzjvc33-gammaloop-nextest-core.drv'.
  247. 88.87 s Reason: builder failed with exit code 100.
  248. 88.87 s Output paths:
  249. 88.87 s /nix/store/q4cjrrnkw10yi6ir1lnvg6rhgm20mwwz-gammaloop-nextest-core
  250. 88.87 s Last 229 log lines:
  251. 88.87 s > Extracting 4 binaries (including 1 non-test binary), 1 build script output directory, and 2 linked paths to /build/nextest-archive-vXyjd8
  252. 88.87 s > Extracted 20 files to /build/nextest-archive-vXyjd8 in 1.28s
  253. 88.87 s > ------------
  254. 88.87 s > Nextest run ID 0a7b4996-4bc0-4ae2-b787-6a5e88002509 with nextest profile: ci_gammaloop
  255. 88.87 s > Starting 379 tests across 3 binaries
  256. 88.87 s > ------------
  257. 88.87 s > Summary [ 1.767s] 379 tests run: 379 passed, 0 skipped
  258. 88.87 s >
  259. 88.87 s > ========== nextest test summary ==========
  260. 88.87 s > report: target/nextest/ci_gammaloop/junit.xml
  261. 88.87 s > tests: 379, failures: 0, errors: 0
  262. 88.87 s > No failing testcases found.
  263. 88.87 s > =========================================
  264. 88.87 s > Extracting 1 binary and 1 linked path to /build/nextest-archive-aChLrK
  265. 88.87 s > Extracted 7 files to /build/nextest-archive-aChLrK in 0.10s
  266. 88.87 s > ------------
  267. 88.87 s > Nextest run ID 086ad534-4ff0-4ee1-931b-a5e92124fd1c with nextest profile: ci_gammaloop
  268. 88.87 s > Starting 19 tests across 1 binary
  269. 88.87 s > ------------
  270. 88.87 s > Summary [ 0.015s] 19 tests run: 19 passed, 0 skipped
  271. 88.87 s >
  272. 88.87 s > ========== nextest test summary ==========
  273. 88.87 s > report: target/nextest/ci_gammaloop/junit.xml
  274. 88.87 s > tests: 19, failures: 0, errors: 0
  275. 88.87 s > No failing testcases found.
  276. 88.87 s > =========================================
  277. 88.87 s > Extracting 1 binary to /build/nextest-archive-UZGGn6
  278. 88.87 s > Extracted 4 files to /build/nextest-archive-UZGGn6 in 0.05s
  279. 88.87 s > ------------
  280. 88.87 s > Nextest run ID dd641cca-38c5-4057-b4cc-97bba0be11b4 with nextest profile: ci_gammaloop
  281. 88.87 s > Starting 0 tests across 1 binary
  282. 88.87 s > ------------
  283. 88.87 s > Summary [ 0.000s] 0 tests run: 0 passed, 0 skipped
  284. 88.87 s >
  285. 88.87 s > ========== nextest test summary ==========
  286. 88.87 s > report: target/nextest/ci_gammaloop/junit.xml
  287. 88.87 s > tests: 0, failures: 0, errors: 0
  288. 88.87 s > No failing testcases found.
  289. 88.87 s > =========================================
  290. 88.87 s > Extracting 4 binaries, 1 build script output directory, and 2 linked paths to /build/nextest-archive-Qs0wlp
  291. 88.87 s > Extracted 18 files to /build/nextest-archive-Qs0wlp in 0.70s
  292. 88.87 s > ------------
  293. 88.87 s > Nextest run ID 310b5ed2-478c-4704-b601-06a61f883660 with nextest profile: ci_gammaloop
  294. 88.87 s > Starting 705 tests across 4 binaries (60 tests skipped, including 59 tests via profile.ci_gammaloop.default-filter)
  295. 88.87 s > FAIL [ 8.793s] (700/705) gammalooprs::test_renormalization finite_part_ghost_2loop
  296. 88.87 s > stdout ---
  297. 88.87 s >
  298. 88.87 s > running 1 test
  299. 88.87 s > test finite_part_ghost_2loop ... FAILED
  300. 88.87 s >
  301. 88.87 s > failures:
  302. 88.87 s >
  303. 88.87 s > failures:
  304. 88.87 s > finite_part_ghost_2loop
  305. 88.87 s >
  306. 88.87 s > test result: FAILED. 0 passed; 1 failed; 0 ignored; 0 measured; 6 filtered out; finished in 8.60s
  307. 88.87 s >
  308. 88.87 s > stderr ---
  309. 88.87 s > The application panicked (crashed).
  310. 88.87 s > Message: assertion failed: (align_to_rqft(&a, &model) - expected).expand().is_zero()
  311. 88.87 s > Location: crates/gammalooprs/tests/test_renormalization.rs:583
  312. 88.87 s >
  313. 88.87 s > ━━━━━━━━━━━━━━━━━━━━━━━━━━━━━━━━━━ BACKTRACE ━━━━━━━━━━━━━━━━━━━━━━━━━━━━━━━━━━━
  314. 88.87 s > 1: <color_eyre[51793ea62743adbd]::config::PanicHook>::panic_report<unknown>
  315. 88.87 s > at <unknown source file>:<unknown line>
  316. 88.87 s > 2: <color_eyre[51793ea62743adbd]::config::PanicHook>::into_panic_hook::{closure#0}<unknown>
  317. 88.87 s > at <unknown source file>:<unknown line>
  318. 88.87 s > 3: std[bcb96dfbba0ab899]::panicking::panic_with_hook<unknown>
  319. 88.87 s > at <unknown source file>:<unknown line>
  320. 88.87 s > 4: std[bcb96dfbba0ab899]::panicking::panic_handler::{closure#0}<unknown>
  321. 88.87 s > at <unknown source file>:<unknown line>
  322. 88.87 s > 5: std[bcb96dfbba0ab899]::sys::backtrace::__rust_end_short_backtrace::<std[bcb96dfbba0ab899]::panicking::panic_handler::{closure#0}, !><unknown>
  323. 88.87 s > at <unknown source file>:<unknown line>
  324. 88.87 s > 6: __rustc[6c289b9f9c454d21]::rust_begin_unwind<unknown>
  325. 88.87 s > at <unknown source file>:<unknown line>
  326. 88.87 s > 7: core[940e698046960fd5]::panicking::panic_fmt<unknown>
  327. 88.87 s > at <unknown source file>:<unknown line>
  328. 88.87 s > 8: core[940e698046960fd5]::panicking::panic<unknown>
  329. 88.87 s > at <unknown source file>:<unknown line>
  330. 88.87 s > 9: <test_renormalization[5812939ef1a04d89]::finite_part_ghost_2loop::{closure#0} as core[940e698046960fd5]::ops::function::FnOnce<()>>::call_once<unknown>
  331. 88.87 s > at <unknown source file>:<unknown line>
  332. 88.87 s > 10: test[75d6903177b1d7e9]::__rust_begin_short_backtrace::<core[940e698046960fd5]::result::Result<(), alloc[2ea6bcb46fca0c42]::string::String>, fn() -> core[940e698046960fd5]::result::Result<(), alloc[2ea6bcb46fca0c42]::string::String>><unknown>
  333. 88.87 s > at <unknown source file>:<unknown line>
  334. 88.87 s > 11: test[75d6903177b1d7e9]::run_test::{closure#0}<unknown>
  335. 88.87 s > at <unknown source file>:<unknown line>
  336. 88.87 s > 12: std[bcb96dfbba0ab899]::sys::backtrace::__rust_begin_short_backtrace::<test[75d6903177b1d7e9]::run_test::{closure#1}, ()><unknown>
  337. 88.87 s > at <unknown source file>:<unknown line>
  338. 88.87 s > 13: <std[bcb96dfbba0ab899]::thread::lifecycle::spawn_unchecked<test[75d6903177b1d7e9]::run_test::{closure#1}, ()>::{closure#1} as core[940e698046960fd5]::ops::function::FnOnce<()>>::call_once::{shim:vtable#0}<unknown>
  339. 88.87 s > at <unknown source file>:<unknown line>
  340. 88.87 s > 14: <std[bcb96dfbba0ab899]::sys::thread::unix::Thread>::new::thread_start<unknown>
  341. 88.87 s > at <unknown source file>:<unknown line>
  342. 88.87 s > 15: start_thread<unknown>
  343. 88.87 s > at <unknown source file>:<unknown line>
  344. 88.87 s > 16: __clone3<unknown>
  345. 88.87 s > at <unknown source file>:<unknown line>
  346. 88.87 s >
  347. 88.87 s > Run with COLORBT_SHOW_HIDDEN=1 environment variable to disable frame filtering.
  348. 88.87 s > Run with RUST_BACKTRACE=full to include source snippets.
  349. 88.87 s >
  350. 88.87 s > ------------
  351. 88.87 s > Summary [ 25.883s] 705 tests run: 704 passed, 1 failed, 60 skipped
  352. 88.87 s > FAIL [ 8.793s] (700/705) gammalooprs::test_renormalization finite_part_ghost_2loop
  353. 88.87 s > stdout ---
  354. 88.87 s >
  355. 88.87 s > running 1 test
  356. 88.87 s > test finite_part_ghost_2loop ... FAILED
  357. 88.87 s >
  358. 88.87 s > failures:
  359. 88.87 s >
  360. 88.87 s > failures:
  361. 88.87 s > finite_part_ghost_2loop
  362. 88.87 s >
  363. 88.87 s > test result: FAILED. 0 passed; 1 failed; 0 ignored; 0 measured; 6 filtered out; finished in 8.60s
  364. 88.87 s >
  365. 88.87 s > stderr ---
  366. 88.87 s > The application panicked (crashed).
  367. 88.87 s > Message: assertion failed: (align_to_rqft(&a, &model) - expected).expand().is_zero()
  368. 88.87 s > Location: crates/gammalooprs/tests/test_renormalization.rs:583
  369. 88.87 s >
  370. 88.87 s > ━━━━━━━━━━━━━━━━━━━━━━━━━━━━━━━━━━ BACKTRACE ━━━━━━━━━━━━━━━━━━━━━━━━━━━━━━━━━━━
  371. 88.87 s > 1: <color_eyre[51793ea62743adbd]::config::PanicHook>::panic_report<unknown>
  372. 88.87 s > at <unknown source file>:<unknown line>
  373. 88.87 s > 2: <color_eyre[51793ea62743adbd]::config::PanicHook>::into_panic_hook::{closure#0}<unknown>
  374. 88.87 s > at <unknown source file>:<unknown line>
  375. 88.87 s > 3: std[bcb96dfbba0ab899]::panicking::panic_with_hook<unknown>
  376. 88.87 s > at <unknown source file>:<unknown line>
  377. 88.87 s > 4: std[bcb96dfbba0ab899]::panicking::panic_handler::{closure#0}<unknown>
  378. 88.87 s > at <unknown source file>:<unknown line>
  379. 88.87 s > 5: std[bcb96dfbba0ab899]::sys::backtrace::__rust_end_short_backtrace::<std[bcb96dfbba0ab899]::panicking::panic_handler::{closure#0}, !><unknown>
  380. 88.87 s > at <unknown source file>:<unknown line>
  381. 88.87 s > 6: __rustc[6c289b9f9c454d21]::rust_begin_unwind<unknown>
  382. 88.87 s > at <unknown source file>:<unknown line>
  383. 88.87 s > 7: core[940e698046960fd5]::panicking::panic_fmt<unknown>
  384. 88.87 s > at <unknown source file>:<unknown line>
  385. 88.87 s > 8: core[940e698046960fd5]::panicking::panic<unknown>
  386. 88.87 s > at <unknown source file>:<unknown line>
  387. 88.87 s > 9: <test_renormalization[5812939ef1a04d89]::finite_part_ghost_2loop::{closure#0} as core[940e698046960fd5]::ops::function::FnOnce<()>>::call_once<unknown>
  388. 88.87 s > at <unknown source file>:<unknown line>
  389. 88.87 s > 10: test[75d6903177b1d7e9]::__rust_begin_short_backtrace::<core[940e698046960fd5]::result::Result<(), alloc[2ea6bcb46fca0c42]::string::String>, fn() -> core[940e698046960fd5]::result::Result<(), alloc[2ea6bcb46fca0c42]::string::String>><unknown>
  390. 88.87 s > at <unknown source file>:<unknown line>
  391. 88.87 s > 11: test[75d6903177b1d7e9]::run_test::{closure#0}<unknown>
  392. 88.87 s > at <unknown source file>:<unknown line>
  393. 88.87 s > 12: std[bcb96dfbba0ab899]::sys::backtrace::__rust_begin_short_backtrace::<test[75d6903177b1d7e9]::run_test::{closure#1}, ()><unknown>
  394. 88.87 s > at <unknown source file>:<unknown line>
  395. 88.87 s > 13: <std[bcb96dfbba0ab899]::thread::lifecycle::spawn_unchecked<test[75d6903177b1d7e9]::run_test::{closure#1}, ()>::{closure#1} as core[940e698046960fd5]::ops::function::FnOnce<()>>::call_once::{shim:vtable#0}<unknown>
  396. 88.87 s > at <unknown source file>:<unknown line>
  397. 88.87 s > 14: <std[bcb96dfbba0ab899]::sys::thread::unix::Thread>::new::thread_start<unknown>
  398. 88.87 s > at <unknown source file>:<unknown line>
  399. 88.87 s > 15: start_thread<unknown>
  400. 88.87 s > at <unknown source file>:<unknown line>
  401. 88.87 s > 16: __clone3<unknown>
  402. 88.87 s > at <unknown source file>:<unknown line>
  403. 88.87 s >
  404. 88.87 s > Run with COLORBT_SHOW_HIDDEN=1 environment variable to disable frame filtering.
  405. 88.87 s > Run with RUST_BACKTRACE=full to include source snippets.
  406. 88.87 s >
  407. 88.87 s > error: test run failed
  408. 88.87 s >
  409. 88.87 s > ========== nextest test summary ==========
  410. 88.87 s > report: target/nextest/ci_gammaloop/junit.xml
  411. 88.87 s > tests: 705, failures: 1, errors: 0
  412. 88.87 s >
  413. 88.87 s > 1. gammalooprs::test_renormalization::finite_part_ghost_2loop
  414. 88.87 s > failure: test failure with exit code 101
  415. 88.87 s > system-out
  416. 88.87 s > running 1 test
  417. 88.87 s > test finite_part_ghost_2loop ... FAILED
  418. 88.87 s >
  419. 88.87 s > failures:
  420. 88.87 s >
  421. 88.87 s > failures:
  422. 88.87 s > finite_part_ghost_2loop
  423. 88.87 s >
  424. 88.87 s > test result: FAILED. 0 passed; 1 failed; 0 ignored; 0 measured; 6 filtered out; finished in 8.60s
  425. 88.87 s > system-err
  426. 88.87 s > The application panicked (crashed).
  427. 88.87 s > Message: assertion failed: (align_to_rqft(&a, &model) - expected).expand().is_zero()
  428. 88.87 s > Location: crates/gammalooprs/tests/test_renormalization.rs:583
  429. 88.87 s >
  430. 88.87 s > ━━━━━━━━━━━━━━━━━━━━━━━━━━━━━━━━━━ BACKTRACE ━━━━━━━━━━━━━━━━━━━━━━━━━━━━━━━━━━━
  431. 88.87 s > 1: <color_eyre[51793ea62743adbd]::config::PanicHook>::panic_report<unknown>
  432. 88.87 s > at <unknown source file>:<unknown line>
  433. 88.87 s > 2: <color_eyre[51793ea62743adbd]::config::PanicHook>::into_panic_hook::{closure#0}<unknown>
  434. 88.87 s > at <unknown source file>:<unknown line>
  435. 88.87 s > 3: std[bcb96dfbba0ab899]::panicking::panic_with_hook<unknown>
  436. 88.87 s > at <unknown source file>:<unknown line>
  437. 88.87 s > 4: std[bcb96dfbba0ab899]::panicking::panic_handler::{closure#0}<unknown>
  438. 88.87 s > at <unknown source file>:<unknown line>
  439. 88.87 s > 5: std[bcb96dfbba0ab899]::sys::backtrace::__rust_end_short_backtrace::<std[bcb96dfbba0ab899]::panicking::panic_handler::{closure#0}, !><unknown>
  440. 88.87 s > at <unknown source file>:<unknown line>
  441. 88.87 s > 6: __rustc[6c289b9f9c454d21]::rust_begin_unwind<unknown>
  442. 88.87 s > at <unknown source file>:<unknown line>
  443. 88.87 s > 7: core[940e698046960fd5]::panicking::panic_fmt<unknown>
  444. 88.87 s > at <unknown source file>:<unknown line>
  445. 88.87 s > 8: core[940e698046960fd5]::panicking::panic<unknown>
  446. 88.87 s > at <unknown source file>:<unknown line>
  447. 88.87 s > 9: <test_renormalization[5812939ef1a04d89]::finite_part_ghost_2loop::{closure#0} as core[940e698046960fd5]::ops::function::FnOnce<()>>::call_once<unknown>
  448. 88.87 s > at <unknown source file>:<unknown line>
  449. 88.87 s > 10: test[75d6903177b1d7e9]::__rust_begin_short_backtrace::<core[940e698046960fd5]::result::Result<(), alloc[2ea6bcb46fca0c42]::string::String>, fn() -> core[940e698046960fd5]::result::Result<(), alloc[2ea6bcb46fca0c42]::string::String>><unknown>
  450. 88.87 s > at <unknown source file>:<unknown line>
  451. 88.87 s > 11: test[75d6903177b1d7e9]::run_test::{closure#0}<unknown>
  452. 88.87 s > at <unknown source file>:<unknown line>
  453. 88.87 s > 12: std[bcb96dfbba0ab899]::sys::backtrace::__rust_begin_short_backtrace::<test[75d6903177b1d7e9]::run_test::{closure#1}, ()><unknown>
  454. 88.87 s > at <unknown source file>:<unknown line>
  455. 88.87 s > 13: <std[bcb96dfbba0ab899]::thread::lifecycle::spawn_unchecked<test[75d6903177b1d7e9]::run_test::{closure#1}, ()>::{closure#1} as core[940e698046960fd5]::ops::function::FnOnce<()>>::call_once::{shim:vtable#0}<unknown>
  456. 88.87 s > at <unknown source file>:<unknown line>
  457. 88.87 s > 14: <std[bcb96dfbba0ab899]::sys::thread::unix::Thread>::new::thread_start<unknown>
  458. 88.87 s > at <unknown source file>:<unknown line>
  459. 88.87 s > 15: start_thread<unknown>
  460. 88.87 s > at <unknown source file>:<unknown line>
  461. 88.87 s > 16: __clone3<unknown>
  462. 88.87 s > at <unknown source file>:<unknown line>
  463. 88.87 s >
  464. 88.87 s > Run with COLORBT_SHOW_HIDDEN=1 environment variable to disable frame filtering.
  465. 88.87 s > Run with RUST_BACKTRACE=full to include source snippets.
  466. 88.87 s > =========================================
  467. 88.87 s > Extracting 1 binary, 1 build script output directory, and 1 linked path to /build/nextest-archive-vpBtm4
  468. 88.87 s > Extracted 7 files to /build/nextest-archive-vpBtm4 in 0.09s
  469. 88.87 s > ------------
  470. 88.87 s > Nextest run ID b1c0bb81-0ea0-4c6e-a4ff-afd48ab200f2 with nextest profile: ci_gammaloop
  471. 88.87 s > Starting 105 tests across 1 binary
  472. 88.87 s > ------------
  473. 88.87 s > Summary [ 31.435s] 105 tests run: 105 passed, 0 skipped
  474. 88.87 s >
  475. 88.87 s > ========== nextest test summary ==========
  476. 88.87 s > report: target/nextest/ci_gammaloop/junit.xml
  477. 88.87 s > tests: 105, failures: 0, errors: 0
  478. 88.87 s > No failing testcases found.
  479. 88.87 s > =========================================
  480. 88.87 s For full logs, run:
  481. 88.87 s nix log /nix/store/v0qh5n7q6ba5h5v37ywwp5q1jfzjvc33-gammaloop-nextest-core.drv
  482. 89.11 s Run failed.