test packages.x86_64-linux.nix-ci-check-gammaloop-nextest-core
0.00 s
$ /nix/store/9ypz3flqsrl5xl495mm8h645gadjsxi1-coreutils-9.11/bin/timeout --kill-after=15s 7200s /nix/store/23zk8sgzamrbmj1fday15szf7f2279s8-nix-2.34.7/bin/nix --extra-experimental-features nix-command --extra-experimental-features flakes flake clone git+https://github.com/alphal00p/gammaloop --dest /tmp/nix-ci-worker/stable-pwd/repo/
0.12 s
Cloning into '/tmp/nix-ci-worker/stable-pwd/repo'...
0.93 s
remote: Enumerating objects: 85477, done.
1.05 s
remote: Counting objects: 0% (1/8598)
remote: Counting objects: 1% (86/8598)
remote: Counting objects: 2% (172/8598)
remote: Counting objects: 3% (258/8598)
remote: Counting objects: 4% (344/8598)
remote: Counting objects: 5% (430/8598)
remote: Counting objects: 6% (516/8598)
remote: Counting objects: 7% (602/8598)
remote: Counting objects: 8% (688/8598)
remote: Counting objects: 9% (774/8598)
remote: Counting objects: 10% (860/8598)
remote: Counting objects: 11% (946/8598)
remote: Counting objects: 12% (1032/8598)
remote: Counting objects: 13% (1118/8598)
remote: Counting objects: 14% (1204/8598)
remote: Counting objects: 15% (1290/8598)
remote: Counting objects: 16% (1376/8598)
remote: Counting objects: 17% (1462/8598)
remote: Counting objects: 18% (1548/8598)
remote: Counting objects: 19% (1634/8598)
remote: Counting objects: 20% (1720/8598)
remote: Counting objects: 21% (1806/8598)
remote: Counting objects: 22% (1892/8598)
remote: Counting objects: 23% (1978/8598)
remote: Counting objects: 24% (2064/8598)
remote: Counting objects: 25% (2150/8598)
remote: Counting objects: 26% (2236/8598)
remote: Counting objects: 27% (2322/8598)
remote: Counting objects: 28% (2408/8598)
remote: Counting objects: 29% (2494/8598)
remote: Counting objects: 30% (2580/8598)
remote: Counting objects: 31% (2666/8598)
remote: Counting objects: 32% (2752/8598)
remote: Counting objects: 33% (2838/8598)
remote: Counting objects: 34% (2924/8598)
remote: Counting objects: 35% (3010/8598)
remote: Counting objects: 36% (3096/8598)
remote: Counting objects: 37% (3182/8598)
remote: Counting objects: 38% (3268/8598)
remote: Counting objects: 39% (3354/8598)
remote: Counting objects: 40% (3440/8598)
remote: Counting objects: 41% (3526/8598)
remote: Counting objects: 42% (3612/8598)
remote: Counting objects: 43% (3698/8598)
remote: Counting objects: 44% (3784/8598)
remote: Counting objects: 45% (3870/8598)
remote: Counting objects: 46% (3956/8598)
remote: Counting objects: 47% (4042/8598)
remote: Counting objects: 48% (4128/8598)
remote: Counting objects: 49% (4214/8598)
remote: Counting objects: 50% (4299/8598)
remote: Counting objects: 51% (4385/8598)
remote: Counting objects: 52% (4471/8598)
remote: Counting objects: 53% (4557/8598)
remote: Counting objects: 54% (4643/8598)
remote: Counting objects: 55% (4729/8598)
remote: Counting objects: 56% (4815/8598)
remote: Counting objects: 57% (4901/8598)
remote: Counting objects: 58% (4987/8598)
remote: Counting objects: 59% (5073/8598)
remote: Counting objects: 60% (5159/8598)
remote: Counting objects: 61% (5245/8598)
remote: Counting objects: 62% (5331/8598)
remote: Counting objects: 63% (5417/8598)
remote: Counting objects: 64% (5503/8598)
remote: Counting objects: 65% (5589/8598)
remote: Counting objects: 66% (5675/8598)
remote: Counting objects: 67% (5761/8598)
remote: Counting objects: 68% (5847/8598)
remote: Counting objects: 69% (5933/8598)
remote: Counting objects: 70% (6019/8598)
remote: Counting objects: 71% (6105/8598)
remote: Counting objects: 72% (6191/8598)
remote: Counting objects: 73% (6277/8598)
remote: Counting objects: 74% (6363/8598)
remote: Counting objects: 75% (6449/8598)
remote: Counting objects: 76% (6535/8598)
remote: Counting objects: 77% (6621/8598)
remote: Counting objects: 78% (6707/8598)
remote: Counting objects: 79% (6793/8598)
remote: Counting objects: 80% (6879/8598)
remote: Counting objects: 81% (6965/8598)
remote: Counting objects: 82% (7051/8598)
remote: Counting objects: 83% (7137/8598)
remote: Counting objects: 84% (7223/8598)
remote: Counting objects: 85% (7309/8598)
remote: Counting objects: 86% (7395/8598)
remote: Counting objects: 87% (7481/8598)
remote: Counting objects: 88% (7567/8598)
remote: Counting objects: 89% (7653/8598)
remote: Counting objects: 90% (7739/8598)
remote: Counting objects: 91% (7825/8598)
remote: Counting objects: 92% (7911/8598)
remote: Counting objects: 93% (7997/8598)
remote: Counting objects: 94% (8083/8598)
remote: Counting objects: 95% (8169/8598)
remote: Counting objects: 96% (8255/8598)
remote: Counting objects: 97% (8341/8598)
remote: Counting objects: 98% (8427/8598)
remote: Counting objects: 99% (8513/8598)
remote: Counting objects: 100% (8598/8598)
remote: Counting objects: 100% (8598/8598), done.
2.75 s
remote: Compressing objects: 0% (1/1723)
remote: Compressing objects: 1% (18/1723)
remote: Compressing objects: 2% (35/1723)
remote: Compressing objects: 3% (52/1723)
remote: Compressing objects: 4% (69/1723)
remote: Compressing objects: 5% (87/1723)
remote: Compressing objects: 6% (104/1723)
remote: Compressing objects: 7% (121/1723)
remote: Compressing objects: 8% (138/1723)
remote: Compressing objects: 9% (156/1723)
remote: Compressing objects: 9% (165/1723)
remote: Compressing objects: 10% (173/1723)
remote: Compressing objects: 11% (190/1723)
remote: Compressing objects: 12% (207/1723)
remote: Compressing objects: 13% (224/1723)
remote: Compressing objects: 14% (242/1723)
remote: Compressing objects: 15% (259/1723)
remote: Compressing objects: 16% (276/1723)
remote: Compressing objects: 17% (293/1723)
remote: Compressing objects: 18% (311/1723)
remote: Compressing objects: 19% (328/1723)
remote: Compressing objects: 20% (345/1723)
remote: Compressing objects: 21% (362/1723)
remote: Compressing objects: 22% (380/1723)
remote: Compressing objects: 23% (397/1723)
remote: Compressing objects: 24% (414/1723)
remote: Compressing objects: 25% (431/1723)
remote: Compressing objects: 26% (448/1723)
remote: Compressing objects: 27% (466/1723)
remote: Compressing objects: 28% (483/1723)
remote: Compressing objects: 29% (500/1723)
remote: Compressing objects: 30% (517/1723)
remote: Compressing objects: 31% (535/1723)
remote: Compressing objects: 32% (552/1723)
remote: Compressing objects: 33% (569/1723)
remote: Compressing objects: 34% (586/1723)
remote: Compressing objects: 35% (604/1723)
remote: Compressing objects: 36% (621/1723)
remote: Compressing objects: 37% (638/1723)
remote: Compressing objects: 38% (655/1723)
remote: Compressing objects: 39% (672/1723)
remote: Compressing objects: 40% (690/1723)
remote: Compressing objects: 41% (707/1723)
remote: Compressing objects: 42% (724/1723)
remote: Compressing objects: 43% (741/1723)
remote: Compressing objects: 44% (759/1723)
remote: Compressing objects: 45% (776/1723)
remote: Compressing objects: 46% (793/1723)
remote: Compressing objects: 47% (810/1723)
remote: Compressing objects: 48% (828/1723)
remote: Compressing objects: 49% (845/1723)
remote: Compressing objects: 50% (862/1723)
remote: Compressing objects: 51% (879/1723)
remote: Compressing objects: 52% (896/1723)
remote: Compressing objects: 53% (914/1723)
remote: Compressing objects: 54% (931/1723)
remote: Compressing objects: 55% (948/1723)
remote: Compressing objects: 56% (965/1723)
remote: Compressing objects: 57% (983/1723)
remote: Compressing objects: 58% (1000/1723)
remote: Compressing objects: 59% (1017/1723)
remote: Compressing objects: 60% (1034/1723)
remote: Compressing objects: 61% (1052/1723)
remote: Compressing objects: 62% (1069/1723)
remote: Compressing objects: 63% (1086/1723)
remote: Compressing objects: 64% (1103/1723)
remote: Compressing objects: 65% (1120/1723)
remote: Compressing objects: 66% (1138/1723)
remote: Compressing objects: 67% (1155/1723)
remote: Compressing objects: 68% (1172/1723)
remote: Compressing objects: 69% (1189/1723)
remote: Compressing objects: 70% (1207/1723)
remote: Compressing objects: 71% (1224/1723)
remote: Compressing objects: 72% (1241/1723)
remote: Compressing objects: 73% (1258/1723)
remote: Compressing objects: 74% (1276/1723)
remote: Compressing objects: 75% (1293/1723)
remote: Compressing objects: 76% (1310/1723)
remote: Compressing objects: 77% (1327/1723)
remote: Compressing objects: 78% (1344/1723)
remote: Compressing objects: 79% (1362/1723)
remote: Compressing objects: 80% (1379/1723)
remote: Compressing objects: 81% (1396/1723)
remote: Compressing objects: 82% (1413/1723)
remote: Compressing objects: 83% (1431/1723)
remote: Compressing objects: 84% (1448/1723)
remote: Compressing objects: 85% (1465/1723)
remote: Compressing objects: 86% (1482/1723)
remote: Compressing objects: 87% (1500/1723)
remote: Compressing objects: 88% (1517/1723)
remote: Compressing objects: 89% (1534/1723)
remote: Compressing objects: 90% (1551/1723)
remote: Compressing objects: 91% (1568/1723)
remote: Compressing objects: 92% (1586/1723)
remote: Compressing objects: 93% (1603/1723)
remote: Compressing objects: 94% (1620/1723)
remote: Compressing objects: 95% (1637/1723)
remote: Compressing objects: 96% (1655/1723)
remote: Compressing objects: 97% (1672/1723)
remote: Compressing objects: 98% (1689/1723)
remote: Compressing objects: 99% (1706/1723)
remote: Compressing objects: 100% (1723/1723)
remote: Compressing objects: 100% (1723/1723), done.
7.96 s
Receiving objects: 0% (1/85477)
Receiving objects: 1% (855/85477)
Receiving objects: 2% (1710/85477)
Receiving objects: 3% (2565/85477)
Receiving objects: 4% (3420/85477)
Receiving objects: 5% (4274/85477)
Receiving objects: 6% (5129/85477), 8.92 MiB | 17.82 MiB/s
Receiving objects: 7% (5984/85477), 8.92 MiB | 17.82 MiB/s
Receiving objects: 8% (6839/85477), 8.92 MiB | 17.82 MiB/s
Receiving objects: 9% (7693/85477), 8.92 MiB | 17.82 MiB/s
Receiving objects: 10% (8548/85477), 8.92 MiB | 17.82 MiB/s
Receiving objects: 11% (9403/85477), 8.92 MiB | 17.82 MiB/s
Receiving objects: 12% (10258/85477), 8.92 MiB | 17.82 MiB/s
Receiving objects: 13% (11113/85477), 8.92 MiB | 17.82 MiB/s
Receiving objects: 14% (11967/85477), 8.92 MiB | 17.82 MiB/s
Receiving objects: 15% (12822/85477), 8.92 MiB | 17.82 MiB/s
Receiving objects: 16% (13677/85477), 8.92 MiB | 17.82 MiB/s
Receiving objects: 17% (14532/85477), 8.92 MiB | 17.82 MiB/s
Receiving objects: 18% (15386/85477), 8.92 MiB | 17.82 MiB/s
Receiving objects: 19% (16241/85477), 8.92 MiB | 17.82 MiB/s
Receiving objects: 20% (17096/85477), 8.92 MiB | 17.82 MiB/s
Receiving objects: 21% (17951/85477), 8.92 MiB | 17.82 MiB/s
Receiving objects: 22% (18805/85477), 8.92 MiB | 17.82 MiB/s
Receiving objects: 23% (19660/85477), 8.92 MiB | 17.82 MiB/s
Receiving objects: 24% (20515/85477), 8.92 MiB | 17.82 MiB/s
Receiving objects: 25% (21370/85477), 8.92 MiB | 17.82 MiB/s
Receiving objects: 26% (22225/85477), 8.92 MiB | 17.82 MiB/s
Receiving objects: 26% (22649/85477), 24.55 MiB | 24.54 MiB/s
Receiving objects: 27% (23079/85477), 24.55 MiB | 24.54 MiB/s
Receiving objects: 28% (23934/85477), 24.55 MiB | 24.54 MiB/s
Receiving objects: 29% (24789/85477), 24.55 MiB | 24.54 MiB/s
Receiving objects: 30% (25644/85477), 24.55 MiB | 24.54 MiB/s
Receiving objects: 31% (26498/85477), 24.55 MiB | 24.54 MiB/s
Receiving objects: 32% (27353/85477), 24.55 MiB | 24.54 MiB/s
Receiving objects: 33% (28208/85477), 24.55 MiB | 24.54 MiB/s
Receiving objects: 34% (29063/85477), 24.55 MiB | 24.54 MiB/s
Receiving objects: 35% (29917/85477), 24.55 MiB | 24.54 MiB/s
Receiving objects: 36% (30772/85477), 24.55 MiB | 24.54 MiB/s
Receiving objects: 37% (31627/85477), 24.55 MiB | 24.54 MiB/s
Receiving objects: 38% (32482/85477), 24.55 MiB | 24.54 MiB/s
Receiving objects: 39% (33337/85477), 24.55 MiB | 24.54 MiB/s
Receiving objects: 40% (34191/85477), 24.55 MiB | 24.54 MiB/s
Receiving objects: 41% (35046/85477), 24.55 MiB | 24.54 MiB/s
Receiving objects: 42% (35901/85477), 24.55 MiB | 24.54 MiB/s
Receiving objects: 43% (36756/85477), 24.55 MiB | 24.54 MiB/s
Receiving objects: 44% (37610/85477), 39.39 MiB | 26.25 MiB/s
Receiving objects: 45% (38465/85477), 39.39 MiB | 26.25 MiB/s
Receiving objects: 46% (39320/85477), 39.39 MiB | 26.25 MiB/s
Receiving objects: 47% (40175/85477), 39.39 MiB | 26.25 MiB/s
Receiving objects: 48% (41029/85477), 39.39 MiB | 26.25 MiB/s
Receiving objects: 49% (41884/85477), 39.39 MiB | 26.25 MiB/s
Receiving objects: 50% (42739/85477), 39.39 MiB | 26.25 MiB/s
Receiving objects: 51% (43594/85477), 39.39 MiB | 26.25 MiB/s
Receiving objects: 52% (44449/85477), 39.39 MiB | 26.25 MiB/s
Receiving objects: 52% (44630/85477), 39.39 MiB | 26.25 MiB/s
Receiving objects: 53% (45303/85477), 53.97 MiB | 26.98 MiB/s
Receiving objects: 54% (46158/85477), 53.97 MiB | 26.98 MiB/s
Receiving objects: 55% (47013/85477), 53.97 MiB | 26.98 MiB/s
Receiving objects: 56% (47868/85477), 53.97 MiB | 26.98 MiB/s
Receiving objects: 57% (48722/85477), 53.97 MiB | 26.98 MiB/s
Receiving objects: 58% (49577/85477), 53.97 MiB | 26.98 MiB/s
Receiving objects: 59% (50432/85477), 70.15 MiB | 27.95 MiB/s
Receiving objects: 60% (51287/85477), 70.15 MiB | 27.95 MiB/s
Receiving objects: 61% (52141/85477), 70.15 MiB | 27.95 MiB/s
Receiving objects: 62% (52996/85477), 70.15 MiB | 27.95 MiB/s
Receiving objects: 63% (53851/85477), 70.15 MiB | 27.95 MiB/s
Receiving objects: 64% (54706/85477), 70.15 MiB | 27.95 MiB/s
Receiving objects: 65% (55561/85477), 70.15 MiB | 27.95 MiB/s
Receiving objects: 66% (56415/85477), 70.15 MiB | 27.95 MiB/s
Receiving objects: 67% (57270/85477), 70.15 MiB | 27.95 MiB/s
Receiving objects: 67% (57320/85477), 85.86 MiB | 28.28 MiB/s
Receiving objects: 68% (58125/85477), 101.91 MiB | 28.82 MiB/s
Receiving objects: 69% (58980/85477), 101.91 MiB | 28.82 MiB/s
Receiving objects: 70% (59834/85477), 101.91 MiB | 28.82 MiB/s
Receiving objects: 71% (60689/85477), 101.91 MiB | 28.82 MiB/s
Receiving objects: 72% (61544/85477), 101.91 MiB | 28.82 MiB/s
Receiving objects: 73% (62399/85477), 101.91 MiB | 28.82 MiB/s
Receiving objects: 73% (63211/85477), 101.91 MiB | 28.82 MiB/s
Receiving objects: 74% (63253/85477), 118.29 MiB | 29.31 MiB/s
Receiving objects: 75% (64108/85477), 118.29 MiB | 29.31 MiB/s
Receiving objects: 76% (64963/85477), 118.29 MiB | 29.31 MiB/s
Receiving objects: 77% (65818/85477), 118.29 MiB | 29.31 MiB/s
Receiving objects: 78% (66673/85477), 118.29 MiB | 29.31 MiB/s
Receiving objects: 79% (67527/85477), 118.29 MiB | 29.31 MiB/s
Receiving objects: 80% (68382/85477), 118.29 MiB | 29.31 MiB/s
Receiving objects: 81% (69237/85477), 135.04 MiB | 29.77 MiB/s
Receiving objects: 82% (70092/85477), 135.04 MiB | 29.77 MiB/s
Receiving objects: 83% (70946/85477), 135.04 MiB | 29.77 MiB/s
Receiving objects: 84% (71801/85477), 135.04 MiB | 29.77 MiB/s
Receiving objects: 85% (72656/85477), 135.04 MiB | 29.77 MiB/s
Receiving objects: 86% (73511/85477), 135.04 MiB | 29.77 MiB/s
Receiving objects: 87% (74365/85477), 135.04 MiB | 29.77 MiB/s
Receiving objects: 88% (75220/85477), 135.04 MiB | 29.77 MiB/s
Receiving objects: 89% (76075/85477), 135.04 MiB | 29.77 MiB/s
Receiving objects: 89% (76401/85477), 135.04 MiB | 29.77 MiB/s
Receiving objects: 90% (76930/85477), 135.04 MiB | 29.77 MiB/s
Receiving objects: 91% (77785/85477), 135.04 MiB | 29.77 MiB/s
Receiving objects: 92% (78639/85477), 135.04 MiB | 29.77 MiB/s
Receiving objects: 93% (79494/85477), 135.04 MiB | 29.77 MiB/s
Receiving objects: 94% (80349/85477), 135.04 MiB | 29.77 MiB/s
Receiving objects: 95% (81204/85477), 150.30 MiB | 31.17 MiB/s
Receiving objects: 96% (82058/85477), 150.30 MiB | 31.17 MiB/s
Receiving objects: 97% (82913/85477), 150.30 MiB | 31.17 MiB/s
Receiving objects: 98% (83768/85477), 150.30 MiB | 31.17 MiB/s
Receiving objects: 99% (84623/85477), 150.30 MiB | 31.17 MiB/s
remote: Total 85477 (delta 7529), reused 6906 (delta 6875), pack-reused 76879 (from 3)
7.96 s
Receiving objects: 100% (85477/85477), 150.30 MiB | 31.17 MiB/s
Receiving objects: 100% (85477/85477), 154.96 MiB | 29.78 MiB/s, done.
9.47 s
Resolving deltas: 0% (0/57949)
Resolving deltas: 1% (580/57949)
Resolving deltas: 2% (1159/57949)
Resolving deltas: 3% (1739/57949)
Resolving deltas: 4% (2318/57949)
Resolving deltas: 5% (2898/57949)
Resolving deltas: 6% (3477/57949)
Resolving deltas: 7% (4057/57949)
Resolving deltas: 8% (4636/57949)
Resolving deltas: 9% (5216/57949)
Resolving deltas: 10% (5795/57949)
Resolving deltas: 11% (6375/57949)
Resolving deltas: 12% (6954/57949)
Resolving deltas: 13% (7535/57949)
Resolving deltas: 14% (8114/57949)
Resolving deltas: 15% (8693/57949)
Resolving deltas: 16% (9272/57949)
Resolving deltas: 17% (9852/57949)
Resolving deltas: 18% (10431/57949)
Resolving deltas: 19% (11012/57949)
Resolving deltas: 20% (11590/57949)
Resolving deltas: 21% (12170/57949)
Resolving deltas: 22% (12749/57949)
Resolving deltas: 23% (13329/57949)
Resolving deltas: 24% (13908/57949)
Resolving deltas: 25% (14488/57949)
Resolving deltas: 26% (15067/57949)
Resolving deltas: 27% (15647/57949)
Resolving deltas: 28% (16226/57949)
Resolving deltas: 29% (16806/57949)
Resolving deltas: 30% (17385/57949)
Resolving deltas: 31% (17965/57949)
Resolving deltas: 32% (18544/57949)
Resolving deltas: 33% (19124/57949)
Resolving deltas: 34% (19703/57949)
Resolving deltas: 35% (20283/57949)
Resolving deltas: 36% (20862/57949)
Resolving deltas: 37% (21443/57949)
Resolving deltas: 38% (22021/57949)
Resolving deltas: 39% (22601/57949)
Resolving deltas: 40% (23180/57949)
Resolving deltas: 41% (23760/57949)
Resolving deltas: 42% (24339/57949)
Resolving deltas: 43% (24919/57949)
Resolving deltas: 44% (25498/57949)
Resolving deltas: 45% (26079/57949)
Resolving deltas: 46% (26657/57949)
Resolving deltas: 47% (27237/57949)
Resolving deltas: 48% (27816/57949)
Resolving deltas: 49% (28396/57949)
Resolving deltas: 50% (28975/57949)
Resolving deltas: 51% (29554/57949)
Resolving deltas: 52% (30134/57949)
Resolving deltas: 53% (30713/57949)
Resolving deltas: 54% (31293/57949)
Resolving deltas: 55% (31872/57949)
Resolving deltas: 56% (32452/57949)
Resolving deltas: 57% (33031/57949)
Resolving deltas: 58% (33611/57949)
Resolving deltas: 59% (34190/57949)
Resolving deltas: 60% (34770/57949)
Resolving deltas: 61% (35350/57949)
Resolving deltas: 62% (35929/57949)
Resolving deltas: 63% (36510/57949)
Resolving deltas: 64% (37088/57949)
Resolving deltas: 65% (37667/57949)
Resolving deltas: 66% (38248/57949)
Resolving deltas: 67% (38826/57949)
Resolving deltas: 68% (39406/57949)
Resolving deltas: 68% (39437/57949)
Resolving deltas: 69% (39985/57949)
Resolving deltas: 70% (40565/57949)
Resolving deltas: 71% (41144/57949)
Resolving deltas: 72% (41725/57949)
Resolving deltas: 73% (42304/57949)
Resolving deltas: 74% (42883/57949)
Resolving deltas: 75% (43462/57949)
Resolving deltas: 76% (44042/57949)
Resolving deltas: 77% (44622/57949)
Resolving deltas: 78% (45201/57949)
Resolving deltas: 79% (45780/57949)
Resolving deltas: 80% (46360/57949)
Resolving deltas: 81% (46939/57949)
Resolving deltas: 82% (47519/57949)
Resolving deltas: 83% (48098/57949)
Resolving deltas: 84% (48678/57949)
Resolving deltas: 85% (49257/57949)
Resolving deltas: 86% (49837/57949)
Resolving deltas: 87% (50416/57949)
Resolving deltas: 88% (50996/57949)
Resolving deltas: 89% (51575/57949)
Resolving deltas: 90% (52155/57949)
Resolving deltas: 91% (52734/57949)
Resolving deltas: 92% (53316/57949)
Resolving deltas: 93% (53894/57949)
Resolving deltas: 94% (54473/57949)
Resolving deltas: 95% (55052/57949)
Resolving deltas: 96% (55632/57949)
Resolving deltas: 97% (56212/57949)
Resolving deltas: 98% (56791/57949)
Resolving deltas: 99% (57370/57949)
Resolving deltas: 100% (57949/57949)
Resolving deltas: 100% (57949/57949), done.
10.04 s
Fetching commit 1eb32575d9b16fee2910f3bb2c791fbae2eae5ba for faster_uv_from_4d ...
10.04 s
$ /nix/store/bcnisk3ydfgv26v2gw3zlky24g00yww2-git-2.54.0/bin/git fetch origin 1eb32575d9b16fee2910f3bb2c791fbae2eae5ba
10.55 s
From https://github.com/alphal00p/gammaloop
10.55 s
* branch 1eb32575d9b16fee2910f3bb2c791fbae2eae5ba -> FETCH_HEAD
10.58 s
$ /nix/store/9ypz3flqsrl5xl495mm8h645gadjsxi1-coreutils-9.11/bin/timeout --kill-after=15s 7200s /nix/store/bcnisk3ydfgv26v2gw3zlky24g00yww2-git-2.54.0/bin/git -c advice.detachedHead=false checkout 1eb32575d9b16fee2910f3bb2c791fbae2eae5ba
11.07 s
HEAD is now at 1eb32575d contract additive evaluator terms independently
11.08 s
$ /nix/store/9ypz3flqsrl5xl495mm8h645gadjsxi1-coreutils-9.11/bin/timeout --kill-after=15s 7200s /nix/store/23zk8sgzamrbmj1fday15szf7f2279s8-nix-2.34.7/bin/nix --extra-experimental-features nix-command --extra-experimental-features flakes --log-format internal-json run .#packages.x86_64-linux.nix-ci-check-gammaloop-nextest-core --print-build-logs
22.66 s
22.75 s
Downloading cached gammaloop-nextest-binaries-core-gammaloop-tracing-filter from https://cache.nix-ci.com
22.75 s
Downloading cached gammaloop-nextest-binaries-core-gammalooprs from https://cache.nix-ci.com
22.75 s
Downloading cached gammaloop-nextest-binaries-core-gammaloop-api from https://cache.nix-ci.com
22.75 s
Downloading cached gammaloop-nextest-binaries-core-gammaloop-tracing-filter-macros from https://cache.nix-ci.com
22.75 s
Downloading cached gammaloop-nextest-binaries-core-three-dimensional-reps from https://cache.nix-ci.com
22.87 s
Downloaded cached gammaloop-nextest-binaries-core-gammaloop-tracing-filter-macros (1.7 MiB) in 122ms
22.88 s
Progress: 0 of 1 built, 1 of 7 downloaded from cache (4 downloading)
23.22 s
Downloaded cached gammaloop-nextest-binaries-core-gammaloop-tracing-filter (8.1 MiB) in 471ms
23.22 s
Progress: 0 of 1 built, 2 of 7 downloaded from cache (3 downloading)
23.29 s
Downloaded cached gammaloop-nextest-binaries-core-three-dimensional-reps (9.5 MiB) in 538ms
23.29 s
Progress: 0 of 1 built, 3 of 7 downloaded from cache (2 downloading)
25.23 s
Downloaded cached gammaloop-nextest-binaries-core-gammalooprs (88.1 MiB) in 2.4s
25.23 s
Progress: 0 of 1 built, 4 of 7 downloaded from cache (1 downloading)
25.67 s
Downloaded cached gammaloop-nextest-binaries-core-gammaloop-api (120.8 MiB) in 2.9s
25.67 s
Progress: 0 of 1 built, 5 of 7 downloaded from cache
25.67 s
Downloading cached gammaloop-nextest-binaries-core from https://cache.nix-ci.com
25.69 s
Downloaded cached gammaloop-nextest-binaries-core (2032 B) in 15ms
25.69 s
Progress: 0 of 1 built, 6 of 7 downloaded from cache
25.69 s
Downloading cached nix-ci-check-gammaloop-nextest-core from https://cache.nix-ci.com
25.70 s
Downloaded cached nix-ci-check-gammaloop-nextest-core (1016 B) in 14ms
25.70 s
Progress: 0 of 1 built, 7 of 7 downloaded from cache
37.09 s
evaluating derivation 'g
copying '/nix/store/x0yg
evaluating derivation 'g
copying '/nix/store/x0yg
evaluating derivation 'g
copying '/nix/store/x0yg
evaluating derivation 'g
copying '/nix/store/x0yg
evaluating derivation 'g
copying '/nix/store/x0yg
evaluating derivation 'g
copying '/nix/store/x0yg
evaluating derivation 'g
copying '/nix/store/x0yg
evaluating derivation 'g
copying '/nix/store/x0yg
evaluating derivation 'g
copying '/nix/store/x0yg
evaluating derivation 'g
copying '/nix/store/x0yg
evaluating derivation 'g
copying '/nix/store/x0yg
evaluating derivation 'g
copying '/nix/store/x0yg
evaluating derivation 'g
copying '/nix/store/x0yg
evaluating derivation 'g
querying gammaloop-nexte
[0.0 KiB DL] querying in
[0 /2 built, 1 /0 /1 copied
[0 /1 built, 1 copied (4.
[1 /0 /1 built, 1 copied (gammaloop-nextest-core> Extracting 4 binaries (including 1 non-test binary), 1 build script output directory, and 2 linked paths to /build/nextest-archive-2OhNnv
38.40 s
gammaloop-nextest-core> Extracted 20 files to /build/nextest-archive-2OhNnv in 1.31s
38.43 s
gammaloop-nextest-core> ------------
38.43 s
gammaloop-nextest-core> Nextest run ID 1288ae85-1797-4889-88bb-9ca0050c8937 with nextest profile: ci_gammaloop
38.43 s
gammaloop-nextest-core> Starting 379 tests across 3 binaries
41.16 s
gammaloop-nextest-core> ------------
41.16 s
gammaloop-nextest-core> Summary [ 2.729s] 379 tests run: 379 passed , 0 skipped
41.52 s
gammaloop-nextest-core>
41.52 s
gammaloop-nextest-core> ========== nextest test summary ==========
41.52 s
gammaloop-nextest-core> report: target/nextest/ci_gammaloop/junit.xml
41.52 s
gammaloop-nextest-core> tests: 379, failures: 0, errors: 0
41.52 s
gammaloop-nextest-core> No failing testcases found.
41.52 s
gammaloop-nextest-core> =========================================
41.55 s
gammaloop-nextest-core> Extracting 1 binary and 1 linked path to /build/nextest-archive-P5iH91
41.68 s
gammaloop-nextest-core> Extracted 7 files to /build/nextest-archive-P5iH91 in 0.13s
41.73 s
gammaloop-nextest-core> ------------
41.73 s
gammaloop-nextest-core> Nextest run ID 741c1a15-b0d8-41aa-b1af-61220563655a with nextest profile: ci_gammaloop
41.73 s
gammaloop-nextest-core> Starting 19 tests across 1 binary
41.77 s
gammaloop-nextest-core> ------------
41.77 s
gammaloop-nextest-core> Summary [ 0.044s] 19 tests run: 19 passed , 0 skipped
41.86 s
gammaloop-nextest-core>
41.86 s
gammaloop-nextest-core> ========== nextest test summary ==========
41.86 s
gammaloop-nextest-core> report: target/nextest/ci_gammaloop/junit.xml
41.86 s
gammaloop-nextest-core> tests: 19, failures: 0, errors: 0
41.86 s
gammaloop-nextest-core> No failing testcases found.
41.86 s
gammaloop-nextest-core> =========================================
41.90 s
gammaloop-nextest-core> Extracting 1 binary to /build/nextest-archive-4SeeZe
41.96 s
gammaloop-nextest-core> Extracted 4 files to /build/nextest-archive-4SeeZe in 0.07s
41.99 s
gammaloop-nextest-core> ------------
41.99 s
gammaloop-nextest-core> Nextest run ID 9aa58c94-476a-4985-b916-ca24398ddeac with nextest profile: ci_gammaloop
41.99 s
gammaloop-nextest-core> Starting 0 tests across 1 binary
41.99 s
gammaloop-nextest-core> ------------
41.99 s
gammaloop-nextest-core> Summary [ 0.000s] 0 tests run: 0 passed , 0 skipped
42.06 s
gammaloop-nextest-core>
42.06 s
gammaloop-nextest-core> ========== nextest test summary ==========
42.06 s
gammaloop-nextest-core> report: target/nextest/ci_gammaloop/junit.xml
42.06 s
gammaloop-nextest-core> tests: 0, failures: 0, errors: 0
42.06 s
gammaloop-nextest-core> No failing testcases found.
42.06 s
gammaloop-nextest-core> =========================================
42.11 s
gammaloop-nextest-core> Extracting 4 binaries, 1 build script output directory, and 2 linked paths to /build/nextest-archive-4gwN96
43.24 s
gammaloop-nextest-core> Extracted 18 files to /build/nextest-archive-4gwN96 in 1.14s
43.32 s
gammaloop-nextest-core> ------------
43.32 s
gammaloop-nextest-core> Nextest run ID 59ea2498-50ab-472b-9371-ce3bd2b15c69 with nextest profile: ci_gammaloop
43.32 s
gammaloop-nextest-core> Starting 705 tests across 4 binaries (60 tests skipped , including 59 tests via profile.ci_gammaloop.default-filter )
61.22 s
gammaloop-nextest-core> FAIL [ 8.318s] (700/705) gammalooprs::test_renormalization finite_part_ghost_2loop
61.22 s
gammaloop-nextest-core> stdout ---
61.22 s
gammaloop-nextest-core>
61.22 s
gammaloop-nextest-core> running 1 test
61.22 s
gammaloop-nextest-core> test finite_part_ghost_2loop ... FAILED
61.22 s
gammaloop-nextest-core>
61.22 s
gammaloop-nextest-core> failures:
61.22 s
gammaloop-nextest-core>
61.22 s
gammaloop-nextest-core> failures:
61.22 s
gammaloop-nextest-core> finite_part_ghost_2loop
61.22 s
gammaloop-nextest-core>
61.22 s
gammaloop-nextest-core> test result: FAILED. 0 passed; 1 failed; 0 ignored; 0 measured; 6 filtered out; finished in 8.30s
61.22 s
gammaloop-nextest-core>
61.22 s
gammaloop-nextest-core> stderr ---
61.22 s
gammaloop-nextest-core> The application panicked (crashed).
61.22 s
gammaloop-nextest-core> Message: assertion failed: (align_to_rqft(&a, &model) - expected).expand().is_zero()
61.22 s
gammaloop-nextest-core> Location: crates/gammalooprs/tests/test_renormalization.rs :583
61.22 s
gammaloop-nextest-core>
61.22 s
gammaloop-nextest-core> ━━━━━━━━━━━━━━━━━━━━━━━━━━━━━━━━━━ BACKTRACE ━━━━━━━━━━━━━━━━━━━━━━━━━━━━━━━━━━━
61.22 s
gammaloop-nextest-core> 1: <color_eyre[51793ea62743adbd]::config::PanicHook>::panic_report <unknown>
61.22 s
gammaloop-nextest-core> at <unknown source file> :<unknown line>
61.22 s
gammaloop-nextest-core> 2: <color_eyre[51793ea62743adbd]::config::PanicHook>::into_panic_hook::{closure#0} <unknown>
61.22 s
gammaloop-nextest-core> at <unknown source file> :<unknown line>
61.22 s
gammaloop-nextest-core> 3: std[bcb96dfbba0ab899]::panicking::panic_with_hook <unknown>
61.22 s
gammaloop-nextest-core> at <unknown source file> :<unknown line>
61.22 s
gammaloop-nextest-core> 4: std[bcb96dfbba0ab899]::panicking::panic_handler::{closure#0} <unknown>
61.22 s
gammaloop-nextest-core> at <unknown source file> :<unknown line>
61.22 s
gammaloop-nextest-core> 5: std[bcb96dfbba0ab899]::sys::backtrace::__rust_end_short_backtrace::<std[bcb96dfbba0ab899]::panicking::panic_handler::{closure#0}, !> <unknown>
61.22 s
gammaloop-nextest-core> at <unknown source file> :<unknown line>
61.22 s
gammaloop-nextest-core> 6: __rustc[6c289b9f9c454d21]::rust_begin_unwind <unknown>
61.22 s
gammaloop-nextest-core> at <unknown source file> :<unknown line>
61.22 s
gammaloop-nextest-core> 7: core[940e698046960fd5]::panicking::panic_fmt <unknown>
61.22 s
gammaloop-nextest-core> at <unknown source file> :<unknown line>
61.22 s
gammaloop-nextest-core> 8: core[940e698046960fd5]::panicking::panic <unknown>
61.22 s
gammaloop-nextest-core> at <unknown source file> :<unknown line>
61.22 s
gammaloop-nextest-core> 9: <test_renormalization[5812939ef1a04d89]::finite_part_ghost_2loop::{closure#0} as core[940e698046960fd5]::ops::function::FnOnce<()>>::call_once <unknown>
61.22 s
gammaloop-nextest-core> at <unknown source file> :<unknown line>
61.22 s
gammaloop-nextest-core> 10: test[75d6903177b1d7e9]::__rust_begin_short_backtrace::<core[940e698046960fd5]::result::Result<(), alloc[2ea6bcb46fca0c42]::string::String>, fn() -> core[940e698046960fd5]::result::Result<(), alloc[2ea6bcb46fca0c42]::string::String>> <unknown>
61.22 s
gammaloop-nextest-core> at <unknown source file> :<unknown line>
61.22 s
gammaloop-nextest-core> 11: test[75d6903177b1d7e9]::run_test::{closure#0} <unknown>
61.22 s
gammaloop-nextest-core> at <unknown source file> :<unknown line>
61.22 s
gammaloop-nextest-core> 12: std[bcb96dfbba0ab899]::sys::backtrace::__rust_begin_short_backtrace::<test[75d6903177b1d7e9]::run_test::{closure#1}, ()> <unknown>
61.22 s
gammaloop-nextest-core> at <unknown source file> :<unknown line>
61.22 s
gammaloop-nextest-core> 13: <std[bcb96dfbba0ab899]::thread::lifecycle::spawn_unchecked<test[75d6903177b1d7e9]::run_test::{closure#1}, ()>::{closure#1} as core[940e698046960fd5]::ops::function::FnOnce<()>>::call_once::{shim:vtable#0} <unknown>
61.22 s
gammaloop-nextest-core> at <unknown source file> :<unknown line>
61.22 s
gammaloop-nextest-core> 14: <std[bcb96dfbba0ab899]::sys::thread::unix::Thread>::new::thread_start <unknown>
61.22 s
gammaloop-nextest-core> at <unknown source file> :<unknown line>
61.22 s
gammaloop-nextest-core> 15: start_thread <unknown>
61.22 s
gammaloop-nextest-core> at <unknown source file> :<unknown line>
61.22 s
gammaloop-nextest-core> 16: __clone3 <unknown>
61.22 s
gammaloop-nextest-core> at <unknown source file> :<unknown line>
61.22 s
gammaloop-nextest-core>
61.22 s
gammaloop-nextest-core> Run with COLORBT_SHOW_HIDDEN=1 environment variable to disable frame filtering.
61.22 s
gammaloop-nextest-core> Run with RUST_BACKTRACE=full to include source snippets.
61.22 s
gammaloop-nextest-core>
69.62 s
gammaloop-nextest-core> ------------
69.62 s
gammaloop-nextest-core> Summary [ 26.296s] 705 tests run: 704 passed , 1 failed , 60 skipped
69.62 s
gammaloop-nextest-core> FAIL [ 8.318s] (700/705) gammalooprs::test_renormalization finite_part_ghost_2loop
69.62 s
gammaloop-nextest-core> stdout ---
69.62 s
gammaloop-nextest-core>
69.62 s
gammaloop-nextest-core> running 1 test
69.62 s
gammaloop-nextest-core> test finite_part_ghost_2loop ... FAILED
69.62 s
gammaloop-nextest-core>
69.62 s
gammaloop-nextest-core> failures:
69.62 s
gammaloop-nextest-core>
69.62 s
gammaloop-nextest-core> failures:
69.62 s
gammaloop-nextest-core> finite_part_ghost_2loop
69.62 s
gammaloop-nextest-core>
69.62 s
gammaloop-nextest-core> test result: FAILED. 0 passed; 1 failed; 0 ignored; 0 measured; 6 filtered out; finished in 8.30s
69.62 s
gammaloop-nextest-core>
69.62 s
gammaloop-nextest-core> stderr ---
69.62 s
gammaloop-nextest-core> The application panicked (crashed).
69.62 s
gammaloop-nextest-core> Message: assertion failed: (align_to_rqft(&a, &model) - expected).expand().is_zero()
69.62 s
gammaloop-nextest-core> Location: crates/gammalooprs/tests/test_renormalization.rs :583
69.62 s
gammaloop-nextest-core>
69.62 s
gammaloop-nextest-core> ━━━━━━━━━━━━━━━━━━━━━━━━━━━━━━━━━━ BACKTRACE ━━━━━━━━━━━━━━━━━━━━━━━━━━━━━━━━━━━
69.62 s
gammaloop-nextest-core> 1: <color_eyre[51793ea62743adbd]::config::PanicHook>::panic_report <unknown>
69.62 s
gammaloop-nextest-core> at <unknown source file> :<unknown line>
69.62 s
gammaloop-nextest-core> 2: <color_eyre[51793ea62743adbd]::config::PanicHook>::into_panic_hook::{closure#0} <unknown>
69.62 s
gammaloop-nextest-core> at <unknown source file> :<unknown line>
69.62 s
gammaloop-nextest-core> 3: std[bcb96dfbba0ab899]::panicking::panic_with_hook <unknown>
69.62 s
gammaloop-nextest-core> at <unknown source file> :<unknown line>
69.62 s
gammaloop-nextest-core> 4: std[bcb96dfbba0ab899]::panicking::panic_handler::{closure#0} <unknown>
69.62 s
gammaloop-nextest-core> at <unknown source file> :<unknown line>
69.62 s
gammaloop-nextest-core> 5: std[bcb96dfbba0ab899]::sys::backtrace::__rust_end_short_backtrace::<std[bcb96dfbba0ab899]::panicking::panic_handler::{closure#0}, !> <unknown>
69.62 s
gammaloop-nextest-core> at <unknown source file> :<unknown line>
69.62 s
gammaloop-nextest-core> 6: __rustc[6c289b9f9c454d21]::rust_begin_unwind <unknown>
69.62 s
gammaloop-nextest-core> at <unknown source file> :<unknown line>
69.62 s
gammaloop-nextest-core> 7: core[940e698046960fd5]::panicking::panic_fmt <unknown>
69.62 s
gammaloop-nextest-core> at <unknown source file> :<unknown line>
69.62 s
gammaloop-nextest-core> 8: core[940e698046960fd5]::panicking::panic <unknown>
69.62 s
gammaloop-nextest-core> at <unknown source file> :<unknown line>
69.62 s
gammaloop-nextest-core> 9: <test_renormalization[5812939ef1a04d89]::finite_part_ghost_2loop::{closure#0} as core[940e698046960fd5]::ops::function::FnOnce<()>>::call_once <unknown>
69.62 s
gammaloop-nextest-core> at <unknown source file> :<unknown line>
69.62 s
gammaloop-nextest-core> 10: test[75d6903177b1d7e9]::__rust_begin_short_backtrace::<core[940e698046960fd5]::result::Result<(), alloc[2ea6bcb46fca0c42]::string::String>, fn() -> core[940e698046960fd5]::result::Result<(), alloc[2ea6bcb46fca0c42]::string::String>> <unknown>
69.62 s
gammaloop-nextest-core> at <unknown source file> :<unknown line>
69.62 s
gammaloop-nextest-core> 11: test[75d6903177b1d7e9]::run_test::{closure#0} <unknown>
69.62 s
gammaloop-nextest-core> at <unknown source file> :<unknown line>
69.62 s
gammaloop-nextest-core> 12: std[bcb96dfbba0ab899]::sys::backtrace::__rust_begin_short_backtrace::<test[75d6903177b1d7e9]::run_test::{closure#1}, ()> <unknown>
69.62 s
gammaloop-nextest-core> at <unknown source file> :<unknown line>
69.62 s
gammaloop-nextest-core> 13: <std[bcb96dfbba0ab899]::thread::lifecycle::spawn_unchecked<test[75d6903177b1d7e9]::run_test::{closure#1}, ()>::{closure#1} as core[940e698046960fd5]::ops::function::FnOnce<()>>::call_once::{shim:vtable#0} <unknown>
69.62 s
gammaloop-nextest-core> at <unknown source file> :<unknown line>
69.62 s
gammaloop-nextest-core> 14: <std[bcb96dfbba0ab899]::sys::thread::unix::Thread>::new::thread_start <unknown>
69.62 s
gammaloop-nextest-core> at <unknown source file> :<unknown line>
69.62 s
gammaloop-nextest-core> 15: start_thread <unknown>
69.62 s
gammaloop-nextest-core> at <unknown source file> :<unknown line>
69.62 s
gammaloop-nextest-core> 16: __clone3 <unknown>
69.62 s
gammaloop-nextest-core> at <unknown source file> :<unknown line>
69.62 s
gammaloop-nextest-core>
69.62 s
gammaloop-nextest-core> Run with COLORBT_SHOW_HIDDEN=1 environment variable to disable frame filtering.
69.62 s
gammaloop-nextest-core> Run with RUST_BACKTRACE=full to include source snippets.
69.62 s
gammaloop-nextest-core>
69.76 s
gammaloop-nextest-core> error : test run failed
69.81 s
gammaloop-nextest-core>
69.81 s
gammaloop-nextest-core> ========== nextest test summary ==========
69.81 s
gammaloop-nextest-core> report: target/nextest/ci_gammaloop/junit.xml
69.81 s
gammaloop-nextest-core> tests: 705, failures: 1, errors: 0
69.81 s
gammaloop-nextest-core>
69.81 s
gammaloop-nextest-core> 1. gammalooprs::test_renormalization::finite_part_ghost_2loop
69.81 s
gammaloop-nextest-core> failure: test failure with exit code 101
69.81 s
gammaloop-nextest-core> system-out
69.81 s
gammaloop-nextest-core> running 1 test
69.81 s
gammaloop-nextest-core> test finite_part_ghost_2loop ... FAILED
69.81 s
gammaloop-nextest-core>
69.81 s
gammaloop-nextest-core> failures:
69.81 s
gammaloop-nextest-core>
69.81 s
gammaloop-nextest-core> failures:
69.81 s
gammaloop-nextest-core> finite_part_ghost_2loop
69.81 s
gammaloop-nextest-core>
69.81 s
gammaloop-nextest-core> test result: FAILED. 0 passed; 1 failed; 0 ignored; 0 measured; 6 filtered out; finished in 8.30s
69.81 s
gammaloop-nextest-core> system-err
69.81 s
gammaloop-nextest-core> The application panicked (crashed).
69.81 s
gammaloop-nextest-core> Message: assertion failed: (align_to_rqft(&a, &model) - expected).expand().is_zero()
69.81 s
gammaloop-nextest-core> Location: crates/gammalooprs/tests/test_renormalization.rs:583
69.81 s
gammaloop-nextest-core>
69.81 s
gammaloop-nextest-core> ━━━━━━━━━━━━━━━━━━━━━━━━━━━━━━━━━━ BACKTRACE ━━━━━━━━━━━━━━━━━━━━━━━━━━━━━━━━━━━
69.81 s
gammaloop-nextest-core> 1: <color_eyre[51793ea62743adbd]::config::PanicHook>::panic_report<unknown>
69.81 s
gammaloop-nextest-core> at <unknown source file>:<unknown line>
69.81 s
gammaloop-nextest-core> 2: <color_eyre[51793ea62743adbd]::config::PanicHook>::into_panic_hook::{closure#0}<unknown>
69.81 s
gammaloop-nextest-core> at <unknown source file>:<unknown line>
69.81 s
gammaloop-nextest-core> 3: std[bcb96dfbba0ab899]::panicking::panic_with_hook<unknown>
69.81 s
gammaloop-nextest-core> at <unknown source file>:<unknown line>
69.81 s
gammaloop-nextest-core> 4: std[bcb96dfbba0ab899]::panicking::panic_handler::{closure#0}<unknown>
69.81 s
gammaloop-nextest-core> at <unknown source file>:<unknown line>
69.81 s
gammaloop-nextest-core> 5: std[bcb96dfbba0ab899]::sys::backtrace::__rust_end_short_backtrace::<std[bcb96dfbba0ab899]::panicking::panic_handler::{closure#0}, !><unknown>
69.81 s
gammaloop-nextest-core> at <unknown source file>:<unknown line>
69.81 s
gammaloop-nextest-core> 6: __rustc[6c289b9f9c454d21]::rust_begin_unwind<unknown>
69.81 s
gammaloop-nextest-core> at <unknown source file>:<unknown line>
69.81 s
gammaloop-nextest-core> 7: core[940e698046960fd5]::panicking::panic_fmt<unknown>
69.81 s
gammaloop-nextest-core> at <unknown source file>:<unknown line>
69.81 s
gammaloop-nextest-core> 8: core[940e698046960fd5]::panicking::panic<unknown>
69.81 s
gammaloop-nextest-core> at <unknown source file>:<unknown line>
69.81 s
gammaloop-nextest-core> 9: <test_renormalization[5812939ef1a04d89]::finite_part_ghost_2loop::{closure#0} as core[940e698046960fd5]::ops::function::FnOnce<()>>::call_once<unknown>
69.81 s
gammaloop-nextest-core> at <unknown source file>:<unknown line>
69.81 s
gammaloop-nextest-core> 10: test[75d6903177b1d7e9]::__rust_begin_short_backtrace::<core[940e698046960fd5]::result::Result<(), alloc[2ea6bcb46fca0c42]::string::String>, fn() -> core[940e698046960fd5]::result::Result<(), alloc[2ea6bcb46fca0c42]::string::String>><unknown>
69.81 s
gammaloop-nextest-core> at <unknown source file>:<unknown line>
69.81 s
gammaloop-nextest-core> 11: test[75d6903177b1d7e9]::run_test::{closure#0}<unknown>
69.81 s
gammaloop-nextest-core> at <unknown source file>:<unknown line>
69.81 s
gammaloop-nextest-core> 12: std[bcb96dfbba0ab899]::sys::backtrace::__rust_begin_short_backtrace::<test[75d6903177b1d7e9]::run_test::{closure#1}, ()><unknown>
69.81 s
gammaloop-nextest-core> at <unknown source file>:<unknown line>
69.81 s
gammaloop-nextest-core> 13: <std[bcb96dfbba0ab899]::thread::lifecycle::spawn_unchecked<test[75d6903177b1d7e9]::run_test::{closure#1}, ()>::{closure#1} as core[940e698046960fd5]::ops::function::FnOnce<()>>::call_once::{shim:vtable#0}<unknown>
69.81 s
gammaloop-nextest-core> at <unknown source file>:<unknown line>
69.81 s
gammaloop-nextest-core> 14: <std[bcb96dfbba0ab899]::sys::thread::unix::Thread>::new::thread_start<unknown>
69.81 s
gammaloop-nextest-core> at <unknown source file>:<unknown line>
69.81 s
gammaloop-nextest-core> 15: start_thread<unknown>
69.81 s
gammaloop-nextest-core> at <unknown source file>:<unknown line>
69.81 s
gammaloop-nextest-core> 16: __clone3<unknown>
69.81 s
gammaloop-nextest-core> at <unknown source file>:<unknown line>
69.81 s
gammaloop-nextest-core>
69.81 s
gammaloop-nextest-core> Run with COLORBT_SHOW_HIDDEN=1 environment variable to disable frame filtering.
69.81 s
gammaloop-nextest-core> Run with RUST_BACKTRACE=full to include source snippets.
69.81 s
gammaloop-nextest-core> =========================================
69.84 s
gammaloop-nextest-core> Extracting 1 binary, 1 build script output directory, and 1 linked path to /build/nextest-archive-fgsdQZ
69.96 s
gammaloop-nextest-core> Extracted 7 files to /build/nextest-archive-fgsdQZ in 0.12s
69.98 s
gammaloop-nextest-core> ------------
69.98 s
gammaloop-nextest-core> Nextest run ID 09d8fe89-f857-474a-a161-fdc308025c9b with nextest profile: ci_gammaloop
69.98 s
gammaloop-nextest-core> Starting 105 tests across 1 binary
100.11 s
gammaloop-nextest-core> ------------
100.11 s
gammaloop-nextest-core> Summary [ 30.134s] 105 tests run: 105 passed , 0 skipped
100.21 s
gammaloop-nextest-core>
100.21 s
gammaloop-nextest-core> ========== nextest test summary ==========
100.21 s
gammaloop-nextest-core> report: target/nextest/ci_gammaloop/junit.xml
100.21 s
gammaloop-nextest-core> tests: 105, failures: 0, errors: 0
100.21 s
gammaloop-nextest-core> No failing testcases found.
100.21 s
gammaloop-nextest-core> =========================================
100.35 s
[0 built (1 failed ), 1 cerror: Cannot build '/nix/store/n72shhl1iwhd9py98qq4wh1bk34sp0c7-gammaloop-nextest-core.drv '.
100.35 s
Reason: builder failed with exit code 100 .
100.35 s
Output paths:
100.35 s
/nix/store/ljgp57j9jy604x9j7hdfrvcsdl1bz568-gammaloop-nextest-core
100.35 s
Last 229 log lines:
100.35 s
> Extracting 4 binaries (including 1 non-test binary), 1 build script output directory, and 2 linked paths to /build/nextest-archive-2OhNnv
100.35 s
> Extracted 20 files to /build/nextest-archive-2OhNnv in 1.31s
100.35 s
> ------------
100.35 s
> Nextest run ID 1288ae85-1797-4889-88bb-9ca0050c8937 with nextest profile: ci_gammaloop
100.35 s
> Starting 379 tests across 3 binaries
100.35 s
> ------------
100.35 s
> Summary [ 2.729s] 379 tests run: 379 passed , 0 skipped
100.35 s
>
100.35 s
> ========== nextest test summary ==========
100.35 s
> report: target/nextest/ci_gammaloop/junit.xml
100.35 s
> tests: 379, failures: 0, errors: 0
100.35 s
> No failing testcases found.
100.35 s
> =========================================
100.35 s
> Extracting 1 binary and 1 linked path to /build/nextest-archive-P5iH91
100.35 s
> Extracted 7 files to /build/nextest-archive-P5iH91 in 0.13s
100.35 s
> ------------
100.35 s
> Nextest run ID 741c1a15-b0d8-41aa-b1af-61220563655a with nextest profile: ci_gammaloop
100.35 s
> Starting 19 tests across 1 binary
100.35 s
> ------------
100.35 s
> Summary [ 0.044s] 19 tests run: 19 passed , 0 skipped
100.35 s
>
100.35 s
> ========== nextest test summary ==========
100.35 s
> report: target/nextest/ci_gammaloop/junit.xml
100.35 s
> tests: 19, failures: 0, errors: 0
100.35 s
> No failing testcases found.
100.35 s
> =========================================
100.35 s
> Extracting 1 binary to /build/nextest-archive-4SeeZe
100.35 s
> Extracted 4 files to /build/nextest-archive-4SeeZe in 0.07s
100.35 s
> ------------
100.35 s
> Nextest run ID 9aa58c94-476a-4985-b916-ca24398ddeac with nextest profile: ci_gammaloop
100.35 s
> Starting 0 tests across 1 binary
100.35 s
> ------------
100.35 s
> Summary [ 0.000s] 0 tests run: 0 passed , 0 skipped
100.35 s
>
100.35 s
> ========== nextest test summary ==========
100.35 s
> report: target/nextest/ci_gammaloop/junit.xml
100.35 s
> tests: 0, failures: 0, errors: 0
100.35 s
> No failing testcases found.
100.35 s
> =========================================
100.35 s
> Extracting 4 binaries, 1 build script output directory, and 2 linked paths to /build/nextest-archive-4gwN96
100.35 s
> Extracted 18 files to /build/nextest-archive-4gwN96 in 1.14s
100.35 s
> ------------
100.35 s
> Nextest run ID 59ea2498-50ab-472b-9371-ce3bd2b15c69 with nextest profile: ci_gammaloop
100.35 s
> Starting 705 tests across 4 binaries (60 tests skipped , including 59 tests via profile.ci_gammaloop.default-filter )
100.35 s
> FAIL [ 8.318s] (700/705) gammalooprs::test_renormalization finite_part_ghost_2loop
100.35 s
> stdout ---
100.35 s
>
100.35 s
> running 1 test
100.35 s
> test finite_part_ghost_2loop ... FAILED
100.35 s
>
100.35 s
> failures:
100.35 s
>
100.35 s
> failures:
100.35 s
> finite_part_ghost_2loop
100.35 s
>
100.35 s
> test result: FAILED. 0 passed; 1 failed; 0 ignored; 0 measured; 6 filtered out; finished in 8.30s
100.35 s
>
100.35 s
> stderr ---
100.35 s
> The application panicked (crashed).
100.35 s
> Message: assertion failed: (align_to_rqft(&a, &model) - expected).expand().is_zero()
100.35 s
> Location: crates/gammalooprs/tests/test_renormalization.rs :583
100.35 s
>
100.35 s
> ━━━━━━━━━━━━━━━━━━━━━━━━━━━━━━━━━━ BACKTRACE ━━━━━━━━━━━━━━━━━━━━━━━━━━━━━━━━━━━
100.35 s
> 1: <color_eyre[51793ea62743adbd]::config::PanicHook>::panic_report <unknown>
100.35 s
> at <unknown source file> :<unknown line>
100.35 s
> 2: <color_eyre[51793ea62743adbd]::config::PanicHook>::into_panic_hook::{closure#0} <unknown>
100.35 s
> at <unknown source file> :<unknown line>
100.35 s
> 3: std[bcb96dfbba0ab899]::panicking::panic_with_hook <unknown>
100.35 s
> at <unknown source file> :<unknown line>
100.35 s
> 4: std[bcb96dfbba0ab899]::panicking::panic_handler::{closure#0} <unknown>
100.35 s
> at <unknown source file> :<unknown line>
100.35 s
> 5: std[bcb96dfbba0ab899]::sys::backtrace::__rust_end_short_backtrace::<std[bcb96dfbba0ab899]::panicking::panic_handler::{closure#0}, !> <unknown>
100.35 s
> at <unknown source file> :<unknown line>
100.35 s
> 6: __rustc[6c289b9f9c454d21]::rust_begin_unwind <unknown>
100.35 s
> at <unknown source file> :<unknown line>
100.35 s
> 7: core[940e698046960fd5]::panicking::panic_fmt <unknown>
100.35 s
> at <unknown source file> :<unknown line>
100.35 s
> 8: core[940e698046960fd5]::panicking::panic <unknown>
100.35 s
> at <unknown source file> :<unknown line>
100.35 s
> 9: <test_renormalization[5812939ef1a04d89]::finite_part_ghost_2loop::{closure#0} as core[940e698046960fd5]::ops::function::FnOnce<()>>::call_once <unknown>
100.35 s
> at <unknown source file> :<unknown line>
100.35 s
> 10: test[75d6903177b1d7e9]::__rust_begin_short_backtrace::<core[940e698046960fd5]::result::Result<(), alloc[2ea6bcb46fca0c42]::string::String>, fn() -> core[940e698046960fd5]::result::Result<(), alloc[2ea6bcb46fca0c42]::string::String>> <unknown>
100.35 s
> at <unknown source file> :<unknown line>
100.35 s
> 11: test[75d6903177b1d7e9]::run_test::{closure#0} <unknown>
100.35 s
> at <unknown source file> :<unknown line>
100.35 s
> 12: std[bcb96dfbba0ab899]::sys::backtrace::__rust_begin_short_backtrace::<test[75d6903177b1d7e9]::run_test::{closure#1}, ()> <unknown>
100.35 s
> at <unknown source file> :<unknown line>
100.35 s
> 13: <std[bcb96dfbba0ab899]::thread::lifecycle::spawn_unchecked<test[75d6903177b1d7e9]::run_test::{closure#1}, ()>::{closure#1} as core[940e698046960fd5]::ops::function::FnOnce<()>>::call_once::{shim:vtable#0} <unknown>
100.35 s
> at <unknown source file> :<unknown line>
100.35 s
> 14: <std[bcb96dfbba0ab899]::sys::thread::unix::Thread>::new::thread_start <unknown>
100.35 s
> at <unknown source file> :<unknown line>
100.35 s
> 15: start_thread <unknown>
100.35 s
> at <unknown source file> :<unknown line>
100.35 s
> 16: __clone3 <unknown>
100.35 s
> at <unknown source file> :<unknown line>
100.35 s
>
100.35 s
> Run with COLORBT_SHOW_HIDDEN=1 environment variable to disable frame filtering.
100.35 s
> Run with RUST_BACKTRACE=full to include source snippets.
100.35 s
>
100.35 s
> ------------
100.35 s
> Summary [ 26.296s] 705 tests run: 704 passed , 1 failed , 60 skipped
100.35 s
> FAIL [ 8.318s] (700/705) gammalooprs::test_renormalization finite_part_ghost_2loop
100.35 s
> stdout ---
100.35 s
>
100.35 s
> running 1 test
100.35 s
> test finite_part_ghost_2loop ... FAILED
100.35 s
>
100.35 s
> failures:
100.35 s
>
100.35 s
> failures:
100.35 s
> finite_part_ghost_2loop
100.35 s
>
100.35 s
> test result: FAILED. 0 passed; 1 failed; 0 ignored; 0 measured; 6 filtered out; finished in 8.30s
100.35 s
>
100.35 s
> stderr ---
100.35 s
> The application panicked (crashed).
100.35 s
> Message: assertion failed: (align_to_rqft(&a, &model) - expected).expand().is_zero()
100.35 s
> Location: crates/gammalooprs/tests/test_renormalization.rs :583
100.35 s
>
100.35 s
> ━━━━━━━━━━━━━━━━━━━━━━━━━━━━━━━━━━ BACKTRACE ━━━━━━━━━━━━━━━━━━━━━━━━━━━━━━━━━━━
100.35 s
> 1: <color_eyre[51793ea62743adbd]::config::PanicHook>::panic_report <unknown>
100.35 s
> at <unknown source file> :<unknown line>
100.35 s
> 2: <color_eyre[51793ea62743adbd]::config::PanicHook>::into_panic_hook::{closure#0} <unknown>
100.35 s
> at <unknown source file> :<unknown line>
100.35 s
> 3: std[bcb96dfbba0ab899]::panicking::panic_with_hook <unknown>
100.35 s
> at <unknown source file> :<unknown line>
100.35 s
> 4: std[bcb96dfbba0ab899]::panicking::panic_handler::{closure#0} <unknown>
100.35 s
> at <unknown source file> :<unknown line>
100.35 s
> 5: std[bcb96dfbba0ab899]::sys::backtrace::__rust_end_short_backtrace::<std[bcb96dfbba0ab899]::panicking::panic_handler::{closure#0}, !> <unknown>
100.35 s
> at <unknown source file> :<unknown line>
100.35 s
> 6: __rustc[6c289b9f9c454d21]::rust_begin_unwind <unknown>
100.35 s
> at <unknown source file> :<unknown line>
100.35 s
> 7: core[940e698046960fd5]::panicking::panic_fmt <unknown>
100.35 s
> at <unknown source file> :<unknown line>
100.35 s
> 8: core[940e698046960fd5]::panicking::panic <unknown>
100.35 s
> at <unknown source file> :<unknown line>
100.35 s
> 9: <test_renormalization[5812939ef1a04d89]::finite_part_ghost_2loop::{closure#0} as core[940e698046960fd5]::ops::function::FnOnce<()>>::call_once <unknown>
100.35 s
> at <unknown source file> :<unknown line>
100.35 s
> 10: test[75d6903177b1d7e9]::__rust_begin_short_backtrace::<core[940e698046960fd5]::result::Result<(), alloc[2ea6bcb46fca0c42]::string::String>, fn() -> core[940e698046960fd5]::result::Result<(), alloc[2ea6bcb46fca0c42]::string::String>> <unknown>
100.35 s
> at <unknown source file> :<unknown line>
100.35 s
> 11: test[75d6903177b1d7e9]::run_test::{closure#0} <unknown>
100.35 s
> at <unknown source file> :<unknown line>
100.35 s
> 12: std[bcb96dfbba0ab899]::sys::backtrace::__rust_begin_short_backtrace::<test[75d6903177b1d7e9]::run_test::{closure#1}, ()> <unknown>
100.35 s
> at <unknown source file> :<unknown line>
100.35 s
> 13: <std[bcb96dfbba0ab899]::thread::lifecycle::spawn_unchecked<test[75d6903177b1d7e9]::run_test::{closure#1}, ()>::{closure#1} as core[940e698046960fd5]::ops::function::FnOnce<()>>::call_once::{shim:vtable#0} <unknown>
100.35 s
> at <unknown source file> :<unknown line>
100.35 s
> 14: <std[bcb96dfbba0ab899]::sys::thread::unix::Thread>::new::thread_start <unknown>
100.35 s
> at <unknown source file> :<unknown line>
100.35 s
> 15: start_thread <unknown>
100.35 s
> at <unknown source file> :<unknown line>
100.35 s
> 16: __clone3 <unknown>
100.35 s
> at <unknown source file> :<unknown line>
100.35 s
>
100.35 s
> Run with COLORBT_SHOW_HIDDEN=1 environment variable to disable frame filtering.
100.35 s
> Run with RUST_BACKTRACE=full to include source snippets.
100.35 s
>
100.35 s
> error : test run failed
100.35 s
>
100.35 s
> ========== nextest test summary ==========
100.35 s
> report: target/nextest/ci_gammaloop/junit.xml
100.35 s
> tests: 705, failures: 1, errors: 0
100.35 s
>
100.35 s
> 1. gammalooprs::test_renormalization::finite_part_ghost_2loop
100.35 s
> failure: test failure with exit code 101
100.35 s
> system-out
100.35 s
> running 1 test
100.35 s
> test finite_part_ghost_2loop ... FAILED
100.35 s
>
100.35 s
> failures:
100.35 s
>
100.35 s
> failures:
100.35 s
> finite_part_ghost_2loop
100.35 s
>
100.35 s
> test result: FAILED. 0 passed; 1 failed; 0 ignored; 0 measured; 6 filtered out; finished in 8.30s
100.35 s
> system-err
100.35 s
> The application panicked (crashed).
100.35 s
> Message: assertion failed: (align_to_rqft(&a, &model) - expected).expand().is_zero()
100.35 s
> Location: crates/gammalooprs/tests/test_renormalization.rs:583
100.35 s
>
100.35 s
> ━━━━━━━━━━━━━━━━━━━━━━━━━━━━━━━━━━ BACKTRACE ━━━━━━━━━━━━━━━━━━━━━━━━━━━━━━━━━━━
100.35 s
> 1: <color_eyre[51793ea62743adbd]::config::PanicHook>::panic_report<unknown>
100.35 s
> at <unknown source file>:<unknown line>
100.35 s
> 2: <color_eyre[51793ea62743adbd]::config::PanicHook>::into_panic_hook::{closure#0}<unknown>
100.35 s
> at <unknown source file>:<unknown line>
100.35 s
> 3: std[bcb96dfbba0ab899]::panicking::panic_with_hook<unknown>
100.35 s
> at <unknown source file>:<unknown line>
100.35 s
> 4: std[bcb96dfbba0ab899]::panicking::panic_handler::{closure#0}<unknown>
100.35 s
> at <unknown source file>:<unknown line>
100.35 s
> 5: std[bcb96dfbba0ab899]::sys::backtrace::__rust_end_short_backtrace::<std[bcb96dfbba0ab899]::panicking::panic_handler::{closure#0}, !><unknown>
100.35 s
> at <unknown source file>:<unknown line>
100.35 s
> 6: __rustc[6c289b9f9c454d21]::rust_begin_unwind<unknown>
100.35 s
> at <unknown source file>:<unknown line>
100.35 s
> 7: core[940e698046960fd5]::panicking::panic_fmt<unknown>
100.35 s
> at <unknown source file>:<unknown line>
100.35 s
> 8: core[940e698046960fd5]::panicking::panic<unknown>
100.35 s
> at <unknown source file>:<unknown line>
100.35 s
> 9: <test_renormalization[5812939ef1a04d89]::finite_part_ghost_2loop::{closure#0} as core[940e698046960fd5]::ops::function::FnOnce<()>>::call_once<unknown>
100.35 s
> at <unknown source file>:<unknown line>
100.35 s
> 10: test[75d6903177b1d7e9]::__rust_begin_short_backtrace::<core[940e698046960fd5]::result::Result<(), alloc[2ea6bcb46fca0c42]::string::String>, fn() -> core[940e698046960fd5]::result::Result<(), alloc[2ea6bcb46fca0c42]::string::String>><unknown>
100.35 s
> at <unknown source file>:<unknown line>
100.35 s
> 11: test[75d6903177b1d7e9]::run_test::{closure#0}<unknown>
100.35 s
> at <unknown source file>:<unknown line>
100.35 s
> 12: std[bcb96dfbba0ab899]::sys::backtrace::__rust_begin_short_backtrace::<test[75d6903177b1d7e9]::run_test::{closure#1}, ()><unknown>
100.35 s
> at <unknown source file>:<unknown line>
100.35 s
> 13: <std[bcb96dfbba0ab899]::thread::lifecycle::spawn_unchecked<test[75d6903177b1d7e9]::run_test::{closure#1}, ()>::{closure#1} as core[940e698046960fd5]::ops::function::FnOnce<()>>::call_once::{shim:vtable#0}<unknown>
100.35 s
> at <unknown source file>:<unknown line>
100.35 s
> 14: <std[bcb96dfbba0ab899]::sys::thread::unix::Thread>::new::thread_start<unknown>
100.35 s
> at <unknown source file>:<unknown line>
100.35 s
> 15: start_thread<unknown>
100.35 s
> at <unknown source file>:<unknown line>
100.35 s
> 16: __clone3<unknown>
100.35 s
> at <unknown source file>:<unknown line>
100.35 s
>
100.35 s
> Run with COLORBT_SHOW_HIDDEN=1 environment variable to disable frame filtering.
100.35 s
> Run with RUST_BACKTRACE=full to include source snippets.
100.35 s
> =========================================
100.35 s
> Extracting 1 binary, 1 build script output directory, and 1 linked path to /build/nextest-archive-fgsdQZ
100.35 s
> Extracted 7 files to /build/nextest-archive-fgsdQZ in 0.12s
100.35 s
> ------------
100.35 s
> Nextest run ID 09d8fe89-f857-474a-a161-fdc308025c9b with nextest profile: ci_gammaloop
100.35 s
> Starting 105 tests across 1 binary
100.35 s
> ------------
100.35 s
> Summary [ 30.134s] 105 tests run: 105 passed , 0 skipped
100.35 s
>
100.35 s
> ========== nextest test summary ==========
100.35 s
> report: target/nextest/ci_gammaloop/junit.xml
100.35 s
> tests: 105, failures: 0, errors: 0
100.35 s
> No failing testcases found.
100.35 s
> =========================================
100.35 s
For full logs, run:
100.35 s
nix log /nix/store/n72shhl1iwhd9py98qq4wh1bk34sp0c7-gammaloop-nextest-core.drv
100.67 s
Run failed.