1. 0.00 s $ /nix/store/9ypz3flqsrl5xl495mm8h645gadjsxi1-coreutils-9.11/bin/timeout --kill-after=15s 7200s /nix/store/23zk8sgzamrbmj1fday15szf7f2279s8-nix-2.34.7/bin/nix --extra-experimental-features nix-command --extra-experimental-features flakes flake clone git+https://github.com/alphal00p/gammaloop --dest /tmp/nix-ci-worker/stable-pwd/repo/
  2. 0.08 s Cloning into '/tmp/nix-ci-worker/stable-pwd/repo'...
  3. 1.45 s remote: Enumerating objects: 85477, done.
  4. 1.55 s remote: Counting objects: 0% (1/8598) remote: Counting objects: 1% (86/8598) remote: Counting objects: 2% (172/8598) remote: Counting objects: 3% (258/8598) remote: Counting objects: 4% (344/8598) remote: Counting objects: 5% (430/8598) remote: Counting objects: 6% (516/8598) remote: Counting objects: 7% (602/8598) remote: Counting objects: 8% (688/8598) remote: Counting objects: 9% (774/8598) remote: Counting objects: 10% (860/8598) remote: Counting objects: 11% (946/8598) remote: Counting objects: 12% (1032/8598) remote: Counting objects: 13% (1118/8598) remote: Counting objects: 14% (1204/8598) remote: Counting objects: 15% (1290/8598) remote: Counting objects: 16% (1376/8598) remote: Counting objects: 17% (1462/8598) remote: Counting objects: 18% (1548/8598) remote: Counting objects: 19% (1634/8598) remote: Counting objects: 20% (1720/8598) remote: Counting objects: 21% (1806/8598) remote: Counting objects: 22% (1892/8598) remote: Counting objects: 23% (1978/8598) remote: Counting objects: 24% (2064/8598) remote: Counting objects: 25% (2150/8598) remote: Counting objects: 26% (2236/8598) remote: Counting objects: 27% (2322/8598) remote: Counting objects: 28% (2408/8598) remote: Counting objects: 29% (2494/8598) remote: Counting objects: 30% (2580/8598) remote: Counting objects: 31% (2666/8598) remote: Counting objects: 32% (2752/8598) remote: Counting objects: 33% (2838/8598) remote: Counting objects: 34% (2924/8598) remote: Counting objects: 35% (3010/8598) remote: Counting objects: 36% (3096/8598) remote: Counting objects: 37% (3182/8598) remote: Counting objects: 38% (3268/8598) remote: Counting objects: 39% (3354/8598) remote: Counting objects: 40% (3440/8598) remote: Counting objects: 41% (3526/8598) remote: Counting objects: 42% (3612/8598) remote: Counting objects: 43% (3698/8598) remote: Counting objects: 44% (3784/8598) remote: Counting objects: 45% (3870/8598) remote: Counting objects: 46% (3956/8598) remote: Counting objects: 47% (4042/8598) remote: Counting objects: 48% (4128/8598) remote: Counting objects: 49% (4214/8598) remote: Counting objects: 50% (4299/8598) remote: Counting objects: 51% (4385/8598) remote: Counting objects: 52% (4471/8598) remote: Counting objects: 53% (4557/8598) remote: Counting objects: 54% (4643/8598) remote: Counting objects: 55% (4729/8598) remote: Counting objects: 56% (4815/8598) remote: Counting objects: 57% (4901/8598) remote: Counting objects: 58% (4987/8598) remote: Counting objects: 59% (5073/8598) remote: Counting objects: 60% (5159/8598) remote: Counting objects: 61% (5245/8598) remote: Counting objects: 62% (5331/8598) remote: Counting objects: 63% (5417/8598) remote: Counting objects: 64% (5503/8598) remote: Counting objects: 65% (5589/8598) remote: Counting objects: 66% (5675/8598) remote: Counting objects: 67% (5761/8598) remote: Counting objects: 68% (5847/8598) remote: Counting objects: 69% (5933/8598) remote: Counting objects: 70% (6019/8598) remote: Counting objects: 71% (6105/8598) remote: Counting objects: 72% (6191/8598) remote: Counting objects: 73% (6277/8598) remote: Counting objects: 74% (6363/8598) remote: Counting objects: 75% (6449/8598) remote: Counting objects: 76% (6535/8598) remote: Counting objects: 77% (6621/8598) remote: Counting objects: 78% (6707/8598) remote: Counting objects: 79% (6793/8598) remote: Counting objects: 80% (6879/8598) remote: Counting objects: 81% (6965/8598) remote: Counting objects: 82% (7051/8598) remote: Counting objects: 83% (7137/8598) remote: Counting objects: 84% (7223/8598) remote: Counting objects: 85% (7309/8598) remote: Counting objects: 86% (7395/8598) remote: Counting objects: 87% (7481/8598) remote: Counting objects: 88% (7567/8598) remote: Counting objects: 89% (7653/8598) remote: Counting objects: 90% (7739/8598) remote: Counting objects: 91% (7825/8598) remote: Counting objects: 92% (7911/8598) remote: Counting objects: 93% (7997/8598) remote: Counting objects: 94% (8083/8598) remote: Counting objects: 95% (8169/8598) remote: Counting objects: 96% (8255/8598) remote: Counting objects: 97% (8341/8598) remote: Counting objects: 98% (8427/8598) remote: Counting objects: 99% (8513/8598) remote: Counting objects: 100% (8598/8598) remote: Counting objects: 100% (8598/8598), done.
  5. 3.26 s remote: Compressing objects: 0% (1/1723) remote: Compressing objects: 1% (18/1723) remote: Compressing objects: 2% (35/1723) remote: Compressing objects: 3% (52/1723) remote: Compressing objects: 4% (69/1723) remote: Compressing objects: 5% (87/1723) remote: Compressing objects: 6% (104/1723) remote: Compressing objects: 7% (121/1723) remote: Compressing objects: 8% (138/1723) remote: Compressing objects: 9% (156/1723) remote: Compressing objects: 9% (167/1723) remote: Compressing objects: 10% (173/1723) remote: Compressing objects: 11% (190/1723) remote: Compressing objects: 12% (207/1723) remote: Compressing objects: 13% (224/1723) remote: Compressing objects: 14% (242/1723) remote: Compressing objects: 15% (259/1723) remote: Compressing objects: 16% (276/1723) remote: Compressing objects: 17% (293/1723) remote: Compressing objects: 18% (311/1723) remote: Compressing objects: 19% (328/1723) remote: Compressing objects: 20% (345/1723) remote: Compressing objects: 21% (362/1723) remote: Compressing objects: 22% (380/1723) remote: Compressing objects: 23% (397/1723) remote: Compressing objects: 24% (414/1723) remote: Compressing objects: 25% (431/1723) remote: Compressing objects: 26% (448/1723) remote: Compressing objects: 27% (466/1723) remote: Compressing objects: 28% (483/1723) remote: Compressing objects: 29% (500/1723) remote: Compressing objects: 30% (517/1723) remote: Compressing objects: 31% (535/1723) remote: Compressing objects: 32% (552/1723) remote: Compressing objects: 33% (569/1723) remote: Compressing objects: 34% (586/1723) remote: Compressing objects: 35% (604/1723) remote: Compressing objects: 36% (621/1723) remote: Compressing objects: 37% (638/1723) remote: Compressing objects: 38% (655/1723) remote: Compressing objects: 39% (672/1723) remote: Compressing objects: 40% (690/1723) remote: Compressing objects: 41% (707/1723) remote: Compressing objects: 42% (724/1723) remote: Compressing objects: 43% (741/1723) remote: Compressing objects: 44% (759/1723) remote: Compressing objects: 45% (776/1723) remote: Compressing objects: 46% (793/1723) remote: Compressing objects: 47% (810/1723) remote: Compressing objects: 48% (828/1723) remote: Compressing objects: 49% (845/1723) remote: Compressing objects: 50% (862/1723) remote: Compressing objects: 51% (879/1723) remote: Compressing objects: 52% (896/1723) remote: Compressing objects: 53% (914/1723) remote: Compressing objects: 54% (931/1723) remote: Compressing objects: 55% (948/1723) remote: Compressing objects: 56% (965/1723) remote: Compressing objects: 57% (983/1723) remote: Compressing objects: 58% (1000/1723) remote: Compressing objects: 59% (1017/1723) remote: Compressing objects: 60% (1034/1723) remote: Compressing objects: 61% (1052/1723) remote: Compressing objects: 62% (1069/1723) remote: Compressing objects: 63% (1086/1723) remote: Compressing objects: 64% (1103/1723) remote: Compressing objects: 65% (1120/1723) remote: Compressing objects: 66% (1138/1723) remote: Compressing objects: 67% (1155/1723) remote: Compressing objects: 68% (1172/1723) remote: Compressing objects: 69% (1189/1723) remote: Compressing objects: 70% (1207/1723) remote: Compressing objects: 71% (1224/1723) remote: Compressing objects: 72% (1241/1723) remote: Compressing objects: 73% (1258/1723) remote: Compressing objects: 74% (1276/1723) remote: Compressing objects: 75% (1293/1723) remote: Compressing objects: 76% (1310/1723) remote: Compressing objects: 77% (1327/1723) remote: Compressing objects: 78% (1344/1723) remote: Compressing objects: 79% (1362/1723) remote: Compressing objects: 80% (1379/1723) remote: Compressing objects: 81% (1396/1723) remote: Compressing objects: 82% (1413/1723) remote: Compressing objects: 83% (1431/1723) remote: Compressing objects: 84% (1448/1723) remote: Compressing objects: 85% (1465/1723) remote: Compressing objects: 86% (1482/1723) remote: Compressing objects: 87% (1500/1723) remote: Compressing objects: 88% (1517/1723) remote: Compressing objects: 89% (1534/1723) remote: Compressing objects: 90% (1551/1723) remote: Compressing objects: 91% (1568/1723) remote: Compressing objects: 92% (1586/1723) remote: Compressing objects: 93% (1603/1723) remote: Compressing objects: 94% (1620/1723) remote: Compressing objects: 95% (1637/1723) remote: Compressing objects: 96% (1655/1723) remote: Compressing objects: 97% (1672/1723) remote: Compressing objects: 98% (1689/1723) remote: Compressing objects: 99% (1706/1723) remote: Compressing objects: 100% (1723/1723) remote: Compressing objects: 100% (1723/1723), done.
  6. 7.67 s Receiving objects: 0% (1/85477) Receiving objects: 1% (855/85477) Receiving objects: 2% (1710/85477) Receiving objects: 3% (2565/85477) Receiving objects: 4% (3420/85477) Receiving objects: 5% (4274/85477) Receiving objects: 6% (5129/85477) Receiving objects: 7% (5984/85477) Receiving objects: 8% (6839/85477) Receiving objects: 9% (7693/85477), 15.32 MiB | 30.68 MiB/s Receiving objects: 10% (8548/85477), 15.32 MiB | 30.68 MiB/s Receiving objects: 11% (9403/85477), 15.32 MiB | 30.68 MiB/s Receiving objects: 12% (10258/85477), 15.32 MiB | 30.68 MiB/s Receiving objects: 13% (11113/85477), 15.32 MiB | 30.68 MiB/s Receiving objects: 14% (11967/85477), 15.32 MiB | 30.68 MiB/s Receiving objects: 15% (12822/85477), 15.32 MiB | 30.68 MiB/s Receiving objects: 16% (13677/85477), 15.32 MiB | 30.68 MiB/s Receiving objects: 17% (14532/85477), 15.32 MiB | 30.68 MiB/s Receiving objects: 18% (15386/85477), 15.32 MiB | 30.68 MiB/s Receiving objects: 19% (16241/85477), 15.32 MiB | 30.68 MiB/s Receiving objects: 20% (17096/85477), 15.32 MiB | 30.68 MiB/s Receiving objects: 21% (17951/85477), 15.32 MiB | 30.68 MiB/s Receiving objects: 22% (18805/85477), 15.32 MiB | 30.68 MiB/s Receiving objects: 23% (19660/85477), 15.32 MiB | 30.68 MiB/s Receiving objects: 24% (20515/85477), 15.32 MiB | 30.68 MiB/s Receiving objects: 25% (21370/85477), 15.32 MiB | 30.68 MiB/s Receiving objects: 26% (22225/85477), 15.32 MiB | 30.68 MiB/s Receiving objects: 27% (23079/85477), 15.32 MiB | 30.68 MiB/s Receiving objects: 28% (23934/85477), 15.32 MiB | 30.68 MiB/s Receiving objects: 29% (24789/85477), 15.32 MiB | 30.68 MiB/s Receiving objects: 30% (25644/85477), 15.32 MiB | 30.68 MiB/s Receiving objects: 31% (26498/85477), 15.32 MiB | 30.68 MiB/s Receiving objects: 32% (27353/85477), 15.32 MiB | 30.68 MiB/s Receiving objects: 33% (28208/85477), 15.32 MiB | 30.68 MiB/s Receiving objects: 34% (29063/85477), 15.32 MiB | 30.68 MiB/s Receiving objects: 35% (29917/85477), 15.32 MiB | 30.68 MiB/s Receiving objects: 36% (30772/85477), 15.32 MiB | 30.68 MiB/s Receiving objects: 37% (31627/85477), 15.32 MiB | 30.68 MiB/s Receiving objects: 38% (32482/85477), 15.32 MiB | 30.68 MiB/s Receiving objects: 39% (33337/85477), 15.32 MiB | 30.68 MiB/s Receiving objects: 39% (34119/85477), 34.81 MiB | 34.84 MiB/s Receiving objects: 40% (34191/85477), 34.81 MiB | 34.84 MiB/s Receiving objects: 41% (35046/85477), 34.81 MiB | 34.84 MiB/s Receiving objects: 42% (35901/85477), 34.81 MiB | 34.84 MiB/s Receiving objects: 43% (36756/85477), 34.81 MiB | 34.84 MiB/s Receiving objects: 44% (37610/85477), 34.81 MiB | 34.84 MiB/s Receiving objects: 45% (38465/85477), 34.81 MiB | 34.84 MiB/s Receiving objects: 46% (39320/85477), 34.81 MiB | 34.84 MiB/s Receiving objects: 47% (40175/85477), 34.81 MiB | 34.84 MiB/s Receiving objects: 48% (41029/85477), 34.81 MiB | 34.84 MiB/s Receiving objects: 49% (41884/85477), 34.81 MiB | 34.84 MiB/s Receiving objects: 50% (42739/85477), 34.81 MiB | 34.84 MiB/s Receiving objects: 51% (43594/85477), 34.81 MiB | 34.84 MiB/s Receiving objects: 52% (44449/85477), 52.25 MiB | 34.43 MiB/s Receiving objects: 53% (45303/85477), 52.25 MiB | 34.43 MiB/s Receiving objects: 54% (46158/85477), 52.25 MiB | 34.43 MiB/s Receiving objects: 55% (47013/85477), 52.25 MiB | 34.43 MiB/s Receiving objects: 56% (47868/85477), 52.25 MiB | 34.43 MiB/s Receiving objects: 57% (48722/85477), 52.25 MiB | 34.43 MiB/s Receiving objects: 58% (49577/85477), 52.25 MiB | 34.43 MiB/s Receiving objects: 58% (50207/85477), 52.25 MiB | 34.43 MiB/s Receiving objects: 59% (50432/85477), 52.25 MiB | 34.43 MiB/s Receiving objects: 60% (51287/85477), 71.44 MiB | 34.65 MiB/s Receiving objects: 61% (52141/85477), 71.44 MiB | 34.65 MiB/s Receiving objects: 62% (52996/85477), 71.44 MiB | 34.65 MiB/s Receiving objects: 63% (53851/85477), 71.44 MiB | 34.65 MiB/s Receiving objects: 64% (54706/85477), 71.44 MiB | 34.65 MiB/s Receiving objects: 65% (55561/85477), 71.44 MiB | 34.65 MiB/s Receiving objects: 66% (56415/85477), 71.44 MiB | 34.65 MiB/s Receiving objects: 67% (57270/85477), 71.44 MiB | 34.65 MiB/s Receiving objects: 67% (57350/85477), 90.50 MiB | 34.73 MiB/s Receiving objects: 68% (58125/85477), 90.50 MiB | 34.73 MiB/s Receiving objects: 69% (58980/85477), 90.50 MiB | 34.73 MiB/s Receiving objects: 70% (59834/85477), 109.51 MiB | 34.77 MiB/s Receiving objects: 71% (60689/85477), 109.51 MiB | 34.77 MiB/s Receiving objects: 72% (61544/85477), 109.51 MiB | 34.77 MiB/s Receiving objects: 73% (62399/85477), 109.51 MiB | 34.77 MiB/s Receiving objects: 74% (63253/85477), 109.51 MiB | 34.77 MiB/s Receiving objects: 75% (64108/85477), 109.51 MiB | 34.77 MiB/s Receiving objects: 76% (64963/85477), 128.39 MiB | 34.76 MiB/s Receiving objects: 77% (65818/85477), 128.39 MiB | 34.76 MiB/s Receiving objects: 78% (66673/85477), 128.39 MiB | 34.76 MiB/s Receiving objects: 79% (67527/85477), 128.39 MiB | 34.76 MiB/s Receiving objects: 80% (68382/85477), 128.39 MiB | 34.76 MiB/s Receiving objects: 81% (69237/85477), 128.39 MiB | 34.76 MiB/s Receiving objects: 82% (70092/85477), 128.39 MiB | 34.76 MiB/s Receiving objects: 83% (70946/85477), 128.39 MiB | 34.76 MiB/s Receiving objects: 84% (71801/85477), 128.39 MiB | 34.76 MiB/s Receiving objects: 85% (72656/85477), 128.39 MiB | 34.76 MiB/s Receiving objects: 86% (73511/85477), 128.39 MiB | 34.76 MiB/s Receiving objects: 86% (73623/85477), 128.39 MiB | 34.76 MiB/s Receiving objects: 87% (74365/85477), 128.39 MiB | 34.76 MiB/s Receiving objects: 88% (75220/85477), 147.57 MiB | 34.83 MiB/s Receiving objects: 89% (76075/85477), 147.57 MiB | 34.83 MiB/s Receiving objects: 90% (76930/85477), 147.57 MiB | 34.83 MiB/s Receiving objects: 91% (77785/85477), 147.57 MiB | 34.83 MiB/s Receiving objects: 92% (78639/85477), 147.57 MiB | 34.83 MiB/s Receiving objects: 93% (79494/85477), 147.57 MiB | 34.83 MiB/s Receiving objects: 94% (80349/85477), 147.57 MiB | 34.83 MiB/s Receiving objects: 95% (81204/85477), 147.57 MiB | 34.83 MiB/s Receiving objects: 96% (82058/85477), 147.57 MiB | 34.83 MiB/s Receiving objects: 97% (82913/85477), 147.57 MiB | 34.83 MiB/s Receiving objects: 98% (83768/85477), 147.57 MiB | 34.83 MiB/s Receiving objects: 99% (84623/85477), 147.57 MiB | 34.83 MiB/s remote: Total 85477 (delta 7529), reused 6906 (delta 6875), pack-reused 76879 (from 3)
  7. 7.67 s Receiving objects: 100% (85477/85477), 147.57 MiB | 34.83 MiB/s Receiving objects: 100% (85477/85477), 154.96 MiB | 35.14 MiB/s, done.
  8. 8.62 s Resolving deltas: 0% (0/57949) Resolving deltas: 1% (580/57949) Resolving deltas: 2% (1159/57949) Resolving deltas: 3% (1739/57949) Resolving deltas: 4% (2318/57949) Resolving deltas: 5% (2898/57949) Resolving deltas: 6% (3479/57949) Resolving deltas: 7% (4057/57949) Resolving deltas: 8% (4636/57949) Resolving deltas: 9% (5216/57949) Resolving deltas: 10% (5798/57949) Resolving deltas: 11% (6375/57949) Resolving deltas: 12% (6954/57949) Resolving deltas: 13% (7534/57949) Resolving deltas: 14% (8113/57949) Resolving deltas: 15% (8694/57949) Resolving deltas: 16% (9274/57949) Resolving deltas: 17% (9852/57949) Resolving deltas: 18% (10431/57949) Resolving deltas: 19% (11011/57949) Resolving deltas: 20% (11590/57949) Resolving deltas: 21% (12170/57949) Resolving deltas: 22% (12749/57949) Resolving deltas: 23% (13329/57949) Resolving deltas: 24% (13908/57949) Resolving deltas: 25% (14488/57949) Resolving deltas: 26% (15068/57949) Resolving deltas: 27% (15647/57949) Resolving deltas: 28% (16226/57949) Resolving deltas: 29% (16806/57949) Resolving deltas: 30% (17385/57949) Resolving deltas: 31% (17965/57949) Resolving deltas: 32% (18544/57949) Resolving deltas: 33% (19125/57949) Resolving deltas: 34% (19703/57949) Resolving deltas: 35% (20283/57949) Resolving deltas: 36% (20863/57949) Resolving deltas: 37% (21442/57949) Resolving deltas: 38% (22021/57949) Resolving deltas: 39% (22601/57949) Resolving deltas: 40% (23180/57949) Resolving deltas: 41% (23760/57949) Resolving deltas: 42% (24339/57949) Resolving deltas: 43% (24922/57949) Resolving deltas: 44% (25498/57949) Resolving deltas: 45% (26078/57949) Resolving deltas: 46% (26657/57949) Resolving deltas: 47% (27238/57949) Resolving deltas: 48% (27816/57949) Resolving deltas: 49% (28396/57949) Resolving deltas: 50% (28975/57949) Resolving deltas: 51% (29554/57949) Resolving deltas: 52% (30134/57949) Resolving deltas: 53% (30713/57949) Resolving deltas: 54% (31293/57949) Resolving deltas: 55% (31872/57949) Resolving deltas: 56% (32452/57949) Resolving deltas: 57% (33031/57949) Resolving deltas: 58% (33612/57949) Resolving deltas: 59% (34190/57949) Resolving deltas: 60% (34770/57949) Resolving deltas: 61% (35349/57949) Resolving deltas: 62% (35930/57949) Resolving deltas: 63% (36508/57949) Resolving deltas: 64% (37088/57949) Resolving deltas: 65% (37667/57949) Resolving deltas: 66% (38247/57949) Resolving deltas: 67% (38826/57949) Resolving deltas: 68% (39407/57949) Resolving deltas: 69% (39985/57949) Resolving deltas: 70% (40565/57949) Resolving deltas: 71% (41145/57949) Resolving deltas: 72% (41725/57949) Resolving deltas: 73% (42303/57949) Resolving deltas: 74% (42883/57949) Resolving deltas: 75% (43466/57949) Resolving deltas: 76% (44043/57949) Resolving deltas: 77% (44621/57949) Resolving deltas: 78% (45201/57949) Resolving deltas: 79% (45780/57949) Resolving deltas: 80% (46360/57949) Resolving deltas: 81% (46939/57949) Resolving deltas: 82% (47519/57949) Resolving deltas: 83% (48098/57949) Resolving deltas: 84% (48678/57949) Resolving deltas: 85% (49257/57949) Resolving deltas: 86% (49837/57949) Resolving deltas: 87% (50416/57949) Resolving deltas: 88% (50996/57949) Resolving deltas: 89% (51576/57949) Resolving deltas: 90% (52156/57949) Resolving deltas: 91% (52735/57949) Resolving deltas: 92% (53314/57949) Resolving deltas: 93% (53894/57949) Resolving deltas: 94% (54473/57949) Resolving deltas: 95% (55052/57949) Resolving deltas: 96% (55632/57949) Resolving deltas: 97% (56212/57949) Resolving deltas: 98% (56791/57949) Resolving deltas: 99% (57370/57949) Resolving deltas: 100% (57949/57949) Resolving deltas: 100% (57949/57949), done.
  9. 9.04 s Fetching commit 1eb32575d9b16fee2910f3bb2c791fbae2eae5ba for faster_uv_from_4d ...
  10. 9.04 s $ /nix/store/bcnisk3ydfgv26v2gw3zlky24g00yww2-git-2.54.0/bin/git fetch origin 1eb32575d9b16fee2910f3bb2c791fbae2eae5ba
  11. 9.46 s From https://github.com/alphal00p/gammaloop
  12. 9.46 s * branch 1eb32575d9b16fee2910f3bb2c791fbae2eae5ba -> FETCH_HEAD
  13. 9.47 s $ /nix/store/9ypz3flqsrl5xl495mm8h645gadjsxi1-coreutils-9.11/bin/timeout --kill-after=15s 7200s /nix/store/bcnisk3ydfgv26v2gw3zlky24g00yww2-git-2.54.0/bin/git -c advice.detachedHead=false checkout 1eb32575d9b16fee2910f3bb2c791fbae2eae5ba
  14. 9.78 s HEAD is now at 1eb32575d contract additive evaluator terms independently
  15. 9.79 s $ /nix/store/9ypz3flqsrl5xl495mm8h645gadjsxi1-coreutils-9.11/bin/timeout --kill-after=15s 7200s /nix/store/23zk8sgzamrbmj1fday15szf7f2279s8-nix-2.34.7/bin/nix --extra-experimental-features nix-command --extra-experimental-features flakes --log-format internal-json run .#packages.x86_64-linux.nix-ci-check-gammaloop-nextest-core --print-build-logs
  16. 14.65 s
  17. 22.74 s evaluating derivation 'g copying '/nix/store/x0yg evaluating derivation 'g copying '/nix/store/x0yg evaluating derivation 'g copying '/nix/store/x0yg evaluating derivation 'g copying '/nix/store/x0yg evaluating derivation 'g copying '/nix/store/x0yg evaluating derivation 'g copying '/nix/store/x0yg evaluating derivation 'g copying '/nix/store/x0yg evaluating derivation 'g copying '/nix/store/x0yg evaluating derivation 'g copying '/nix/store/x0yg evaluating derivation 'g querying gammaloop-nexte [0.0 KiB DL] querying in [0/1 built, 1 copied (4. [1/0/1 built, 1 copied (gammaloop-nextest-core> Extracting 4 binaries (including 1 non-test binary), 1 build script output directory, and 2 linked paths to /build/nextest-archive-2JmY3O
  18. 23.60 s gammaloop-nextest-core> Extracted 20 files to /build/nextest-archive-2JmY3O in 0.86s
  19. 23.65 s gammaloop-nextest-core> ------------
  20. 23.65 s gammaloop-nextest-core> Nextest run ID f1444125-6f78-4f9f-8815-dbd0824159c0 with nextest profile: ci_gammaloop
  21. 23.65 s gammaloop-nextest-core> Starting 379 tests across 3 binaries
  22. 25.96 s gammaloop-nextest-core> ------------
  23. 25.96 s gammaloop-nextest-core> Summary [ 2.296s] 379 tests run: 379 passed, 0 skipped
  24. 26.33 s gammaloop-nextest-core>
  25. 26.33 s gammaloop-nextest-core> ========== nextest test summary ==========
  26. 26.33 s gammaloop-nextest-core> report: target/nextest/ci_gammaloop/junit.xml
  27. 26.33 s gammaloop-nextest-core> tests: 379, failures: 0, errors: 0
  28. 26.33 s gammaloop-nextest-core> No failing testcases found.
  29. 26.33 s gammaloop-nextest-core> =========================================
  30. 26.36 s gammaloop-nextest-core> Extracting 1 binary and 1 linked path to /build/nextest-archive-NwyAaK
  31. 26.43 s gammaloop-nextest-core> Extracted 7 files to /build/nextest-archive-NwyAaK in 0.08s
  32. 26.48 s gammaloop-nextest-core> ------------
  33. 26.48 s gammaloop-nextest-core> Nextest run ID b1aa1b50-97b4-4081-b061-65e2ca1d0672 with nextest profile: ci_gammaloop
  34. 26.48 s gammaloop-nextest-core> Starting 19 tests across 1 binary
  35. 26.56 s gammaloop-nextest-core> ------------
  36. 26.56 s gammaloop-nextest-core> Summary [ 0.082s] 19 tests run: 19 passed, 0 skipped
  37. 26.64 s gammaloop-nextest-core>
  38. 26.64 s gammaloop-nextest-core> ========== nextest test summary ==========
  39. 26.64 s gammaloop-nextest-core> report: target/nextest/ci_gammaloop/junit.xml
  40. 26.64 s gammaloop-nextest-core> tests: 19, failures: 0, errors: 0
  41. 26.64 s gammaloop-nextest-core> No failing testcases found.
  42. 26.64 s gammaloop-nextest-core> =========================================
  43. 26.68 s gammaloop-nextest-core> Extracting 1 binary to /build/nextest-archive-4htKUd
  44. 26.73 s gammaloop-nextest-core> Extracted 4 files to /build/nextest-archive-4htKUd in 0.06s
  45. 26.76 s gammaloop-nextest-core> ------------
  46. 26.76 s gammaloop-nextest-core> Nextest run ID 02a6d256-7f06-451c-9325-2696714834a9 with nextest profile: ci_gammaloop
  47. 26.76 s gammaloop-nextest-core> Starting 0 tests across 1 binary
  48. 26.76 s gammaloop-nextest-core> ------------
  49. 26.76 s gammaloop-nextest-core> Summary [ 0.000s] 0 tests run: 0 passed, 0 skipped
  50. 26.85 s gammaloop-nextest-core>
  51. 26.85 s gammaloop-nextest-core> ========== nextest test summary ==========
  52. 26.85 s gammaloop-nextest-core> report: target/nextest/ci_gammaloop/junit.xml
  53. 26.85 s gammaloop-nextest-core> tests: 0, failures: 0, errors: 0
  54. 26.85 s gammaloop-nextest-core> No failing testcases found.
  55. 26.85 s gammaloop-nextest-core> =========================================
  56. 26.89 s gammaloop-nextest-core> Extracting 4 binaries, 1 build script output directory, and 2 linked paths to /build/nextest-archive-GlO3iS
  57. 27.53 s gammaloop-nextest-core> Extracted 18 files to /build/nextest-archive-GlO3iS in 0.64s
  58. 27.59 s gammaloop-nextest-core> ------------
  59. 27.59 s gammaloop-nextest-core> Nextest run ID b602e081-57e9-49f8-b540-e47cbeb44f95 with nextest profile: ci_gammaloop
  60. 27.59 s gammaloop-nextest-core> Starting 705 tests across 4 binaries (60 tests skipped, including 59 tests via profile.ci_gammaloop.default-filter)
  61. 45.91 s gammaloop-nextest-core> FAIL [ 7.124s] (699/705) gammalooprs::test_renormalization finite_part_ghost_2loop
  62. 45.91 s gammaloop-nextest-core> stdout ---
  63. 45.91 s gammaloop-nextest-core>
  64. 45.91 s gammaloop-nextest-core> running 1 test
  65. 45.91 s gammaloop-nextest-core> test finite_part_ghost_2loop ... FAILED
  66. 45.91 s gammaloop-nextest-core>
  67. 45.91 s gammaloop-nextest-core> failures:
  68. 45.91 s gammaloop-nextest-core>
  69. 45.91 s gammaloop-nextest-core> failures:
  70. 45.91 s gammaloop-nextest-core> finite_part_ghost_2loop
  71. 45.91 s gammaloop-nextest-core>
  72. 45.91 s gammaloop-nextest-core> test result: FAILED. 0 passed; 1 failed; 0 ignored; 0 measured; 6 filtered out; finished in 7.09s
  73. 45.91 s gammaloop-nextest-core>
  74. 45.91 s gammaloop-nextest-core> stderr ---
  75. 45.91 s gammaloop-nextest-core> The application panicked (crashed).
  76. 45.91 s gammaloop-nextest-core> Message: assertion failed: (align_to_rqft(&a, &model) - expected).expand().is_zero()
  77. 45.91 s gammaloop-nextest-core> Location: crates/gammalooprs/tests/test_renormalization.rs:583
  78. 45.91 s gammaloop-nextest-core>
  79. 45.91 s gammaloop-nextest-core> ━━━━━━━━━━━━━━━━━━━━━━━━━━━━━━━━━━ BACKTRACE ━━━━━━━━━━━━━━━━━━━━━━━━━━━━━━━━━━━
  80. 45.91 s gammaloop-nextest-core> 1: <color_eyre[51793ea62743adbd]::config::PanicHook>::panic_report<unknown>
  81. 45.91 s gammaloop-nextest-core> at <unknown source file>:<unknown line>
  82. 45.91 s gammaloop-nextest-core> 2: <color_eyre[51793ea62743adbd]::config::PanicHook>::into_panic_hook::{closure#0}<unknown>
  83. 45.91 s gammaloop-nextest-core> at <unknown source file>:<unknown line>
  84. 45.91 s gammaloop-nextest-core> 3: std[bcb96dfbba0ab899]::panicking::panic_with_hook<unknown>
  85. 45.91 s gammaloop-nextest-core> at <unknown source file>:<unknown line>
  86. 45.91 s gammaloop-nextest-core> 4: std[bcb96dfbba0ab899]::panicking::panic_handler::{closure#0}<unknown>
  87. 45.91 s gammaloop-nextest-core> at <unknown source file>:<unknown line>
  88. 45.91 s gammaloop-nextest-core> 5: std[bcb96dfbba0ab899]::sys::backtrace::__rust_end_short_backtrace::<std[bcb96dfbba0ab899]::panicking::panic_handler::{closure#0}, !><unknown>
  89. 45.91 s gammaloop-nextest-core> at <unknown source file>:<unknown line>
  90. 45.91 s gammaloop-nextest-core> 6: __rustc[6c289b9f9c454d21]::rust_begin_unwind<unknown>
  91. 45.91 s gammaloop-nextest-core> at <unknown source file>:<unknown line>
  92. 45.91 s gammaloop-nextest-core> 7: core[940e698046960fd5]::panicking::panic_fmt<unknown>
  93. 45.91 s gammaloop-nextest-core> at <unknown source file>:<unknown line>
  94. 45.91 s gammaloop-nextest-core> 8: core[940e698046960fd5]::panicking::panic<unknown>
  95. 45.91 s gammaloop-nextest-core> at <unknown source file>:<unknown line>
  96. 45.91 s gammaloop-nextest-core> 9: <test_renormalization[5812939ef1a04d89]::finite_part_ghost_2loop::{closure#0} as core[940e698046960fd5]::ops::function::FnOnce<()>>::call_once<unknown>
  97. 45.91 s gammaloop-nextest-core> at <unknown source file>:<unknown line>
  98. 45.91 s gammaloop-nextest-core> 10: test[75d6903177b1d7e9]::__rust_begin_short_backtrace::<core[940e698046960fd5]::result::Result<(), alloc[2ea6bcb46fca0c42]::string::String>, fn() -> core[940e698046960fd5]::result::Result<(), alloc[2ea6bcb46fca0c42]::string::String>><unknown>
  99. 45.91 s gammaloop-nextest-core> at <unknown source file>:<unknown line>
  100. 45.91 s gammaloop-nextest-core> 11: test[75d6903177b1d7e9]::run_test::{closure#0}<unknown>
  101. 45.91 s gammaloop-nextest-core> at <unknown source file>:<unknown line>
  102. 45.91 s gammaloop-nextest-core> 12: std[bcb96dfbba0ab899]::sys::backtrace::__rust_begin_short_backtrace::<test[75d6903177b1d7e9]::run_test::{closure#1}, ()><unknown>
  103. 45.91 s gammaloop-nextest-core> at <unknown source file>:<unknown line>
  104. 45.91 s gammaloop-nextest-core> 13: <std[bcb96dfbba0ab899]::thread::lifecycle::spawn_unchecked<test[75d6903177b1d7e9]::run_test::{closure#1}, ()>::{closure#1} as core[940e698046960fd5]::ops::function::FnOnce<()>>::call_once::{shim:vtable#0}<unknown>
  105. 45.91 s gammaloop-nextest-core> at <unknown source file>:<unknown line>
  106. 45.91 s gammaloop-nextest-core> 14: <std[bcb96dfbba0ab899]::sys::thread::unix::Thread>::new::thread_start<unknown>
  107. 45.91 s gammaloop-nextest-core> at <unknown source file>:<unknown line>
  108. 45.91 s gammaloop-nextest-core> 15: start_thread<unknown>
  109. 45.91 s gammaloop-nextest-core> at <unknown source file>:<unknown line>
  110. 45.91 s gammaloop-nextest-core> 16: __clone3<unknown>
  111. 45.91 s gammaloop-nextest-core> at <unknown source file>:<unknown line>
  112. 45.91 s gammaloop-nextest-core>
  113. 45.91 s gammaloop-nextest-core> Run with COLORBT_SHOW_HIDDEN=1 environment variable to disable frame filtering.
  114. 45.91 s gammaloop-nextest-core> Run with RUST_BACKTRACE=full to include source snippets.
  115. 45.91 s gammaloop-nextest-core>
  116. 53.04 s gammaloop-nextest-core> ------------
  117. 53.04 s gammaloop-nextest-core> Summary [ 25.452s] 705 tests run: 704 passed, 1 failed, 60 skipped
  118. 53.04 s gammaloop-nextest-core> FAIL [ 7.124s] (699/705) gammalooprs::test_renormalization finite_part_ghost_2loop
  119. 53.04 s gammaloop-nextest-core> stdout ---
  120. 53.04 s gammaloop-nextest-core>
  121. 53.04 s gammaloop-nextest-core> running 1 test
  122. 53.04 s gammaloop-nextest-core> test finite_part_ghost_2loop ... FAILED
  123. 53.04 s gammaloop-nextest-core>
  124. 53.04 s gammaloop-nextest-core> failures:
  125. 53.04 s gammaloop-nextest-core>
  126. 53.04 s gammaloop-nextest-core> failures:
  127. 53.04 s gammaloop-nextest-core> finite_part_ghost_2loop
  128. 53.04 s gammaloop-nextest-core>
  129. 53.04 s gammaloop-nextest-core> test result: FAILED. 0 passed; 1 failed; 0 ignored; 0 measured; 6 filtered out; finished in 7.09s
  130. 53.04 s gammaloop-nextest-core>
  131. 53.04 s gammaloop-nextest-core> stderr ---
  132. 53.04 s gammaloop-nextest-core> The application panicked (crashed).
  133. 53.04 s gammaloop-nextest-core> Message: assertion failed: (align_to_rqft(&a, &model) - expected).expand().is_zero()
  134. 53.04 s gammaloop-nextest-core> Location: crates/gammalooprs/tests/test_renormalization.rs:583
  135. 53.04 s gammaloop-nextest-core>
  136. 53.04 s gammaloop-nextest-core> ━━━━━━━━━━━━━━━━━━━━━━━━━━━━━━━━━━ BACKTRACE ━━━━━━━━━━━━━━━━━━━━━━━━━━━━━━━━━━━
  137. 53.04 s gammaloop-nextest-core> 1: <color_eyre[51793ea62743adbd]::config::PanicHook>::panic_report<unknown>
  138. 53.04 s gammaloop-nextest-core> at <unknown source file>:<unknown line>
  139. 53.04 s gammaloop-nextest-core> 2: <color_eyre[51793ea62743adbd]::config::PanicHook>::into_panic_hook::{closure#0}<unknown>
  140. 53.04 s gammaloop-nextest-core> at <unknown source file>:<unknown line>
  141. 53.04 s gammaloop-nextest-core> 3: std[bcb96dfbba0ab899]::panicking::panic_with_hook<unknown>
  142. 53.04 s gammaloop-nextest-core> at <unknown source file>:<unknown line>
  143. 53.04 s gammaloop-nextest-core> 4: std[bcb96dfbba0ab899]::panicking::panic_handler::{closure#0}<unknown>
  144. 53.04 s gammaloop-nextest-core> at <unknown source file>:<unknown line>
  145. 53.04 s gammaloop-nextest-core> 5: std[bcb96dfbba0ab899]::sys::backtrace::__rust_end_short_backtrace::<std[bcb96dfbba0ab899]::panicking::panic_handler::{closure#0}, !><unknown>
  146. 53.04 s gammaloop-nextest-core> at <unknown source file>:<unknown line>
  147. 53.04 s gammaloop-nextest-core> 6: __rustc[6c289b9f9c454d21]::rust_begin_unwind<unknown>
  148. 53.04 s gammaloop-nextest-core> at <unknown source file>:<unknown line>
  149. 53.04 s gammaloop-nextest-core> 7: core[940e698046960fd5]::panicking::panic_fmt<unknown>
  150. 53.04 s gammaloop-nextest-core> at <unknown source file>:<unknown line>
  151. 53.04 s gammaloop-nextest-core> 8: core[940e698046960fd5]::panicking::panic<unknown>
  152. 53.04 s gammaloop-nextest-core> at <unknown source file>:<unknown line>
  153. 53.04 s gammaloop-nextest-core> 9: <test_renormalization[5812939ef1a04d89]::finite_part_ghost_2loop::{closure#0} as core[940e698046960fd5]::ops::function::FnOnce<()>>::call_once<unknown>
  154. 53.04 s gammaloop-nextest-core> at <unknown source file>:<unknown line>
  155. 53.04 s gammaloop-nextest-core> 10: test[75d6903177b1d7e9]::__rust_begin_short_backtrace::<core[940e698046960fd5]::result::Result<(), alloc[2ea6bcb46fca0c42]::string::String>, fn() -> core[940e698046960fd5]::result::Result<(), alloc[2ea6bcb46fca0c42]::string::String>><unknown>
  156. 53.04 s gammaloop-nextest-core> at <unknown source file>:<unknown line>
  157. 53.04 s gammaloop-nextest-core> 11: test[75d6903177b1d7e9]::run_test::{closure#0}<unknown>
  158. 53.04 s gammaloop-nextest-core> at <unknown source file>:<unknown line>
  159. 53.04 s gammaloop-nextest-core> 12: std[bcb96dfbba0ab899]::sys::backtrace::__rust_begin_short_backtrace::<test[75d6903177b1d7e9]::run_test::{closure#1}, ()><unknown>
  160. 53.04 s gammaloop-nextest-core> at <unknown source file>:<unknown line>
  161. 53.04 s gammaloop-nextest-core> 13: <std[bcb96dfbba0ab899]::thread::lifecycle::spawn_unchecked<test[75d6903177b1d7e9]::run_test::{closure#1}, ()>::{closure#1} as core[940e698046960fd5]::ops::function::FnOnce<()>>::call_once::{shim:vtable#0}<unknown>
  162. 53.04 s gammaloop-nextest-core> at <unknown source file>:<unknown line>
  163. 53.04 s gammaloop-nextest-core> 14: <std[bcb96dfbba0ab899]::sys::thread::unix::Thread>::new::thread_start<unknown>
  164. 53.04 s gammaloop-nextest-core> at <unknown source file>:<unknown line>
  165. 53.04 s gammaloop-nextest-core> 15: start_thread<unknown>
  166. 53.04 s gammaloop-nextest-core> at <unknown source file>:<unknown line>
  167. 53.04 s gammaloop-nextest-core> 16: __clone3<unknown>
  168. 53.04 s gammaloop-nextest-core> at <unknown source file>:<unknown line>
  169. 53.04 s gammaloop-nextest-core>
  170. 53.04 s gammaloop-nextest-core> Run with COLORBT_SHOW_HIDDEN=1 environment variable to disable frame filtering.
  171. 53.04 s gammaloop-nextest-core> Run with RUST_BACKTRACE=full to include source snippets.
  172. 53.04 s gammaloop-nextest-core>
  173. 53.15 s gammaloop-nextest-core> error: test run failed
  174. 53.19 s gammaloop-nextest-core>
  175. 53.19 s gammaloop-nextest-core> ========== nextest test summary ==========
  176. 53.19 s gammaloop-nextest-core> report: target/nextest/ci_gammaloop/junit.xml
  177. 53.19 s gammaloop-nextest-core> tests: 705, failures: 1, errors: 0
  178. 53.19 s gammaloop-nextest-core>
  179. 53.19 s gammaloop-nextest-core> 1. gammalooprs::test_renormalization::finite_part_ghost_2loop
  180. 53.19 s gammaloop-nextest-core> failure: test failure with exit code 101
  181. 53.19 s gammaloop-nextest-core> system-out
  182. 53.19 s gammaloop-nextest-core> running 1 test
  183. 53.19 s gammaloop-nextest-core> test finite_part_ghost_2loop ... FAILED
  184. 53.19 s gammaloop-nextest-core>
  185. 53.19 s gammaloop-nextest-core> failures:
  186. 53.19 s gammaloop-nextest-core>
  187. 53.19 s gammaloop-nextest-core> failures:
  188. 53.19 s gammaloop-nextest-core> finite_part_ghost_2loop
  189. 53.19 s gammaloop-nextest-core>
  190. 53.19 s gammaloop-nextest-core> test result: FAILED. 0 passed; 1 failed; 0 ignored; 0 measured; 6 filtered out; finished in 7.09s
  191. 53.19 s gammaloop-nextest-core> system-err
  192. 53.19 s gammaloop-nextest-core> The application panicked (crashed).
  193. 53.19 s gammaloop-nextest-core> Message: assertion failed: (align_to_rqft(&a, &model) - expected).expand().is_zero()
  194. 53.19 s gammaloop-nextest-core> Location: crates/gammalooprs/tests/test_renormalization.rs:583
  195. 53.19 s gammaloop-nextest-core>
  196. 53.19 s gammaloop-nextest-core> ━━━━━━━━━━━━━━━━━━━━━━━━━━━━━━━━━━ BACKTRACE ━━━━━━━━━━━━━━━━━━━━━━━━━━━━━━━━━━━
  197. 53.19 s gammaloop-nextest-core> 1: <color_eyre[51793ea62743adbd]::config::PanicHook>::panic_report<unknown>
  198. 53.19 s gammaloop-nextest-core> at <unknown source file>:<unknown line>
  199. 53.19 s gammaloop-nextest-core> 2: <color_eyre[51793ea62743adbd]::config::PanicHook>::into_panic_hook::{closure#0}<unknown>
  200. 53.19 s gammaloop-nextest-core> at <unknown source file>:<unknown line>
  201. 53.19 s gammaloop-nextest-core> 3: std[bcb96dfbba0ab899]::panicking::panic_with_hook<unknown>
  202. 53.19 s gammaloop-nextest-core> at <unknown source file>:<unknown line>
  203. 53.19 s gammaloop-nextest-core> 4: std[bcb96dfbba0ab899]::panicking::panic_handler::{closure#0}<unknown>
  204. 53.19 s gammaloop-nextest-core> at <unknown source file>:<unknown line>
  205. 53.19 s gammaloop-nextest-core> 5: std[bcb96dfbba0ab899]::sys::backtrace::__rust_end_short_backtrace::<std[bcb96dfbba0ab899]::panicking::panic_handler::{closure#0}, !><unknown>
  206. 53.19 s gammaloop-nextest-core> at <unknown source file>:<unknown line>
  207. 53.19 s gammaloop-nextest-core> 6: __rustc[6c289b9f9c454d21]::rust_begin_unwind<unknown>
  208. 53.19 s gammaloop-nextest-core> at <unknown source file>:<unknown line>
  209. 53.19 s gammaloop-nextest-core> 7: core[940e698046960fd5]::panicking::panic_fmt<unknown>
  210. 53.19 s gammaloop-nextest-core> at <unknown source file>:<unknown line>
  211. 53.19 s gammaloop-nextest-core> 8: core[940e698046960fd5]::panicking::panic<unknown>
  212. 53.19 s gammaloop-nextest-core> at <unknown source file>:<unknown line>
  213. 53.19 s gammaloop-nextest-core> 9: <test_renormalization[5812939ef1a04d89]::finite_part_ghost_2loop::{closure#0} as core[940e698046960fd5]::ops::function::FnOnce<()>>::call_once<unknown>
  214. 53.19 s gammaloop-nextest-core> at <unknown source file>:<unknown line>
  215. 53.19 s gammaloop-nextest-core> 10: test[75d6903177b1d7e9]::__rust_begin_short_backtrace::<core[940e698046960fd5]::result::Result<(), alloc[2ea6bcb46fca0c42]::string::String>, fn() -> core[940e698046960fd5]::result::Result<(), alloc[2ea6bcb46fca0c42]::string::String>><unknown>
  216. 53.19 s gammaloop-nextest-core> at <unknown source file>:<unknown line>
  217. 53.19 s gammaloop-nextest-core> 11: test[75d6903177b1d7e9]::run_test::{closure#0}<unknown>
  218. 53.19 s gammaloop-nextest-core> at <unknown source file>:<unknown line>
  219. 53.19 s gammaloop-nextest-core> 12: std[bcb96dfbba0ab899]::sys::backtrace::__rust_begin_short_backtrace::<test[75d6903177b1d7e9]::run_test::{closure#1}, ()><unknown>
  220. 53.19 s gammaloop-nextest-core> at <unknown source file>:<unknown line>
  221. 53.19 s gammaloop-nextest-core> 13: <std[bcb96dfbba0ab899]::thread::lifecycle::spawn_unchecked<test[75d6903177b1d7e9]::run_test::{closure#1}, ()>::{closure#1} as core[940e698046960fd5]::ops::function::FnOnce<()>>::call_once::{shim:vtable#0}<unknown>
  222. 53.19 s gammaloop-nextest-core> at <unknown source file>:<unknown line>
  223. 53.19 s gammaloop-nextest-core> 14: <std[bcb96dfbba0ab899]::sys::thread::unix::Thread>::new::thread_start<unknown>
  224. 53.19 s gammaloop-nextest-core> at <unknown source file>:<unknown line>
  225. 53.19 s gammaloop-nextest-core> 15: start_thread<unknown>
  226. 53.19 s gammaloop-nextest-core> at <unknown source file>:<unknown line>
  227. 53.19 s gammaloop-nextest-core> 16: __clone3<unknown>
  228. 53.19 s gammaloop-nextest-core> at <unknown source file>:<unknown line>
  229. 53.19 s gammaloop-nextest-core>
  230. 53.19 s gammaloop-nextest-core> Run with COLORBT_SHOW_HIDDEN=1 environment variable to disable frame filtering.
  231. 53.19 s gammaloop-nextest-core> Run with RUST_BACKTRACE=full to include source snippets.
  232. 53.19 s gammaloop-nextest-core> =========================================
  233. 53.22 s gammaloop-nextest-core> Extracting 1 binary, 1 build script output directory, and 1 linked path to /build/nextest-archive-DxP0Gw
  234. 53.31 s gammaloop-nextest-core> Extracted 7 files to /build/nextest-archive-DxP0Gw in 0.09s
  235. 53.35 s gammaloop-nextest-core> ------------
  236. 53.35 s gammaloop-nextest-core> Nextest run ID 0e43f57d-cd43-4feb-9ab4-2a04abfcdbf0 with nextest profile: ci_gammaloop
  237. 53.35 s gammaloop-nextest-core> Starting 105 tests across 1 binary
  238. 77.41 s gammaloop-nextest-core> ------------
  239. 77.41 s gammaloop-nextest-core> Summary [ 24.061s] 105 tests run: 105 passed, 0 skipped
  240. 77.48 s gammaloop-nextest-core>
  241. 77.48 s gammaloop-nextest-core> ========== nextest test summary ==========
  242. 77.48 s gammaloop-nextest-core> report: target/nextest/ci_gammaloop/junit.xml
  243. 77.48 s gammaloop-nextest-core> tests: 105, failures: 0, errors: 0
  244. 77.48 s gammaloop-nextest-core> No failing testcases found.
  245. 77.48 s gammaloop-nextest-core> =========================================
  246. 77.55 s error: Cannot build '/nix/store/n72shhl1iwhd9py98qq4wh1bk34sp0c7-gammaloop-nextest-core.drv'.
  247. 77.55 s Reason: builder failed with exit code 100.
  248. 77.55 s Output paths:
  249. 77.55 s /nix/store/ljgp57j9jy604x9j7hdfrvcsdl1bz568-gammaloop-nextest-core
  250. 77.55 s Last 229 log lines:
  251. 77.55 s > Extracting 4 binaries (including 1 non-test binary), 1 build script output directory, and 2 linked paths to /build/nextest-archive-2JmY3O
  252. 77.55 s > Extracted 20 files to /build/nextest-archive-2JmY3O in 0.86s
  253. 77.55 s > ------------
  254. 77.55 s > Nextest run ID f1444125-6f78-4f9f-8815-dbd0824159c0 with nextest profile: ci_gammaloop
  255. 77.55 s > Starting 379 tests across 3 binaries
  256. 77.55 s > ------------
  257. 77.55 s > Summary [ 2.296s] 379 tests run: 379 passed, 0 skipped
  258. 77.55 s >
  259. 77.55 s > ========== nextest test summary ==========
  260. 77.55 s > report: target/nextest/ci_gammaloop/junit.xml
  261. 77.55 s > tests: 379, failures: 0, errors: 0
  262. 77.55 s > No failing testcases found.
  263. 77.55 s > =========================================
  264. 77.55 s > Extracting 1 binary and 1 linked path to /build/nextest-archive-NwyAaK
  265. 77.55 s > Extracted 7 files to /build/nextest-archive-NwyAaK in 0.08s
  266. 77.55 s > ------------
  267. 77.55 s > Nextest run ID b1aa1b50-97b4-4081-b061-65e2ca1d0672 with nextest profile: ci_gammaloop
  268. 77.55 s > Starting 19 tests across 1 binary
  269. 77.55 s > ------------
  270. 77.55 s > Summary [ 0.082s] 19 tests run: 19 passed, 0 skipped
  271. 77.55 s >
  272. 77.55 s > ========== nextest test summary ==========
  273. 77.55 s > report: target/nextest/ci_gammaloop/junit.xml
  274. 77.55 s > tests: 19, failures: 0, errors: 0
  275. 77.55 s > No failing testcases found.
  276. 77.55 s > =========================================
  277. 77.55 s > Extracting 1 binary to /build/nextest-archive-4htKUd
  278. 77.55 s > Extracted 4 files to /build/nextest-archive-4htKUd in 0.06s
  279. 77.55 s > ------------
  280. 77.55 s > Nextest run ID 02a6d256-7f06-451c-9325-2696714834a9 with nextest profile: ci_gammaloop
  281. 77.55 s > Starting 0 tests across 1 binary
  282. 77.55 s > ------------
  283. 77.55 s > Summary [ 0.000s] 0 tests run: 0 passed, 0 skipped
  284. 77.55 s >
  285. 77.55 s > ========== nextest test summary ==========
  286. 77.55 s > report: target/nextest/ci_gammaloop/junit.xml
  287. 77.55 s > tests: 0, failures: 0, errors: 0
  288. 77.55 s > No failing testcases found.
  289. 77.55 s > =========================================
  290. 77.55 s > Extracting 4 binaries, 1 build script output directory, and 2 linked paths to /build/nextest-archive-GlO3iS
  291. 77.55 s > Extracted 18 files to /build/nextest-archive-GlO3iS in 0.64s
  292. 77.55 s > ------------
  293. 77.55 s > Nextest run ID b602e081-57e9-49f8-b540-e47cbeb44f95 with nextest profile: ci_gammaloop
  294. 77.55 s > Starting 705 tests across 4 binaries (60 tests skipped, including 59 tests via profile.ci_gammaloop.default-filter)
  295. 77.55 s > FAIL [ 7.124s] (699/705) gammalooprs::test_renormalization finite_part_ghost_2loop
  296. 77.55 s > stdout ---
  297. 77.55 s >
  298. 77.55 s > running 1 test
  299. 77.55 s > test finite_part_ghost_2loop ... FAILED
  300. 77.55 s >
  301. 77.55 s > failures:
  302. 77.55 s >
  303. 77.55 s > failures:
  304. 77.55 s > finite_part_ghost_2loop
  305. 77.55 s >
  306. 77.55 s > test result: FAILED. 0 passed; 1 failed; 0 ignored; 0 measured; 6 filtered out; finished in 7.09s
  307. 77.55 s >
  308. 77.55 s > stderr ---
  309. 77.55 s > The application panicked (crashed).
  310. 77.55 s > Message: assertion failed: (align_to_rqft(&a, &model) - expected).expand().is_zero()
  311. 77.55 s > Location: crates/gammalooprs/tests/test_renormalization.rs:583
  312. 77.55 s >
  313. 77.55 s > ━━━━━━━━━━━━━━━━━━━━━━━━━━━━━━━━━━ BACKTRACE ━━━━━━━━━━━━━━━━━━━━━━━━━━━━━━━━━━━
  314. 77.55 s > 1: <color_eyre[51793ea62743adbd]::config::PanicHook>::panic_report<unknown>
  315. 77.55 s > at <unknown source file>:<unknown line>
  316. 77.55 s > 2: <color_eyre[51793ea62743adbd]::config::PanicHook>::into_panic_hook::{closure#0}<unknown>
  317. 77.55 s > at <unknown source file>:<unknown line>
  318. 77.55 s > 3: std[bcb96dfbba0ab899]::panicking::panic_with_hook<unknown>
  319. 77.55 s > at <unknown source file>:<unknown line>
  320. 77.55 s > 4: std[bcb96dfbba0ab899]::panicking::panic_handler::{closure#0}<unknown>
  321. 77.55 s > at <unknown source file>:<unknown line>
  322. 77.55 s > 5: std[bcb96dfbba0ab899]::sys::backtrace::__rust_end_short_backtrace::<std[bcb96dfbba0ab899]::panicking::panic_handler::{closure#0}, !><unknown>
  323. 77.55 s > at <unknown source file>:<unknown line>
  324. 77.55 s > 6: __rustc[6c289b9f9c454d21]::rust_begin_unwind<unknown>
  325. 77.55 s > at <unknown source file>:<unknown line>
  326. 77.55 s > 7: core[940e698046960fd5]::panicking::panic_fmt<unknown>
  327. 77.55 s > at <unknown source file>:<unknown line>
  328. 77.55 s > 8: core[940e698046960fd5]::panicking::panic<unknown>
  329. 77.55 s > at <unknown source file>:<unknown line>
  330. 77.55 s > 9: <test_renormalization[5812939ef1a04d89]::finite_part_ghost_2loop::{closure#0} as core[940e698046960fd5]::ops::function::FnOnce<()>>::call_once<unknown>
  331. 77.55 s > at <unknown source file>:<unknown line>
  332. 77.55 s > 10: test[75d6903177b1d7e9]::__rust_begin_short_backtrace::<core[940e698046960fd5]::result::Result<(), alloc[2ea6bcb46fca0c42]::string::String>, fn() -> core[940e698046960fd5]::result::Result<(), alloc[2ea6bcb46fca0c42]::string::String>><unknown>
  333. 77.55 s > at <unknown source file>:<unknown line>
  334. 77.55 s > 11: test[75d6903177b1d7e9]::run_test::{closure#0}<unknown>
  335. 77.55 s > at <unknown source file>:<unknown line>
  336. 77.55 s > 12: std[bcb96dfbba0ab899]::sys::backtrace::__rust_begin_short_backtrace::<test[75d6903177b1d7e9]::run_test::{closure#1}, ()><unknown>
  337. 77.55 s > at <unknown source file>:<unknown line>
  338. 77.55 s > 13: <std[bcb96dfbba0ab899]::thread::lifecycle::spawn_unchecked<test[75d6903177b1d7e9]::run_test::{closure#1}, ()>::{closure#1} as core[940e698046960fd5]::ops::function::FnOnce<()>>::call_once::{shim:vtable#0}<unknown>
  339. 77.55 s > at <unknown source file>:<unknown line>
  340. 77.55 s > 14: <std[bcb96dfbba0ab899]::sys::thread::unix::Thread>::new::thread_start<unknown>
  341. 77.55 s > at <unknown source file>:<unknown line>
  342. 77.55 s > 15: start_thread<unknown>
  343. 77.55 s > at <unknown source file>:<unknown line>
  344. 77.55 s > 16: __clone3<unknown>
  345. 77.55 s > at <unknown source file>:<unknown line>
  346. 77.55 s >
  347. 77.55 s > Run with COLORBT_SHOW_HIDDEN=1 environment variable to disable frame filtering.
  348. 77.55 s > Run with RUST_BACKTRACE=full to include source snippets.
  349. 77.55 s >
  350. 77.55 s > ------------
  351. 77.55 s > Summary [ 25.452s] 705 tests run: 704 passed, 1 failed, 60 skipped
  352. 77.55 s > FAIL [ 7.124s] (699/705) gammalooprs::test_renormalization finite_part_ghost_2loop
  353. 77.55 s > stdout ---
  354. 77.55 s >
  355. 77.55 s > running 1 test
  356. 77.55 s > test finite_part_ghost_2loop ... FAILED
  357. 77.55 s >
  358. 77.55 s > failures:
  359. 77.55 s >
  360. 77.55 s > failures:
  361. 77.55 s > finite_part_ghost_2loop
  362. 77.55 s >
  363. 77.55 s > test result: FAILED. 0 passed; 1 failed; 0 ignored; 0 measured; 6 filtered out; finished in 7.09s
  364. 77.55 s >
  365. 77.55 s > stderr ---
  366. 77.55 s > The application panicked (crashed).
  367. 77.55 s > Message: assertion failed: (align_to_rqft(&a, &model) - expected).expand().is_zero()
  368. 77.55 s > Location: crates/gammalooprs/tests/test_renormalization.rs:583
  369. 77.55 s >
  370. 77.55 s > ━━━━━━━━━━━━━━━━━━━━━━━━━━━━━━━━━━ BACKTRACE ━━━━━━━━━━━━━━━━━━━━━━━━━━━━━━━━━━━
  371. 77.55 s > 1: <color_eyre[51793ea62743adbd]::config::PanicHook>::panic_report<unknown>
  372. 77.55 s > at <unknown source file>:<unknown line>
  373. 77.55 s > 2: <color_eyre[51793ea62743adbd]::config::PanicHook>::into_panic_hook::{closure#0}<unknown>
  374. 77.55 s > at <unknown source file>:<unknown line>
  375. 77.55 s > 3: std[bcb96dfbba0ab899]::panicking::panic_with_hook<unknown>
  376. 77.55 s > at <unknown source file>:<unknown line>
  377. 77.55 s > 4: std[bcb96dfbba0ab899]::panicking::panic_handler::{closure#0}<unknown>
  378. 77.55 s > at <unknown source file>:<unknown line>
  379. 77.55 s > 5: std[bcb96dfbba0ab899]::sys::backtrace::__rust_end_short_backtrace::<std[bcb96dfbba0ab899]::panicking::panic_handler::{closure#0}, !><unknown>
  380. 77.55 s > at <unknown source file>:<unknown line>
  381. 77.55 s > 6: __rustc[6c289b9f9c454d21]::rust_begin_unwind<unknown>
  382. 77.55 s > at <unknown source file>:<unknown line>
  383. 77.55 s > 7: core[940e698046960fd5]::panicking::panic_fmt<unknown>
  384. 77.55 s > at <unknown source file>:<unknown line>
  385. 77.55 s > 8: core[940e698046960fd5]::panicking::panic<unknown>
  386. 77.55 s > at <unknown source file>:<unknown line>
  387. 77.55 s > 9: <test_renormalization[5812939ef1a04d89]::finite_part_ghost_2loop::{closure#0} as core[940e698046960fd5]::ops::function::FnOnce<()>>::call_once<unknown>
  388. 77.55 s > at <unknown source file>:<unknown line>
  389. 77.55 s > 10: test[75d6903177b1d7e9]::__rust_begin_short_backtrace::<core[940e698046960fd5]::result::Result<(), alloc[2ea6bcb46fca0c42]::string::String>, fn() -> core[940e698046960fd5]::result::Result<(), alloc[2ea6bcb46fca0c42]::string::String>><unknown>
  390. 77.55 s > at <unknown source file>:<unknown line>
  391. 77.55 s > 11: test[75d6903177b1d7e9]::run_test::{closure#0}<unknown>
  392. 77.55 s > at <unknown source file>:<unknown line>
  393. 77.55 s > 12: std[bcb96dfbba0ab899]::sys::backtrace::__rust_begin_short_backtrace::<test[75d6903177b1d7e9]::run_test::{closure#1}, ()><unknown>
  394. 77.55 s > at <unknown source file>:<unknown line>
  395. 77.55 s > 13: <std[bcb96dfbba0ab899]::thread::lifecycle::spawn_unchecked<test[75d6903177b1d7e9]::run_test::{closure#1}, ()>::{closure#1} as core[940e698046960fd5]::ops::function::FnOnce<()>>::call_once::{shim:vtable#0}<unknown>
  396. 77.55 s > at <unknown source file>:<unknown line>
  397. 77.55 s > 14: <std[bcb96dfbba0ab899]::sys::thread::unix::Thread>::new::thread_start<unknown>
  398. 77.55 s > at <unknown source file>:<unknown line>
  399. 77.55 s > 15: start_thread<unknown>
  400. 77.55 s > at <unknown source file>:<unknown line>
  401. 77.55 s > 16: __clone3<unknown>
  402. 77.55 s > at <unknown source file>:<unknown line>
  403. 77.55 s >
  404. 77.55 s > Run with COLORBT_SHOW_HIDDEN=1 environment variable to disable frame filtering.
  405. 77.55 s > Run with RUST_BACKTRACE=full to include source snippets.
  406. 77.55 s >
  407. 77.55 s > error: test run failed
  408. 77.55 s >
  409. 77.55 s > ========== nextest test summary ==========
  410. 77.55 s > report: target/nextest/ci_gammaloop/junit.xml
  411. 77.55 s > tests: 705, failures: 1, errors: 0
  412. 77.55 s >
  413. 77.55 s > 1. gammalooprs::test_renormalization::finite_part_ghost_2loop
  414. 77.55 s > failure: test failure with exit code 101
  415. 77.55 s > system-out
  416. 77.55 s > running 1 test
  417. 77.55 s > test finite_part_ghost_2loop ... FAILED
  418. 77.55 s >
  419. 77.55 s > failures:
  420. 77.55 s >
  421. 77.55 s > failures:
  422. 77.55 s > finite_part_ghost_2loop
  423. 77.55 s >
  424. 77.55 s > test result: FAILED. 0 passed; 1 failed; 0 ignored; 0 measured; 6 filtered out; finished in 7.09s
  425. 77.55 s > system-err
  426. 77.55 s > The application panicked (crashed).
  427. 77.55 s > Message: assertion failed: (align_to_rqft(&a, &model) - expected).expand().is_zero()
  428. 77.55 s > Location: crates/gammalooprs/tests/test_renormalization.rs:583
  429. 77.55 s >
  430. 77.55 s > ━━━━━━━━━━━━━━━━━━━━━━━━━━━━━━━━━━ BACKTRACE ━━━━━━━━━━━━━━━━━━━━━━━━━━━━━━━━━━━
  431. 77.55 s > 1: <color_eyre[51793ea62743adbd]::config::PanicHook>::panic_report<unknown>
  432. 77.55 s > at <unknown source file>:<unknown line>
  433. 77.55 s > 2: <color_eyre[51793ea62743adbd]::config::PanicHook>::into_panic_hook::{closure#0}<unknown>
  434. 77.55 s > at <unknown source file>:<unknown line>
  435. 77.55 s > 3: std[bcb96dfbba0ab899]::panicking::panic_with_hook<unknown>
  436. 77.55 s > at <unknown source file>:<unknown line>
  437. 77.55 s > 4: std[bcb96dfbba0ab899]::panicking::panic_handler::{closure#0}<unknown>
  438. 77.55 s > at <unknown source file>:<unknown line>
  439. 77.55 s > 5: std[bcb96dfbba0ab899]::sys::backtrace::__rust_end_short_backtrace::<std[bcb96dfbba0ab899]::panicking::panic_handler::{closure#0}, !><unknown>
  440. 77.55 s > at <unknown source file>:<unknown line>
  441. 77.55 s > 6: __rustc[6c289b9f9c454d21]::rust_begin_unwind<unknown>
  442. 77.55 s > at <unknown source file>:<unknown line>
  443. 77.55 s > 7: core[940e698046960fd5]::panicking::panic_fmt<unknown>
  444. 77.55 s > at <unknown source file>:<unknown line>
  445. 77.55 s > 8: core[940e698046960fd5]::panicking::panic<unknown>
  446. 77.55 s > at <unknown source file>:<unknown line>
  447. 77.55 s > 9: <test_renormalization[5812939ef1a04d89]::finite_part_ghost_2loop::{closure#0} as core[940e698046960fd5]::ops::function::FnOnce<()>>::call_once<unknown>
  448. 77.55 s > at <unknown source file>:<unknown line>
  449. 77.55 s > 10: test[75d6903177b1d7e9]::__rust_begin_short_backtrace::<core[940e698046960fd5]::result::Result<(), alloc[2ea6bcb46fca0c42]::string::String>, fn() -> core[940e698046960fd5]::result::Result<(), alloc[2ea6bcb46fca0c42]::string::String>><unknown>
  450. 77.55 s > at <unknown source file>:<unknown line>
  451. 77.55 s > 11: test[75d6903177b1d7e9]::run_test::{closure#0}<unknown>
  452. 77.55 s > at <unknown source file>:<unknown line>
  453. 77.55 s > 12: std[bcb96dfbba0ab899]::sys::backtrace::__rust_begin_short_backtrace::<test[75d6903177b1d7e9]::run_test::{closure#1}, ()><unknown>
  454. 77.55 s > at <unknown source file>:<unknown line>
  455. 77.55 s > 13: <std[bcb96dfbba0ab899]::thread::lifecycle::spawn_unchecked<test[75d6903177b1d7e9]::run_test::{closure#1}, ()>::{closure#1} as core[940e698046960fd5]::ops::function::FnOnce<()>>::call_once::{shim:vtable#0}<unknown>
  456. 77.55 s > at <unknown source file>:<unknown line>
  457. 77.55 s > 14: <std[bcb96dfbba0ab899]::sys::thread::unix::Thread>::new::thread_start<unknown>
  458. 77.55 s > at <unknown source file>:<unknown line>
  459. 77.55 s > 15: start_thread<unknown>
  460. 77.55 s > at <unknown source file>:<unknown line>
  461. 77.55 s > 16: __clone3<unknown>
  462. 77.55 s > at <unknown source file>:<unknown line>
  463. 77.55 s >
  464. 77.55 s > Run with COLORBT_SHOW_HIDDEN=1 environment variable to disable frame filtering.
  465. 77.55 s > Run with RUST_BACKTRACE=full to include source snippets.
  466. 77.55 s > =========================================
  467. 77.55 s > Extracting 1 binary, 1 build script output directory, and 1 linked path to /build/nextest-archive-DxP0Gw
  468. 77.55 s > Extracted 7 files to /build/nextest-archive-DxP0Gw in 0.09s
  469. 77.55 s > ------------
  470. 77.55 s > Nextest run ID 0e43f57d-cd43-4feb-9ab4-2a04abfcdbf0 with nextest profile: ci_gammaloop
  471. 77.55 s > Starting 105 tests across 1 binary
  472. 77.55 s > ------------
  473. 77.55 s > Summary [ 24.061s] 105 tests run: 105 passed, 0 skipped
  474. 77.55 s >
  475. 77.55 s > ========== nextest test summary ==========
  476. 77.55 s > report: target/nextest/ci_gammaloop/junit.xml
  477. 77.55 s > tests: 105, failures: 0, errors: 0
  478. 77.55 s > No failing testcases found.
  479. 77.55 s > =========================================
  480. 77.55 s For full logs, run:
  481. 77.55 s nix log /nix/store/n72shhl1iwhd9py98qq4wh1bk34sp0c7-gammaloop-nextest-core.drv
  482. 77.74 s [0 built (1 failed), 1 cRun failed.