1. 0.00 s $ /nix/store/9ypz3flqsrl5xl495mm8h645gadjsxi1-coreutils-9.11/bin/timeout --kill-after=15s 7200s /nix/store/23zk8sgzamrbmj1fday15szf7f2279s8-nix-2.34.7/bin/nix --extra-experimental-features nix-command --extra-experimental-features flakes flake clone git+https://github.com/alphal00p/gammaloop --dest /tmp/nix-ci-worker/stable-pwd/repo/
  2. 0.07 s Cloning into '/tmp/nix-ci-worker/stable-pwd/repo'...
  3. 1.71 s remote: Enumerating objects: 85981, done.
  4. 1.94 s remote: Counting objects: 0% (1/9102) remote: Counting objects: 1% (92/9102) remote: Counting objects: 2% (183/9102) remote: Counting objects: 3% (274/9102) remote: Counting objects: 4% (365/9102) remote: Counting objects: 5% (456/9102) remote: Counting objects: 6% (547/9102) remote: Counting objects: 7% (638/9102) remote: Counting objects: 8% (729/9102) remote: Counting objects: 9% (820/9102) remote: Counting objects: 10% (911/9102) remote: Counting objects: 11% (1002/9102) remote: Counting objects: 12% (1093/9102) remote: Counting objects: 13% (1184/9102) remote: Counting objects: 14% (1275/9102) remote: Counting objects: 15% (1366/9102) remote: Counting objects: 16% (1457/9102) remote: Counting objects: 17% (1548/9102) remote: Counting objects: 18% (1639/9102) remote: Counting objects: 19% (1730/9102) remote: Counting objects: 20% (1821/9102) remote: Counting objects: 21% (1912/9102) remote: Counting objects: 22% (2003/9102) remote: Counting objects: 23% (2094/9102) remote: Counting objects: 24% (2185/9102) remote: Counting objects: 25% (2276/9102) remote: Counting objects: 26% (2367/9102) remote: Counting objects: 27% (2458/9102) remote: Counting objects: 28% (2549/9102) remote: Counting objects: 29% (2640/9102) remote: Counting objects: 30% (2731/9102) remote: Counting objects: 31% (2822/9102) remote: Counting objects: 32% (2913/9102) remote: Counting objects: 33% (3004/9102) remote: Counting objects: 34% (3095/9102) remote: Counting objects: 35% (3186/9102) remote: Counting objects: 36% (3277/9102) remote: Counting objects: 37% (3368/9102) remote: Counting objects: 38% (3459/9102) remote: Counting objects: 39% (3550/9102) remote: Counting objects: 40% (3641/9102) remote: Counting objects: 41% (3732/9102) remote: Counting objects: 42% (3823/9102) remote: Counting objects: 43% (3914/9102) remote: Counting objects: 44% (4005/9102) remote: Counting objects: 45% (4096/9102) remote: Counting objects: 46% (4187/9102) remote: Counting objects: 47% (4278/9102) remote: Counting objects: 48% (4369/9102) remote: Counting objects: 49% (4460/9102) remote: Counting objects: 50% (4551/9102) remote: Counting objects: 51% (4643/9102) remote: Counting objects: 52% (4734/9102) remote: Counting objects: 53% (4825/9102) remote: Counting objects: 54% (4916/9102) remote: Counting objects: 55% (5007/9102) remote: Counting objects: 56% (5098/9102) remote: Counting objects: 57% (5189/9102) remote: Counting objects: 58% (5280/9102) remote: Counting objects: 59% (5371/9102) remote: Counting objects: 60% (5462/9102) remote: Counting objects: 61% (5553/9102) remote: Counting objects: 62% (5644/9102) remote: Counting objects: 63% (5735/9102) remote: Counting objects: 64% (5826/9102) remote: Counting objects: 65% (5917/9102) remote: Counting objects: 66% (6008/9102) remote: Counting objects: 67% (6099/9102) remote: Counting objects: 68% (6190/9102) remote: Counting objects: 69% (6281/9102) remote: Counting objects: 70% (6372/9102) remote: Counting objects: 71% (6463/9102) remote: Counting objects: 72% (6554/9102) remote: Counting objects: 73% (6645/9102) remote: Counting objects: 74% (6736/9102) remote: Counting objects: 75% (6827/9102) remote: Counting objects: 76% (6918/9102) remote: Counting objects: 77% (7009/9102) remote: Counting objects: 78% (7100/9102) remote: Counting objects: 79% (7191/9102) remote: Counting objects: 80% (7282/9102) remote: Counting objects: 81% (7373/9102) remote: Counting objects: 82% (7464/9102) remote: Counting objects: 83% (7555/9102) remote: Counting objects: 84% (7646/9102) remote: Counting objects: 85% (7737/9102) remote: Counting objects: 86% (7828/9102) remote: Counting objects: 87% (7919/9102) remote: Counting objects: 88% (8010/9102) remote: Counting objects: 89% (8101/9102) remote: Counting objects: 90% (8192/9102) remote: Counting objects: 91% (8283/9102) remote: Counting objects: 92% (8374/9102) remote: Counting objects: 93% (8465/9102) remote: Counting objects: 94% (8556/9102) remote: Counting objects: 95% (8647/9102) remote: Counting objects: 96% (8738/9102) remote: Counting objects: 97% (8829/9102) remote: Counting objects: 98% (8920/9102) remote: Counting objects: 99% (9011/9102) remote: Counting objects: 100% (9102/9102) remote: Counting objects: 100% (9102/9102), done.
  5. 3.87 s remote: Compressing objects: 0% (1/2031) remote: Compressing objects: 1% (21/2031) remote: Compressing objects: 2% (41/2031) remote: Compressing objects: 3% (61/2031) remote: Compressing objects: 4% (82/2031) remote: Compressing objects: 5% (102/2031) remote: Compressing objects: 6% (122/2031) remote: Compressing objects: 7% (143/2031) remote: Compressing objects: 8% (163/2031) remote: Compressing objects: 9% (183/2031) remote: Compressing objects: 10% (204/2031) remote: Compressing objects: 10% (219/2031) remote: Compressing objects: 11% (224/2031) remote: Compressing objects: 12% (244/2031) remote: Compressing objects: 13% (265/2031) remote: Compressing objects: 14% (285/2031) remote: Compressing objects: 15% (305/2031) remote: Compressing objects: 16% (325/2031) remote: Compressing objects: 17% (346/2031) remote: Compressing objects: 18% (366/2031) remote: Compressing objects: 19% (386/2031) remote: Compressing objects: 20% (407/2031) remote: Compressing objects: 21% (427/2031) remote: Compressing objects: 22% (447/2031) remote: Compressing objects: 23% (468/2031) remote: Compressing objects: 24% (488/2031) remote: Compressing objects: 25% (508/2031) remote: Compressing objects: 26% (529/2031) remote: Compressing objects: 27% (549/2031) remote: Compressing objects: 27% (558/2031) remote: Compressing objects: 28% (569/2031) remote: Compressing objects: 29% (589/2031) remote: Compressing objects: 30% (610/2031) remote: Compressing objects: 31% (630/2031) remote: Compressing objects: 32% (650/2031) remote: Compressing objects: 33% (671/2031) remote: Compressing objects: 34% (691/2031) remote: Compressing objects: 35% (711/2031) remote: Compressing objects: 36% (732/2031) remote: Compressing objects: 37% (752/2031) remote: Compressing objects: 38% (772/2031) remote: Compressing objects: 39% (793/2031) remote: Compressing objects: 40% (813/2031) remote: Compressing objects: 41% (833/2031) remote: Compressing objects: 42% (854/2031) remote: Compressing objects: 43% (874/2031) remote: Compressing objects: 44% (894/2031) remote: Compressing objects: 45% (914/2031) remote: Compressing objects: 46% (935/2031) remote: Compressing objects: 47% (955/2031) remote: Compressing objects: 48% (975/2031) remote: Compressing objects: 49% (996/2031) remote: Compressing objects: 50% (1016/2031) remote: Compressing objects: 51% (1036/2031) remote: Compressing objects: 52% (1057/2031) remote: Compressing objects: 53% (1077/2031) remote: Compressing objects: 54% (1097/2031) remote: Compressing objects: 55% (1118/2031) remote: Compressing objects: 56% (1138/2031) remote: Compressing objects: 57% (1158/2031) remote: Compressing objects: 58% (1178/2031) remote: Compressing objects: 59% (1199/2031) remote: Compressing objects: 60% (1219/2031) remote: Compressing objects: 61% (1239/2031) remote: Compressing objects: 62% (1260/2031) remote: Compressing objects: 63% (1280/2031) remote: Compressing objects: 64% (1300/2031) remote: Compressing objects: 65% (1321/2031) remote: Compressing objects: 66% (1341/2031) remote: Compressing objects: 67% (1361/2031) remote: Compressing objects: 68% (1382/2031) remote: Compressing objects: 69% (1402/2031) remote: Compressing objects: 70% (1422/2031) remote: Compressing objects: 71% (1443/2031) remote: Compressing objects: 72% (1463/2031) remote: Compressing objects: 73% (1483/2031) remote: Compressing objects: 74% (1503/2031) remote: Compressing objects: 75% (1524/2031) remote: Compressing objects: 76% (1544/2031) remote: Compressing objects: 77% (1564/2031) remote: Compressing objects: 78% (1585/2031) remote: Compressing objects: 79% (1605/2031) remote: Compressing objects: 80% (1625/2031) remote: Compressing objects: 81% (1646/2031) remote: Compressing objects: 82% (1666/2031) remote: Compressing objects: 83% (1686/2031) remote: Compressing objects: 84% (1707/2031) remote: Compressing objects: 85% (1727/2031) remote: Compressing objects: 86% (1747/2031) remote: Compressing objects: 87% (1767/2031) remote: Compressing objects: 88% (1788/2031) remote: Compressing objects: 89% (1808/2031) remote: Compressing objects: 90% (1828/2031) remote: Compressing objects: 91% (1849/2031) remote: Compressing objects: 92% (1869/2031) remote: Compressing objects: 93% (1889/2031) remote: Compressing objects: 94% (1910/2031) remote: Compressing objects: 95% (1930/2031) remote: Compressing objects: 96% (1950/2031) remote: Compressing objects: 97% (1971/2031) remote: Compressing objects: 98% (1991/2031) remote: Compressing objects: 99% (2011/2031) remote: Compressing objects: 100% (2031/2031) remote: Compressing objects: 100% (2031/2031), done.
  6. 9.26 s Receiving objects: 0% (1/85981) Receiving objects: 1% (860/85981) Receiving objects: 2% (1720/85981) Receiving objects: 3% (2580/85981) Receiving objects: 4% (3440/85981) Receiving objects: 5% (4300/85981) Receiving objects: 6% (5159/85981), 9.11 MiB | 18.19 MiB/s Receiving objects: 7% (6019/85981), 9.11 MiB | 18.19 MiB/s Receiving objects: 8% (6879/85981), 9.11 MiB | 18.19 MiB/s Receiving objects: 9% (7739/85981), 9.11 MiB | 18.19 MiB/s Receiving objects: 10% (8599/85981), 9.11 MiB | 18.19 MiB/s Receiving objects: 11% (9458/85981), 9.11 MiB | 18.19 MiB/s Receiving objects: 12% (10318/85981), 9.11 MiB | 18.19 MiB/s Receiving objects: 13% (11178/85981), 9.11 MiB | 18.19 MiB/s Receiving objects: 14% (12038/85981), 9.11 MiB | 18.19 MiB/s Receiving objects: 15% (12898/85981), 9.11 MiB | 18.19 MiB/s Receiving objects: 16% (13757/85981), 9.11 MiB | 18.19 MiB/s Receiving objects: 17% (14617/85981), 9.11 MiB | 18.19 MiB/s Receiving objects: 18% (15477/85981), 9.11 MiB | 18.19 MiB/s Receiving objects: 19% (16337/85981), 9.11 MiB | 18.19 MiB/s Receiving objects: 20% (17197/85981), 9.11 MiB | 18.19 MiB/s Receiving objects: 21% (18057/85981), 9.11 MiB | 18.19 MiB/s Receiving objects: 22% (18916/85981), 9.11 MiB | 18.19 MiB/s Receiving objects: 23% (19776/85981), 9.11 MiB | 18.19 MiB/s Receiving objects: 24% (20636/85981), 9.11 MiB | 18.19 MiB/s Receiving objects: 25% (21496/85981), 9.11 MiB | 18.19 MiB/s Receiving objects: 26% (22356/85981), 9.11 MiB | 18.19 MiB/s Receiving objects: 27% (23215/85981), 9.11 MiB | 18.19 MiB/s Receiving objects: 28% (24075/85981), 9.11 MiB | 18.19 MiB/s Receiving objects: 29% (24935/85981), 9.11 MiB | 18.19 MiB/s Receiving objects: 30% (25795/85981), 9.11 MiB | 18.19 MiB/s Receiving objects: 31% (26655/85981), 9.11 MiB | 18.19 MiB/s Receiving objects: 31% (26875/85981), 9.11 MiB | 18.19 MiB/s Receiving objects: 32% (27514/85981), 26.61 MiB | 26.60 MiB/s Receiving objects: 33% (28374/85981), 26.61 MiB | 26.60 MiB/s Receiving objects: 34% (29234/85981), 26.61 MiB | 26.60 MiB/s Receiving objects: 35% (30094/85981), 26.61 MiB | 26.60 MiB/s Receiving objects: 36% (30954/85981), 26.61 MiB | 26.60 MiB/s Receiving objects: 37% (31813/85981), 26.61 MiB | 26.60 MiB/s Receiving objects: 38% (32673/85981), 26.61 MiB | 26.60 MiB/s Receiving objects: 39% (33533/85981), 26.61 MiB | 26.60 MiB/s Receiving objects: 40% (34393/85981), 26.61 MiB | 26.60 MiB/s Receiving objects: 41% (35253/85981), 26.61 MiB | 26.60 MiB/s Receiving objects: 42% (36113/85981), 26.61 MiB | 26.60 MiB/s Receiving objects: 43% (36972/85981), 26.61 MiB | 26.60 MiB/s Receiving objects: 44% (37832/85981), 40.70 MiB | 27.13 MiB/s Receiving objects: 45% (38692/85981), 40.70 MiB | 27.13 MiB/s Receiving objects: 46% (39552/85981), 40.70 MiB | 27.13 MiB/s Receiving objects: 47% (40412/85981), 40.70 MiB | 27.13 MiB/s Receiving objects: 48% (41271/85981), 40.70 MiB | 27.13 MiB/s Receiving objects: 49% (42131/85981), 40.70 MiB | 27.13 MiB/s Receiving objects: 50% (42991/85981), 40.70 MiB | 27.13 MiB/s Receiving objects: 51% (43851/85981), 40.70 MiB | 27.13 MiB/s Receiving objects: 52% (44711/85981), 40.70 MiB | 27.13 MiB/s Receiving objects: 52% (45298/85981), 54.56 MiB | 27.27 MiB/s Receiving objects: 53% (45570/85981), 54.56 MiB | 27.27 MiB/s Receiving objects: 54% (46430/85981), 54.56 MiB | 27.27 MiB/s Receiving objects: 55% (47290/85981), 54.56 MiB | 27.27 MiB/s Receiving objects: 56% (48150/85981), 54.56 MiB | 27.27 MiB/s Receiving objects: 57% (49010/85981), 54.56 MiB | 27.27 MiB/s Receiving objects: 58% (49869/85981), 68.47 MiB | 27.39 MiB/s Receiving objects: 59% (50729/85981), 68.47 MiB | 27.39 MiB/s Receiving objects: 60% (51589/85981), 68.47 MiB | 27.39 MiB/s Receiving objects: 61% (52449/85981), 68.47 MiB | 27.39 MiB/s Receiving objects: 62% (53309/85981), 68.47 MiB | 27.39 MiB/s Receiving objects: 63% (54169/85981), 68.47 MiB | 27.39 MiB/s Receiving objects: 64% (55028/85981), 68.47 MiB | 27.39 MiB/s Receiving objects: 65% (55888/85981), 68.47 MiB | 27.39 MiB/s Receiving objects: 66% (56748/85981), 68.47 MiB | 27.39 MiB/s Receiving objects: 66% (57126/85981), 68.47 MiB | 27.39 MiB/s Receiving objects: 67% (57608/85981), 97.79 MiB | 27.94 MiB/s Receiving objects: 68% (58468/85981), 97.79 MiB | 27.94 MiB/s Receiving objects: 69% (59327/85981), 97.79 MiB | 27.94 MiB/s Receiving objects: 70% (60187/85981), 97.79 MiB | 27.94 MiB/s Receiving objects: 71% (61047/85981), 97.79 MiB | 27.94 MiB/s Receiving objects: 71% (61357/85981), 113.00 MiB | 28.25 MiB/s Receiving objects: 72% (61907/85981), 113.00 MiB | 28.25 MiB/s Receiving objects: 73% (62767/85981), 113.00 MiB | 28.25 MiB/s Receiving objects: 74% (63626/85981), 113.00 MiB | 28.25 MiB/s Receiving objects: 75% (64486/85981), 128.57 MiB | 28.56 MiB/s Receiving objects: 76% (65346/85981), 128.57 MiB | 28.56 MiB/s Receiving objects: 77% (66206/85981), 128.57 MiB | 28.56 MiB/s Receiving objects: 78% (67066/85981), 128.57 MiB | 28.56 MiB/s Receiving objects: 79% (67925/85981), 128.57 MiB | 28.56 MiB/s Receiving objects: 80% (68785/85981), 128.57 MiB | 28.56 MiB/s Receiving objects: 81% (69645/85981), 128.57 MiB | 28.56 MiB/s Receiving objects: 82% (70505/85981), 128.57 MiB | 28.56 MiB/s Receiving objects: 83% (71365/85981), 128.57 MiB | 28.56 MiB/s Receiving objects: 84% (72225/85981), 128.57 MiB | 28.56 MiB/s Receiving objects: 85% (73084/85981), 128.57 MiB | 28.56 MiB/s Receiving objects: 86% (73944/85981), 128.57 MiB | 28.56 MiB/s Receiving objects: 86% (74194/85981), 144.29 MiB | 30.03 MiB/s Receiving objects: 87% (74804/85981), 144.29 MiB | 30.03 MiB/s Receiving objects: 88% (75664/85981), 144.29 MiB | 30.03 MiB/s Receiving objects: 89% (76524/85981), 144.29 MiB | 30.03 MiB/s Receiving objects: 90% (77383/85981), 144.29 MiB | 30.03 MiB/s Receiving objects: 91% (78243/85981), 144.29 MiB | 30.03 MiB/s Receiving objects: 92% (79103/85981), 144.29 MiB | 30.03 MiB/s Receiving objects: 93% (79963/85981), 144.29 MiB | 30.03 MiB/s Receiving objects: 94% (80823/85981), 144.29 MiB | 30.03 MiB/s Receiving objects: 95% (81682/85981), 144.29 MiB | 30.03 MiB/s Receiving objects: 96% (82542/85981), 144.29 MiB | 30.03 MiB/s Receiving objects: 97% (83402/85981), 144.29 MiB | 30.03 MiB/s Receiving objects: 98% (84262/85981), 144.29 MiB | 30.03 MiB/s Receiving objects: 99% (85122/85981), 144.29 MiB | 30.03 MiB/s remote: Total 85981 (delta 7917), reused 7189 (delta 7071), pack-reused 76879 (from 3)
  7. 9.26 s Receiving objects: 100% (85981/85981), 144.29 MiB | 30.03 MiB/s Receiving objects: 100% (85981/85981), 155.92 MiB | 29.01 MiB/s, done.
  8. 10.88 s Resolving deltas: 0% (0/58337) Resolving deltas: 1% (585/58337) Resolving deltas: 2% (1167/58337) Resolving deltas: 3% (1751/58337) Resolving deltas: 4% (2334/58337) Resolving deltas: 5% (2917/58337) Resolving deltas: 6% (3501/58337) Resolving deltas: 7% (4084/58337) Resolving deltas: 8% (4667/58337) Resolving deltas: 9% (5251/58337) Resolving deltas: 10% (5834/58337) Resolving deltas: 11% (6418/58337) Resolving deltas: 12% (7001/58337) Resolving deltas: 13% (7584/58337) Resolving deltas: 14% (8168/58337) Resolving deltas: 15% (8752/58337) Resolving deltas: 16% (9334/58337) Resolving deltas: 17% (9918/58337) Resolving deltas: 18% (10501/58337) Resolving deltas: 19% (11085/58337) Resolving deltas: 20% (11668/58337) Resolving deltas: 21% (12251/58337) Resolving deltas: 22% (12836/58337) Resolving deltas: 23% (13418/58337) Resolving deltas: 24% (14001/58337) Resolving deltas: 25% (14585/58337) Resolving deltas: 26% (15168/58337) Resolving deltas: 27% (15751/58337) Resolving deltas: 28% (16335/58337) Resolving deltas: 29% (16918/58337) Resolving deltas: 30% (17502/58337) Resolving deltas: 31% (18085/58337) Resolving deltas: 32% (18668/58337) Resolving deltas: 33% (19252/58337) Resolving deltas: 34% (19835/58337) Resolving deltas: 35% (20418/58337) Resolving deltas: 36% (21002/58337) Resolving deltas: 37% (21588/58337) Resolving deltas: 38% (22169/58337) Resolving deltas: 39% (22752/58337) Resolving deltas: 40% (23335/58337) Resolving deltas: 41% (23919/58337) Resolving deltas: 42% (24502/58337) Resolving deltas: 43% (25086/58337) Resolving deltas: 44% (25669/58337) Resolving deltas: 45% (26252/58337) Resolving deltas: 46% (26836/58337) Resolving deltas: 47% (27419/58337) Resolving deltas: 48% (28002/58337) Resolving deltas: 49% (28586/58337) Resolving deltas: 50% (29169/58337) Resolving deltas: 51% (29752/58337) Resolving deltas: 52% (30336/58337) Resolving deltas: 53% (30920/58337) Resolving deltas: 54% (31502/58337) Resolving deltas: 55% (32086/58337) Resolving deltas: 56% (32669/58337) Resolving deltas: 57% (33253/58337) Resolving deltas: 58% (33836/58337) Resolving deltas: 59% (34419/58337) Resolving deltas: 60% (35003/58337) Resolving deltas: 61% (35586/58337) Resolving deltas: 62% (36169/58337) Resolving deltas: 63% (36754/58337) Resolving deltas: 64% (37336/58337) Resolving deltas: 65% (37920/58337) Resolving deltas: 65% (38068/58337) Resolving deltas: 66% (38503/58337) Resolving deltas: 67% (39086/58337) Resolving deltas: 68% (39670/58337) Resolving deltas: 69% (40253/58337) Resolving deltas: 70% (40836/58337) Resolving deltas: 71% (41420/58337) Resolving deltas: 72% (42003/58337) Resolving deltas: 73% (42587/58337) Resolving deltas: 74% (43170/58337) Resolving deltas: 75% (43753/58337) Resolving deltas: 76% (44337/58337) Resolving deltas: 77% (44921/58337) Resolving deltas: 78% (45503/58337) Resolving deltas: 79% (46087/58337) Resolving deltas: 80% (46671/58337) Resolving deltas: 81% (47254/58337) Resolving deltas: 82% (47838/58337) Resolving deltas: 83% (48421/58337) Resolving deltas: 84% (49004/58337) Resolving deltas: 85% (49587/58337) Resolving deltas: 86% (50170/58337) Resolving deltas: 87% (50754/58337) Resolving deltas: 88% (51337/58337) Resolving deltas: 89% (51920/58337) Resolving deltas: 90% (52504/58337) Resolving deltas: 91% (53091/58337) Resolving deltas: 92% (53671/58337) Resolving deltas: 93% (54254/58337) Resolving deltas: 94% (54837/58337) Resolving deltas: 95% (55423/58337) Resolving deltas: 96% (56004/58337) Resolving deltas: 97% (56587/58337) Resolving deltas: 98% (57171/58337) Resolving deltas: 99% (57754/58337) Resolving deltas: 100% (58337/58337) Resolving deltas: 100% (58337/58337), done.
  9. 11.27 s Fetching commit 6efe16006e3ada28dd6362b222df949838f20c87 for faster_uv_from_4d ...
  10. 11.27 s $ /nix/store/bcnisk3ydfgv26v2gw3zlky24g00yww2-git-2.54.0/bin/git fetch origin 6efe16006e3ada28dd6362b222df949838f20c87
  11. 11.74 s From https://github.com/alphal00p/gammaloop
  12. 11.74 s * branch 6efe16006e3ada28dd6362b222df949838f20c87 -> FETCH_HEAD
  13. 11.75 s $ /nix/store/9ypz3flqsrl5xl495mm8h645gadjsxi1-coreutils-9.11/bin/timeout --kill-after=15s 7200s /nix/store/bcnisk3ydfgv26v2gw3zlky24g00yww2-git-2.54.0/bin/git -c advice.detachedHead=false checkout 6efe16006e3ada28dd6362b222df949838f20c87
  14. 12.04 s HEAD is now at 6efe16006 resolve scalar aliases through typed store indices
  15. 12.04 s $ /nix/store/9ypz3flqsrl5xl495mm8h645gadjsxi1-coreutils-9.11/bin/timeout --kill-after=15s 7200s /nix/store/23zk8sgzamrbmj1fday15szf7f2279s8-nix-2.34.7/bin/nix --extra-experimental-features nix-command --extra-experimental-features flakes --log-format internal-json run .#packages.x86_64-linux.nix-ci-check-gammaloop-nextest-core --print-build-logs
  16. 16.75 s
  17. 16.92 s Downloading cached gammaloop-nextest-binaries-core-gammaloop-api from https://cache.nix-ci.com
  18. 16.92 s Downloading cached gammaloop-nextest-binaries-core-gammaloop-tracing-filter from https://cache.nix-ci.com
  19. 16.92 s Downloading cached gammaloop-nextest-binaries-core-gammalooprs from https://cache.nix-ci.com
  20. 17.34 s Downloaded cached gammaloop-nextest-binaries-core-gammaloop-tracing-filter (8.1 MiB) in 414ms
  21. 17.34 s Progress: 0 of 1 built, 1 of 5 downloaded from cache (2 downloading)
  22. 19.80 s Downloaded cached gammaloop-nextest-binaries-core-gammaloop-api (120.9 MiB) in 2.8s
  23. 19.80 s Progress: 0 of 1 built, 2 of 5 downloaded from cache (1 downloading)
  24. 20.03 s Downloaded cached gammaloop-nextest-binaries-core-gammalooprs (88.3 MiB) in 3.1s
  25. 20.03 s Progress: 0 of 1 built, 3 of 5 downloaded from cache
  26. 20.03 s Downloading cached gammaloop-nextest-binaries-core from https://cache.nix-ci.com
  27. 20.08 s Downloaded cached gammaloop-nextest-binaries-core (2032 B) in 41ms
  28. 20.08 s Progress: 0 of 1 built, 4 of 5 downloaded from cache
  29. 20.08 s Downloading cached nix-ci-check-gammaloop-nextest-core from https://cache.nix-ci.com
  30. 20.12 s Downloaded cached nix-ci-check-gammaloop-nextest-core (1016 B) in 41ms
  31. 20.12 s Progress: 0 of 1 built, 5 of 5 downloaded from cache
  32. 25.46 s evaluating derivation 'g copying '/nix/store/wx8c evaluating derivation 'g copying '/nix/store/wx8c evaluating derivation 'g copying '/nix/store/wx8c evaluating derivation 'g copying '/nix/store/wx8c evaluating derivation 'g copying '/nix/store/wx8c evaluating derivation 'g copying '/nix/store/wx8c evaluating derivation 'g copying '/nix/store/wx8c evaluating derivation 'g copying '/nix/store/wx8c evaluating derivation 'g querying gammaloop-nexte [0/1 built, 0.0 KiB DL] [1/0/1 built, 0.0 KiB DLgammaloop-nextest-core> Extracting 4 binaries (including 1 non-test binary), 1 build script output directory, and 2 linked paths to /build/nextest-archive-cCNKzV
  33. 26.17 s gammaloop-nextest-core> Extracted 20 files to /build/nextest-archive-cCNKzV in 0.71s
  34. 26.18 s gammaloop-nextest-core> ------------
  35. 26.18 s gammaloop-nextest-core> Nextest run ID 2e0e7fe0-e2a5-4678-90d4-15375fb51437 with nextest profile: ci_gammaloop
  36. 26.18 s gammaloop-nextest-core> Starting 379 tests across 3 binaries
  37. 27.56 s gammaloop-nextest-core> ------------
  38. 27.56 s gammaloop-nextest-core> Summary [ 1.376s] 379 tests run: 379 passed, 0 skipped
  39. 27.68 s gammaloop-nextest-core>
  40. 27.68 s gammaloop-nextest-core> ========== nextest test summary ==========
  41. 27.68 s gammaloop-nextest-core> report: target/nextest/ci_gammaloop/junit.xml
  42. 27.68 s gammaloop-nextest-core> tests: 379, failures: 0, errors: 0
  43. 27.68 s gammaloop-nextest-core> No failing testcases found.
  44. 27.68 s gammaloop-nextest-core> =========================================
  45. 27.69 s gammaloop-nextest-core> Extracting 1 binary and 1 linked path to /build/nextest-archive-AzCNcC
  46. 27.76 s gammaloop-nextest-core> Extracted 7 files to /build/nextest-archive-AzCNcC in 0.07s
  47. 27.77 s gammaloop-nextest-core> ------------
  48. 27.77 s gammaloop-nextest-core> Nextest run ID 0d341ba3-8234-493e-abc0-67dcb6dd2251 with nextest profile: ci_gammaloop
  49. 27.77 s gammaloop-nextest-core> Starting 19 tests across 1 binary
  50. 27.78 s gammaloop-nextest-core> ------------
  51. 27.78 s gammaloop-nextest-core> Summary [ 0.011s] 19 tests run: 19 passed, 0 skipped
  52. 27.82 s gammaloop-nextest-core>
  53. 27.82 s gammaloop-nextest-core> ========== nextest test summary ==========
  54. 27.82 s gammaloop-nextest-core> report: target/nextest/ci_gammaloop/junit.xml
  55. 27.82 s gammaloop-nextest-core> tests: 19, failures: 0, errors: 0
  56. 27.82 s gammaloop-nextest-core> No failing testcases found.
  57. 27.82 s gammaloop-nextest-core> =========================================
  58. 27.83 s gammaloop-nextest-core> Extracting 1 binary to /build/nextest-archive-Yp8VOl
  59. 27.87 s gammaloop-nextest-core> Extracted 4 files to /build/nextest-archive-Yp8VOl in 0.04s
  60. 27.88 s gammaloop-nextest-core> ------------
  61. 27.88 s gammaloop-nextest-core> Nextest run ID 4e5316e2-d3ae-46ec-a875-dc1ba6917bcf with nextest profile: ci_gammaloop
  62. 27.88 s gammaloop-nextest-core> Starting 0 tests across 1 binary
  63. 27.88 s gammaloop-nextest-core> ------------
  64. 27.88 s gammaloop-nextest-core> Summary [ 0.000s] 0 tests run: 0 passed, 0 skipped
  65. 27.91 s gammaloop-nextest-core>
  66. 27.91 s gammaloop-nextest-core> ========== nextest test summary ==========
  67. 27.91 s gammaloop-nextest-core> report: target/nextest/ci_gammaloop/junit.xml
  68. 27.91 s gammaloop-nextest-core> tests: 0, failures: 0, errors: 0
  69. 27.91 s gammaloop-nextest-core> No failing testcases found.
  70. 27.91 s gammaloop-nextest-core> =========================================
  71. 27.93 s gammaloop-nextest-core> Extracting 4 binaries, 1 build script output directory, and 2 linked paths to /build/nextest-archive-VzwJ0B
  72. 28.39 s gammaloop-nextest-core> Extracted 18 files to /build/nextest-archive-VzwJ0B in 0.47s
  73. 28.41 s gammaloop-nextest-core> ------------
  74. 28.41 s gammaloop-nextest-core> Nextest run ID 584b99a1-040e-4255-bf40-ab05d50df6ce with nextest profile: ci_gammaloop
  75. 28.41 s gammaloop-nextest-core> Starting 706 tests across 4 binaries (60 tests skipped, including 59 tests via profile.ci_gammaloop.default-filter)
  76. 35.38 s gammaloop-nextest-core> FAIL [ 3.335s] (701/706) gammalooprs::test_renormalization finite_part_ghost_2loop
  77. 35.38 s gammaloop-nextest-core> stdout ---
  78. 35.38 s gammaloop-nextest-core>
  79. 35.38 s gammaloop-nextest-core> running 1 test
  80. 35.38 s gammaloop-nextest-core> test finite_part_ghost_2loop ... FAILED
  81. 35.38 s gammaloop-nextest-core>
  82. 35.38 s gammaloop-nextest-core> failures:
  83. 35.38 s gammaloop-nextest-core>
  84. 35.38 s gammaloop-nextest-core> failures:
  85. 35.38 s gammaloop-nextest-core> finite_part_ghost_2loop
  86. 35.38 s gammaloop-nextest-core>
  87. 35.38 s gammaloop-nextest-core> test result: FAILED. 0 passed; 1 failed; 0 ignored; 0 measured; 6 filtered out; finished in 3.31s
  88. 35.38 s gammaloop-nextest-core>
  89. 35.38 s gammaloop-nextest-core> stderr ---
  90. 35.38 s gammaloop-nextest-core> The application panicked (crashed).
  91. 35.38 s gammaloop-nextest-core> Message: assertion failed: (align_to_rqft(&a, &model) - expected).expand().is_zero()
  92. 35.38 s gammaloop-nextest-core> Location: crates/gammalooprs/tests/test_renormalization.rs:583
  93. 35.38 s gammaloop-nextest-core>
  94. 35.38 s gammaloop-nextest-core> ━━━━━━━━━━━━━━━━━━━━━━━━━━━━━━━━━━ BACKTRACE ━━━━━━━━━━━━━━━━━━━━━━━━━━━━━━━━━━━
  95. 35.38 s gammaloop-nextest-core> 1: <color_eyre[51793ea62743adbd]::config::PanicHook>::panic_report<unknown>
  96. 35.38 s gammaloop-nextest-core> at <unknown source file>:<unknown line>
  97. 35.38 s gammaloop-nextest-core> 2: <color_eyre[51793ea62743adbd]::config::PanicHook>::into_panic_hook::{closure#0}<unknown>
  98. 35.38 s gammaloop-nextest-core> at <unknown source file>:<unknown line>
  99. 35.38 s gammaloop-nextest-core> 3: std[bcb96dfbba0ab899]::panicking::panic_with_hook<unknown>
  100. 35.38 s gammaloop-nextest-core> at <unknown source file>:<unknown line>
  101. 35.38 s gammaloop-nextest-core> 4: std[bcb96dfbba0ab899]::panicking::panic_handler::{closure#0}<unknown>
  102. 35.38 s gammaloop-nextest-core> at <unknown source file>:<unknown line>
  103. 35.38 s gammaloop-nextest-core> 5: std[bcb96dfbba0ab899]::sys::backtrace::__rust_end_short_backtrace::<std[bcb96dfbba0ab899]::panicking::panic_handler::{closure#0}, !><unknown>
  104. 35.38 s gammaloop-nextest-core> at <unknown source file>:<unknown line>
  105. 35.38 s gammaloop-nextest-core> 6: __rustc[6c289b9f9c454d21]::rust_begin_unwind<unknown>
  106. 35.38 s gammaloop-nextest-core> at <unknown source file>:<unknown line>
  107. 35.38 s gammaloop-nextest-core> 7: core[940e698046960fd5]::panicking::panic_fmt<unknown>
  108. 35.38 s gammaloop-nextest-core> at <unknown source file>:<unknown line>
  109. 35.38 s gammaloop-nextest-core> 8: core[940e698046960fd5]::panicking::panic<unknown>
  110. 35.38 s gammaloop-nextest-core> at <unknown source file>:<unknown line>
  111. 35.38 s gammaloop-nextest-core> 9: <test_renormalization[5812939ef1a04d89]::finite_part_ghost_2loop::{closure#0} as core[940e698046960fd5]::ops::function::FnOnce<()>>::call_once<unknown>
  112. 35.38 s gammaloop-nextest-core> at <unknown source file>:<unknown line>
  113. 35.38 s gammaloop-nextest-core> 10: test[75d6903177b1d7e9]::__rust_begin_short_backtrace::<core[940e698046960fd5]::result::Result<(), alloc[2ea6bcb46fca0c42]::string::String>, fn() -> core[940e698046960fd5]::result::Result<(), alloc[2ea6bcb46fca0c42]::string::String>><unknown>
  114. 35.38 s gammaloop-nextest-core> at <unknown source file>:<unknown line>
  115. 35.38 s gammaloop-nextest-core> 11: test[75d6903177b1d7e9]::run_test::{closure#0}<unknown>
  116. 35.38 s gammaloop-nextest-core> at <unknown source file>:<unknown line>
  117. 35.38 s gammaloop-nextest-core> 12: std[bcb96dfbba0ab899]::sys::backtrace::__rust_begin_short_backtrace::<test[75d6903177b1d7e9]::run_test::{closure#1}, ()><unknown>
  118. 35.38 s gammaloop-nextest-core> at <unknown source file>:<unknown line>
  119. 35.38 s gammaloop-nextest-core> 13: <std[bcb96dfbba0ab899]::thread::lifecycle::spawn_unchecked<test[75d6903177b1d7e9]::run_test::{closure#1}, ()>::{closure#1} as core[940e698046960fd5]::ops::function::FnOnce<()>>::call_once::{shim:vtable#0}<unknown>
  120. 35.38 s gammaloop-nextest-core> at <unknown source file>:<unknown line>
  121. 35.38 s gammaloop-nextest-core> 14: <std[bcb96dfbba0ab899]::sys::thread::unix::Thread>::new::thread_start<unknown>
  122. 35.38 s gammaloop-nextest-core> at <unknown source file>:<unknown line>
  123. 35.38 s gammaloop-nextest-core> 15: start_thread<unknown>
  124. 35.38 s gammaloop-nextest-core> at <unknown source file>:<unknown line>
  125. 35.38 s gammaloop-nextest-core> 16: __clone3<unknown>
  126. 35.38 s gammaloop-nextest-core> at <unknown source file>:<unknown line>
  127. 35.38 s gammaloop-nextest-core>
  128. 35.38 s gammaloop-nextest-core> Run with COLORBT_SHOW_HIDDEN=1 environment variable to disable frame filtering.
  129. 35.38 s gammaloop-nextest-core> Run with RUST_BACKTRACE=full to include source snippets.
  130. 35.38 s gammaloop-nextest-core>
  131. 39.77 s gammaloop-nextest-core> ------------
  132. 39.77 s gammaloop-nextest-core> Summary [ 11.365s] 706 tests run: 705 passed, 1 failed, 60 skipped
  133. 39.77 s gammaloop-nextest-core> FAIL [ 3.335s] (701/706) gammalooprs::test_renormalization finite_part_ghost_2loop
  134. 39.77 s gammaloop-nextest-core> stdout ---
  135. 39.77 s gammaloop-nextest-core>
  136. 39.77 s gammaloop-nextest-core> running 1 test
  137. 39.77 s gammaloop-nextest-core> test finite_part_ghost_2loop ... FAILED
  138. 39.77 s gammaloop-nextest-core>
  139. 39.77 s gammaloop-nextest-core> failures:
  140. 39.77 s gammaloop-nextest-core>
  141. 39.77 s gammaloop-nextest-core> failures:
  142. 39.77 s gammaloop-nextest-core> finite_part_ghost_2loop
  143. 39.77 s gammaloop-nextest-core>
  144. 39.77 s gammaloop-nextest-core> test result: FAILED. 0 passed; 1 failed; 0 ignored; 0 measured; 6 filtered out; finished in 3.31s
  145. 39.77 s gammaloop-nextest-core>
  146. 39.77 s gammaloop-nextest-core> stderr ---
  147. 39.77 s gammaloop-nextest-core> The application panicked (crashed).
  148. 39.77 s gammaloop-nextest-core> Message: assertion failed: (align_to_rqft(&a, &model) - expected).expand().is_zero()
  149. 39.77 s gammaloop-nextest-core> Location: crates/gammalooprs/tests/test_renormalization.rs:583
  150. 39.77 s gammaloop-nextest-core>
  151. 39.77 s gammaloop-nextest-core> ━━━━━━━━━━━━━━━━━━━━━━━━━━━━━━━━━━ BACKTRACE ━━━━━━━━━━━━━━━━━━━━━━━━━━━━━━━━━━━
  152. 39.77 s gammaloop-nextest-core> 1: <color_eyre[51793ea62743adbd]::config::PanicHook>::panic_report<unknown>
  153. 39.77 s gammaloop-nextest-core> at <unknown source file>:<unknown line>
  154. 39.77 s gammaloop-nextest-core> 2: <color_eyre[51793ea62743adbd]::config::PanicHook>::into_panic_hook::{closure#0}<unknown>
  155. 39.77 s gammaloop-nextest-core> at <unknown source file>:<unknown line>
  156. 39.77 s gammaloop-nextest-core> 3: std[bcb96dfbba0ab899]::panicking::panic_with_hook<unknown>
  157. 39.77 s gammaloop-nextest-core> at <unknown source file>:<unknown line>
  158. 39.77 s gammaloop-nextest-core> 4: std[bcb96dfbba0ab899]::panicking::panic_handler::{closure#0}<unknown>
  159. 39.77 s gammaloop-nextest-core> at <unknown source file>:<unknown line>
  160. 39.77 s gammaloop-nextest-core> 5: std[bcb96dfbba0ab899]::sys::backtrace::__rust_end_short_backtrace::<std[bcb96dfbba0ab899]::panicking::panic_handler::{closure#0}, !><unknown>
  161. 39.77 s gammaloop-nextest-core> at <unknown source file>:<unknown line>
  162. 39.77 s gammaloop-nextest-core> 6: __rustc[6c289b9f9c454d21]::rust_begin_unwind<unknown>
  163. 39.77 s gammaloop-nextest-core> at <unknown source file>:<unknown line>
  164. 39.77 s gammaloop-nextest-core> 7: core[940e698046960fd5]::panicking::panic_fmt<unknown>
  165. 39.77 s gammaloop-nextest-core> at <unknown source file>:<unknown line>
  166. 39.77 s gammaloop-nextest-core> 8: core[940e698046960fd5]::panicking::panic<unknown>
  167. 39.77 s gammaloop-nextest-core> at <unknown source file>:<unknown line>
  168. 39.77 s gammaloop-nextest-core> 9: <test_renormalization[5812939ef1a04d89]::finite_part_ghost_2loop::{closure#0} as core[940e698046960fd5]::ops::function::FnOnce<()>>::call_once<unknown>
  169. 39.77 s gammaloop-nextest-core> at <unknown source file>:<unknown line>
  170. 39.77 s gammaloop-nextest-core> 10: test[75d6903177b1d7e9]::__rust_begin_short_backtrace::<core[940e698046960fd5]::result::Result<(), alloc[2ea6bcb46fca0c42]::string::String>, fn() -> core[940e698046960fd5]::result::Result<(), alloc[2ea6bcb46fca0c42]::string::String>><unknown>
  171. 39.77 s gammaloop-nextest-core> at <unknown source file>:<unknown line>
  172. 39.77 s gammaloop-nextest-core> 11: test[75d6903177b1d7e9]::run_test::{closure#0}<unknown>
  173. 39.77 s gammaloop-nextest-core> at <unknown source file>:<unknown line>
  174. 39.77 s gammaloop-nextest-core> 12: std[bcb96dfbba0ab899]::sys::backtrace::__rust_begin_short_backtrace::<test[75d6903177b1d7e9]::run_test::{closure#1}, ()><unknown>
  175. 39.77 s gammaloop-nextest-core> at <unknown source file>:<unknown line>
  176. 39.77 s gammaloop-nextest-core> 13: <std[bcb96dfbba0ab899]::thread::lifecycle::spawn_unchecked<test[75d6903177b1d7e9]::run_test::{closure#1}, ()>::{closure#1} as core[940e698046960fd5]::ops::function::FnOnce<()>>::call_once::{shim:vtable#0}<unknown>
  177. 39.77 s gammaloop-nextest-core> at <unknown source file>:<unknown line>
  178. 39.77 s gammaloop-nextest-core> 14: <std[bcb96dfbba0ab899]::sys::thread::unix::Thread>::new::thread_start<unknown>
  179. 39.77 s gammaloop-nextest-core> at <unknown source file>:<unknown line>
  180. 39.77 s gammaloop-nextest-core> 15: start_thread<unknown>
  181. 39.77 s gammaloop-nextest-core> at <unknown source file>:<unknown line>
  182. 39.77 s gammaloop-nextest-core> 16: __clone3<unknown>
  183. 39.77 s gammaloop-nextest-core> at <unknown source file>:<unknown line>
  184. 39.77 s gammaloop-nextest-core>
  185. 39.77 s gammaloop-nextest-core> Run with COLORBT_SHOW_HIDDEN=1 environment variable to disable frame filtering.
  186. 39.77 s gammaloop-nextest-core> Run with RUST_BACKTRACE=full to include source snippets.
  187. 39.77 s gammaloop-nextest-core>
  188. 39.84 s gammaloop-nextest-core> error: test run failed
  189. 39.87 s gammaloop-nextest-core>
  190. 39.87 s gammaloop-nextest-core> ========== nextest test summary ==========
  191. 39.87 s gammaloop-nextest-core> report: target/nextest/ci_gammaloop/junit.xml
  192. 39.87 s gammaloop-nextest-core> tests: 706, failures: 1, errors: 0
  193. 39.87 s gammaloop-nextest-core>
  194. 39.87 s gammaloop-nextest-core> 1. gammalooprs::test_renormalization::finite_part_ghost_2loop
  195. 39.87 s gammaloop-nextest-core> failure: test failure with exit code 101
  196. 39.87 s gammaloop-nextest-core> system-out
  197. 39.87 s gammaloop-nextest-core> running 1 test
  198. 39.87 s gammaloop-nextest-core> test finite_part_ghost_2loop ... FAILED
  199. 39.87 s gammaloop-nextest-core>
  200. 39.87 s gammaloop-nextest-core> failures:
  201. 39.87 s gammaloop-nextest-core>
  202. 39.87 s gammaloop-nextest-core> failures:
  203. 39.87 s gammaloop-nextest-core> finite_part_ghost_2loop
  204. 39.87 s gammaloop-nextest-core>
  205. 39.87 s gammaloop-nextest-core> test result: FAILED. 0 passed; 1 failed; 0 ignored; 0 measured; 6 filtered out; finished in 3.31s
  206. 39.87 s gammaloop-nextest-core> system-err
  207. 39.87 s gammaloop-nextest-core> The application panicked (crashed).
  208. 39.87 s gammaloop-nextest-core> Message: assertion failed: (align_to_rqft(&a, &model) - expected).expand().is_zero()
  209. 39.87 s gammaloop-nextest-core> Location: crates/gammalooprs/tests/test_renormalization.rs:583
  210. 39.87 s gammaloop-nextest-core>
  211. 39.87 s gammaloop-nextest-core> ━━━━━━━━━━━━━━━━━━━━━━━━━━━━━━━━━━ BACKTRACE ━━━━━━━━━━━━━━━━━━━━━━━━━━━━━━━━━━━
  212. 39.87 s gammaloop-nextest-core> 1: <color_eyre[51793ea62743adbd]::config::PanicHook>::panic_report<unknown>
  213. 39.87 s gammaloop-nextest-core> at <unknown source file>:<unknown line>
  214. 39.87 s gammaloop-nextest-core> 2: <color_eyre[51793ea62743adbd]::config::PanicHook>::into_panic_hook::{closure#0}<unknown>
  215. 39.87 s gammaloop-nextest-core> at <unknown source file>:<unknown line>
  216. 39.87 s gammaloop-nextest-core> 3: std[bcb96dfbba0ab899]::panicking::panic_with_hook<unknown>
  217. 39.87 s gammaloop-nextest-core> at <unknown source file>:<unknown line>
  218. 39.87 s gammaloop-nextest-core> 4: std[bcb96dfbba0ab899]::panicking::panic_handler::{closure#0}<unknown>
  219. 39.87 s gammaloop-nextest-core> at <unknown source file>:<unknown line>
  220. 39.87 s gammaloop-nextest-core> 5: std[bcb96dfbba0ab899]::sys::backtrace::__rust_end_short_backtrace::<std[bcb96dfbba0ab899]::panicking::panic_handler::{closure#0}, !><unknown>
  221. 39.87 s gammaloop-nextest-core> at <unknown source file>:<unknown line>
  222. 39.87 s gammaloop-nextest-core> 6: __rustc[6c289b9f9c454d21]::rust_begin_unwind<unknown>
  223. 39.87 s gammaloop-nextest-core> at <unknown source file>:<unknown line>
  224. 39.87 s gammaloop-nextest-core> 7: core[940e698046960fd5]::panicking::panic_fmt<unknown>
  225. 39.87 s gammaloop-nextest-core> at <unknown source file>:<unknown line>
  226. 39.87 s gammaloop-nextest-core> 8: core[940e698046960fd5]::panicking::panic<unknown>
  227. 39.87 s gammaloop-nextest-core> at <unknown source file>:<unknown line>
  228. 39.87 s gammaloop-nextest-core> 9: <test_renormalization[5812939ef1a04d89]::finite_part_ghost_2loop::{closure#0} as core[940e698046960fd5]::ops::function::FnOnce<()>>::call_once<unknown>
  229. 39.87 s gammaloop-nextest-core> at <unknown source file>:<unknown line>
  230. 39.87 s gammaloop-nextest-core> 10: test[75d6903177b1d7e9]::__rust_begin_short_backtrace::<core[940e698046960fd5]::result::Result<(), alloc[2ea6bcb46fca0c42]::string::String>, fn() -> core[940e698046960fd5]::result::Result<(), alloc[2ea6bcb46fca0c42]::string::String>><unknown>
  231. 39.87 s gammaloop-nextest-core> at <unknown source file>:<unknown line>
  232. 39.87 s gammaloop-nextest-core> 11: test[75d6903177b1d7e9]::run_test::{closure#0}<unknown>
  233. 39.87 s gammaloop-nextest-core> at <unknown source file>:<unknown line>
  234. 39.87 s gammaloop-nextest-core> 12: std[bcb96dfbba0ab899]::sys::backtrace::__rust_begin_short_backtrace::<test[75d6903177b1d7e9]::run_test::{closure#1}, ()><unknown>
  235. 39.87 s gammaloop-nextest-core> at <unknown source file>:<unknown line>
  236. 39.87 s gammaloop-nextest-core> 13: <std[bcb96dfbba0ab899]::thread::lifecycle::spawn_unchecked<test[75d6903177b1d7e9]::run_test::{closure#1}, ()>::{closure#1} as core[940e698046960fd5]::ops::function::FnOnce<()>>::call_once::{shim:vtable#0}<unknown>
  237. 39.87 s gammaloop-nextest-core> at <unknown source file>:<unknown line>
  238. 39.87 s gammaloop-nextest-core> 14: <std[bcb96dfbba0ab899]::sys::thread::unix::Thread>::new::thread_start<unknown>
  239. 39.87 s gammaloop-nextest-core> at <unknown source file>:<unknown line>
  240. 39.87 s gammaloop-nextest-core> 15: start_thread<unknown>
  241. 39.87 s gammaloop-nextest-core> at <unknown source file>:<unknown line>
  242. 39.87 s gammaloop-nextest-core> 16: __clone3<unknown>
  243. 39.87 s gammaloop-nextest-core> at <unknown source file>:<unknown line>
  244. 39.87 s gammaloop-nextest-core>
  245. 39.87 s gammaloop-nextest-core> Run with COLORBT_SHOW_HIDDEN=1 environment variable to disable frame filtering.
  246. 39.87 s gammaloop-nextest-core> Run with RUST_BACKTRACE=full to include source snippets.
  247. 39.87 s gammaloop-nextest-core> =========================================
  248. 39.89 s gammaloop-nextest-core> Extracting 1 binary, 1 build script output directory, and 1 linked path to /build/nextest-archive-i7CI4I
  249. 39.96 s gammaloop-nextest-core> Extracted 7 files to /build/nextest-archive-i7CI4I in 0.08s
  250. 39.97 s gammaloop-nextest-core> ------------
  251. 39.97 s gammaloop-nextest-core> Nextest run ID 1b3635f3-f79e-4a99-b665-b70dc9a1788c with nextest profile: ci_gammaloop
  252. 39.97 s gammaloop-nextest-core> Starting 105 tests across 1 binary
  253. 58.07 s gammaloop-nextest-core> ------------
  254. 58.07 s gammaloop-nextest-core> Summary [ 18.098s] 105 tests run: 105 passed, 0 skipped
  255. 58.12 s gammaloop-nextest-core>
  256. 58.12 s gammaloop-nextest-core> ========== nextest test summary ==========
  257. 58.12 s gammaloop-nextest-core> report: target/nextest/ci_gammaloop/junit.xml
  258. 58.12 s gammaloop-nextest-core> tests: 105, failures: 0, errors: 0
  259. 58.12 s gammaloop-nextest-core> No failing testcases found.
  260. 58.12 s gammaloop-nextest-core> =========================================
  261. 58.17 s error: Cannot build '/nix/store/qhvxpbmqnxf2fzw3sqs5w754m3w6bb46-gammaloop-nextest-core.drv'.
  262. 58.17 s Reason: builder failed with exit code 100.
  263. 58.17 s Output paths:
  264. 58.17 s /nix/store/r4jx2dzizkmk4sb1x6jlicpx89l1g41m-gammaloop-nextest-core
  265. 58.17 s Last 229 log lines:
  266. 58.17 s > Extracting 4 binaries (including 1 non-test binary), 1 build script output directory, and 2 linked paths to /build/nextest-archive-cCNKzV
  267. 58.17 s > Extracted 20 files to /build/nextest-archive-cCNKzV in 0.71s
  268. 58.17 s > ------------
  269. 58.17 s > Nextest run ID 2e0e7fe0-e2a5-4678-90d4-15375fb51437 with nextest profile: ci_gammaloop
  270. 58.17 s > Starting 379 tests across 3 binaries
  271. 58.17 s > ------------
  272. 58.17 s > Summary [ 1.376s] 379 tests run: 379 passed, 0 skipped
  273. 58.17 s >
  274. 58.17 s > ========== nextest test summary ==========
  275. 58.17 s > report: target/nextest/ci_gammaloop/junit.xml
  276. 58.17 s > tests: 379, failures: 0, errors: 0
  277. 58.17 s > No failing testcases found.
  278. 58.17 s > =========================================
  279. 58.17 s > Extracting 1 binary and 1 linked path to /build/nextest-archive-AzCNcC
  280. 58.17 s > Extracted 7 files to /build/nextest-archive-AzCNcC in 0.07s
  281. 58.17 s > ------------
  282. 58.17 s > Nextest run ID 0d341ba3-8234-493e-abc0-67dcb6dd2251 with nextest profile: ci_gammaloop
  283. 58.17 s > Starting 19 tests across 1 binary
  284. 58.17 s > ------------
  285. 58.17 s > Summary [ 0.011s] 19 tests run: 19 passed, 0 skipped
  286. 58.17 s >
  287. 58.17 s > ========== nextest test summary ==========
  288. 58.17 s > report: target/nextest/ci_gammaloop/junit.xml
  289. 58.17 s > tests: 19, failures: 0, errors: 0
  290. 58.17 s > No failing testcases found.
  291. 58.17 s > =========================================
  292. 58.17 s > Extracting 1 binary to /build/nextest-archive-Yp8VOl
  293. 58.17 s > Extracted 4 files to /build/nextest-archive-Yp8VOl in 0.04s
  294. 58.17 s > ------------
  295. 58.17 s > Nextest run ID 4e5316e2-d3ae-46ec-a875-dc1ba6917bcf with nextest profile: ci_gammaloop
  296. 58.17 s > Starting 0 tests across 1 binary
  297. 58.17 s > ------------
  298. 58.17 s > Summary [ 0.000s] 0 tests run: 0 passed, 0 skipped
  299. 58.17 s >
  300. 58.17 s > ========== nextest test summary ==========
  301. 58.17 s > report: target/nextest/ci_gammaloop/junit.xml
  302. 58.17 s > tests: 0, failures: 0, errors: 0
  303. 58.17 s > No failing testcases found.
  304. 58.17 s > =========================================
  305. 58.17 s > Extracting 4 binaries, 1 build script output directory, and 2 linked paths to /build/nextest-archive-VzwJ0B
  306. 58.17 s > Extracted 18 files to /build/nextest-archive-VzwJ0B in 0.47s
  307. 58.17 s > ------------
  308. 58.17 s > Nextest run ID 584b99a1-040e-4255-bf40-ab05d50df6ce with nextest profile: ci_gammaloop
  309. 58.17 s > Starting 706 tests across 4 binaries (60 tests skipped, including 59 tests via profile.ci_gammaloop.default-filter)
  310. 58.17 s > FAIL [ 3.335s] (701/706) gammalooprs::test_renormalization finite_part_ghost_2loop
  311. 58.17 s > stdout ---
  312. 58.17 s >
  313. 58.17 s > running 1 test
  314. 58.17 s > test finite_part_ghost_2loop ... FAILED
  315. 58.17 s >
  316. 58.17 s > failures:
  317. 58.17 s >
  318. 58.17 s > failures:
  319. 58.17 s > finite_part_ghost_2loop
  320. 58.17 s >
  321. 58.17 s > test result: FAILED. 0 passed; 1 failed; 0 ignored; 0 measured; 6 filtered out; finished in 3.31s
  322. 58.17 s >
  323. 58.17 s > stderr ---
  324. 58.17 s > The application panicked (crashed).
  325. 58.17 s > Message: assertion failed: (align_to_rqft(&a, &model) - expected).expand().is_zero()
  326. 58.17 s > Location: crates/gammalooprs/tests/test_renormalization.rs:583
  327. 58.17 s >
  328. 58.17 s > ━━━━━━━━━━━━━━━━━━━━━━━━━━━━━━━━━━ BACKTRACE ━━━━━━━━━━━━━━━━━━━━━━━━━━━━━━━━━━━
  329. 58.17 s > 1: <color_eyre[51793ea62743adbd]::config::PanicHook>::panic_report<unknown>
  330. 58.17 s > at <unknown source file>:<unknown line>
  331. 58.17 s > 2: <color_eyre[51793ea62743adbd]::config::PanicHook>::into_panic_hook::{closure#0}<unknown>
  332. 58.17 s > at <unknown source file>:<unknown line>
  333. 58.17 s > 3: std[bcb96dfbba0ab899]::panicking::panic_with_hook<unknown>
  334. 58.17 s > at <unknown source file>:<unknown line>
  335. 58.17 s > 4: std[bcb96dfbba0ab899]::panicking::panic_handler::{closure#0}<unknown>
  336. 58.17 s > at <unknown source file>:<unknown line>
  337. 58.17 s > 5: std[bcb96dfbba0ab899]::sys::backtrace::__rust_end_short_backtrace::<std[bcb96dfbba0ab899]::panicking::panic_handler::{closure#0}, !><unknown>
  338. 58.17 s > at <unknown source file>:<unknown line>
  339. 58.17 s > 6: __rustc[6c289b9f9c454d21]::rust_begin_unwind<unknown>
  340. 58.17 s > at <unknown source file>:<unknown line>
  341. 58.17 s > 7: core[940e698046960fd5]::panicking::panic_fmt<unknown>
  342. 58.17 s > at <unknown source file>:<unknown line>
  343. 58.17 s > 8: core[940e698046960fd5]::panicking::panic<unknown>
  344. 58.17 s > at <unknown source file>:<unknown line>
  345. 58.17 s > 9: <test_renormalization[5812939ef1a04d89]::finite_part_ghost_2loop::{closure#0} as core[940e698046960fd5]::ops::function::FnOnce<()>>::call_once<unknown>
  346. 58.17 s > at <unknown source file>:<unknown line>
  347. 58.17 s > 10: test[75d6903177b1d7e9]::__rust_begin_short_backtrace::<core[940e698046960fd5]::result::Result<(), alloc[2ea6bcb46fca0c42]::string::String>, fn() -> core[940e698046960fd5]::result::Result<(), alloc[2ea6bcb46fca0c42]::string::String>><unknown>
  348. 58.17 s > at <unknown source file>:<unknown line>
  349. 58.17 s > 11: test[75d6903177b1d7e9]::run_test::{closure#0}<unknown>
  350. 58.17 s > at <unknown source file>:<unknown line>
  351. 58.17 s > 12: std[bcb96dfbba0ab899]::sys::backtrace::__rust_begin_short_backtrace::<test[75d6903177b1d7e9]::run_test::{closure#1}, ()><unknown>
  352. 58.17 s > at <unknown source file>:<unknown line>
  353. 58.17 s > 13: <std[bcb96dfbba0ab899]::thread::lifecycle::spawn_unchecked<test[75d6903177b1d7e9]::run_test::{closure#1}, ()>::{closure#1} as core[940e698046960fd5]::ops::function::FnOnce<()>>::call_once::{shim:vtable#0}<unknown>
  354. 58.17 s > at <unknown source file>:<unknown line>
  355. 58.17 s > 14: <std[bcb96dfbba0ab899]::sys::thread::unix::Thread>::new::thread_start<unknown>
  356. 58.17 s > at <unknown source file>:<unknown line>
  357. 58.17 s > 15: start_thread<unknown>
  358. 58.17 s > at <unknown source file>:<unknown line>
  359. 58.17 s > 16: __clone3<unknown>
  360. 58.17 s > at <unknown source file>:<unknown line>
  361. 58.17 s >
  362. 58.17 s > Run with COLORBT_SHOW_HIDDEN=1 environment variable to disable frame filtering.
  363. 58.17 s > Run with RUST_BACKTRACE=full to include source snippets.
  364. 58.17 s >
  365. 58.17 s > ------------
  366. 58.17 s > Summary [ 11.365s] 706 tests run: 705 passed, 1 failed, 60 skipped
  367. 58.17 s > FAIL [ 3.335s] (701/706) gammalooprs::test_renormalization finite_part_ghost_2loop
  368. 58.17 s > stdout ---
  369. 58.17 s >
  370. 58.17 s > running 1 test
  371. 58.17 s > test finite_part_ghost_2loop ... FAILED
  372. 58.17 s >
  373. 58.17 s > failures:
  374. 58.17 s >
  375. 58.17 s > failures:
  376. 58.17 s > finite_part_ghost_2loop
  377. 58.17 s >
  378. 58.17 s > test result: FAILED. 0 passed; 1 failed; 0 ignored; 0 measured; 6 filtered out; finished in 3.31s
  379. 58.17 s >
  380. 58.17 s > stderr ---
  381. 58.17 s > The application panicked (crashed).
  382. 58.17 s > Message: assertion failed: (align_to_rqft(&a, &model) - expected).expand().is_zero()
  383. 58.17 s > Location: crates/gammalooprs/tests/test_renormalization.rs:583
  384. 58.17 s >
  385. 58.17 s > ━━━━━━━━━━━━━━━━━━━━━━━━━━━━━━━━━━ BACKTRACE ━━━━━━━━━━━━━━━━━━━━━━━━━━━━━━━━━━━
  386. 58.17 s > 1: <color_eyre[51793ea62743adbd]::config::PanicHook>::panic_report<unknown>
  387. 58.17 s > at <unknown source file>:<unknown line>
  388. 58.17 s > 2: <color_eyre[51793ea62743adbd]::config::PanicHook>::into_panic_hook::{closure#0}<unknown>
  389. 58.17 s > at <unknown source file>:<unknown line>
  390. 58.17 s > 3: std[bcb96dfbba0ab899]::panicking::panic_with_hook<unknown>
  391. 58.17 s > at <unknown source file>:<unknown line>
  392. 58.17 s > 4: std[bcb96dfbba0ab899]::panicking::panic_handler::{closure#0}<unknown>
  393. 58.17 s > at <unknown source file>:<unknown line>
  394. 58.17 s > 5: std[bcb96dfbba0ab899]::sys::backtrace::__rust_end_short_backtrace::<std[bcb96dfbba0ab899]::panicking::panic_handler::{closure#0}, !><unknown>
  395. 58.17 s > at <unknown source file>:<unknown line>
  396. 58.17 s > 6: __rustc[6c289b9f9c454d21]::rust_begin_unwind<unknown>
  397. 58.17 s > at <unknown source file>:<unknown line>
  398. 58.17 s > 7: core[940e698046960fd5]::panicking::panic_fmt<unknown>
  399. 58.17 s > at <unknown source file>:<unknown line>
  400. 58.17 s > 8: core[940e698046960fd5]::panicking::panic<unknown>
  401. 58.17 s > at <unknown source file>:<unknown line>
  402. 58.17 s > 9: <test_renormalization[5812939ef1a04d89]::finite_part_ghost_2loop::{closure#0} as core[940e698046960fd5]::ops::function::FnOnce<()>>::call_once<unknown>
  403. 58.17 s > at <unknown source file>:<unknown line>
  404. 58.17 s > 10: test[75d6903177b1d7e9]::__rust_begin_short_backtrace::<core[940e698046960fd5]::result::Result<(), alloc[2ea6bcb46fca0c42]::string::String>, fn() -> core[940e698046960fd5]::result::Result<(), alloc[2ea6bcb46fca0c42]::string::String>><unknown>
  405. 58.17 s > at <unknown source file>:<unknown line>
  406. 58.17 s > 11: test[75d6903177b1d7e9]::run_test::{closure#0}<unknown>
  407. 58.17 s > at <unknown source file>:<unknown line>
  408. 58.17 s > 12: std[bcb96dfbba0ab899]::sys::backtrace::__rust_begin_short_backtrace::<test[75d6903177b1d7e9]::run_test::{closure#1}, ()><unknown>
  409. 58.17 s > at <unknown source file>:<unknown line>
  410. 58.17 s > 13: <std[bcb96dfbba0ab899]::thread::lifecycle::spawn_unchecked<test[75d6903177b1d7e9]::run_test::{closure#1}, ()>::{closure#1} as core[940e698046960fd5]::ops::function::FnOnce<()>>::call_once::{shim:vtable#0}<unknown>
  411. 58.17 s > at <unknown source file>:<unknown line>
  412. 58.17 s > 14: <std[bcb96dfbba0ab899]::sys::thread::unix::Thread>::new::thread_start<unknown>
  413. 58.17 s > at <unknown source file>:<unknown line>
  414. 58.17 s > 15: start_thread<unknown>
  415. 58.17 s > at <unknown source file>:<unknown line>
  416. 58.17 s > 16: __clone3<unknown>
  417. 58.17 s > at <unknown source file>:<unknown line>
  418. 58.17 s >
  419. 58.17 s > Run with COLORBT_SHOW_HIDDEN=1 environment variable to disable frame filtering.
  420. 58.17 s > Run with RUST_BACKTRACE=full to include source snippets.
  421. 58.17 s >
  422. 58.17 s > error: test run failed
  423. 58.17 s >
  424. 58.17 s > ========== nextest test summary ==========
  425. 58.17 s > report: target/nextest/ci_gammaloop/junit.xml
  426. 58.17 s > tests: 706, failures: 1, errors: 0
  427. 58.17 s >
  428. 58.17 s > 1. gammalooprs::test_renormalization::finite_part_ghost_2loop
  429. 58.17 s > failure: test failure with exit code 101
  430. 58.17 s > system-out
  431. 58.17 s > running 1 test
  432. 58.17 s > test finite_part_ghost_2loop ... FAILED
  433. 58.17 s >
  434. 58.17 s > failures:
  435. 58.17 s >
  436. 58.17 s > failures:
  437. 58.17 s > finite_part_ghost_2loop
  438. 58.17 s >
  439. 58.17 s > test result: FAILED. 0 passed; 1 failed; 0 ignored; 0 measured; 6 filtered out; finished in 3.31s
  440. 58.17 s > system-err
  441. 58.17 s > The application panicked (crashed).
  442. 58.17 s > Message: assertion failed: (align_to_rqft(&a, &model) - expected).expand().is_zero()
  443. 58.17 s > Location: crates/gammalooprs/tests/test_renormalization.rs:583
  444. 58.17 s >
  445. 58.17 s > ━━━━━━━━━━━━━━━━━━━━━━━━━━━━━━━━━━ BACKTRACE ━━━━━━━━━━━━━━━━━━━━━━━━━━━━━━━━━━━
  446. 58.17 s > 1: <color_eyre[51793ea62743adbd]::config::PanicHook>::panic_report<unknown>
  447. 58.17 s > at <unknown source file>:<unknown line>
  448. 58.17 s > 2: <color_eyre[51793ea62743adbd]::config::PanicHook>::into_panic_hook::{closure#0}<unknown>
  449. 58.17 s > at <unknown source file>:<unknown line>
  450. 58.17 s > 3: std[bcb96dfbba0ab899]::panicking::panic_with_hook<unknown>
  451. 58.17 s > at <unknown source file>:<unknown line>
  452. 58.17 s > 4: std[bcb96dfbba0ab899]::panicking::panic_handler::{closure#0}<unknown>
  453. 58.17 s > at <unknown source file>:<unknown line>
  454. 58.17 s > 5: std[bcb96dfbba0ab899]::sys::backtrace::__rust_end_short_backtrace::<std[bcb96dfbba0ab899]::panicking::panic_handler::{closure#0}, !><unknown>
  455. 58.17 s > at <unknown source file>:<unknown line>
  456. 58.17 s > 6: __rustc[6c289b9f9c454d21]::rust_begin_unwind<unknown>
  457. 58.17 s > at <unknown source file>:<unknown line>
  458. 58.17 s > 7: core[940e698046960fd5]::panicking::panic_fmt<unknown>
  459. 58.17 s > at <unknown source file>:<unknown line>
  460. 58.17 s > 8: core[940e698046960fd5]::panicking::panic<unknown>
  461. 58.17 s > at <unknown source file>:<unknown line>
  462. 58.17 s > 9: <test_renormalization[5812939ef1a04d89]::finite_part_ghost_2loop::{closure#0} as core[940e698046960fd5]::ops::function::FnOnce<()>>::call_once<unknown>
  463. 58.17 s > at <unknown source file>:<unknown line>
  464. 58.17 s > 10: test[75d6903177b1d7e9]::__rust_begin_short_backtrace::<core[940e698046960fd5]::result::Result<(), alloc[2ea6bcb46fca0c42]::string::String>, fn() -> core[940e698046960fd5]::result::Result<(), alloc[2ea6bcb46fca0c42]::string::String>><unknown>
  465. 58.17 s > at <unknown source file>:<unknown line>
  466. 58.17 s > 11: test[75d6903177b1d7e9]::run_test::{closure#0}<unknown>
  467. 58.17 s > at <unknown source file>:<unknown line>
  468. 58.17 s > 12: std[bcb96dfbba0ab899]::sys::backtrace::__rust_begin_short_backtrace::<test[75d6903177b1d7e9]::run_test::{closure#1}, ()><unknown>
  469. 58.17 s > at <unknown source file>:<unknown line>
  470. 58.17 s > 13: <std[bcb96dfbba0ab899]::thread::lifecycle::spawn_unchecked<test[75d6903177b1d7e9]::run_test::{closure#1}, ()>::{closure#1} as core[940e698046960fd5]::ops::function::FnOnce<()>>::call_once::{shim:vtable#0}<unknown>
  471. 58.17 s > at <unknown source file>:<unknown line>
  472. 58.17 s > 14: <std[bcb96dfbba0ab899]::sys::thread::unix::Thread>::new::thread_start<unknown>
  473. 58.17 s > at <unknown source file>:<unknown line>
  474. 58.17 s > 15: start_thread<unknown>
  475. 58.17 s > at <unknown source file>:<unknown line>
  476. 58.17 s > 16: __clone3<unknown>
  477. 58.17 s > at <unknown source file>:<unknown line>
  478. 58.17 s >
  479. 58.17 s > Run with COLORBT_SHOW_HIDDEN=1 environment variable to disable frame filtering.
  480. 58.17 s > Run with RUST_BACKTRACE=full to include source snippets.
  481. 58.17 s > =========================================
  482. 58.17 s > Extracting 1 binary, 1 build script output directory, and 1 linked path to /build/nextest-archive-i7CI4I
  483. 58.17 s > Extracted 7 files to /build/nextest-archive-i7CI4I in 0.08s
  484. 58.17 s > ------------
  485. 58.17 s > Nextest run ID 1b3635f3-f79e-4a99-b665-b70dc9a1788c with nextest profile: ci_gammaloop
  486. 58.17 s > Starting 105 tests across 1 binary
  487. 58.17 s > ------------
  488. 58.17 s > Summary [ 18.098s] 105 tests run: 105 passed, 0 skipped
  489. 58.17 s >
  490. 58.17 s > ========== nextest test summary ==========
  491. 58.17 s > report: target/nextest/ci_gammaloop/junit.xml
  492. 58.17 s > tests: 105, failures: 0, errors: 0
  493. 58.17 s > No failing testcases found.
  494. 58.17 s > =========================================
  495. 58.17 s For full logs, run:
  496. 58.17 s nix log /nix/store/qhvxpbmqnxf2fzw3sqs5w754m3w6bb46-gammaloop-nextest-core.drv
  497. 58.31 s [0 built (1 failed), 0.0Run failed.