test packages.x86_64-linux.nix-ci-check-gammaloop-nextest-core

Reproduce this run
Original Run
  1. 0.00 s $ /nix/store/9ypz3flqsrl5xl495mm8h645gadjsxi1-coreutils-9.11/bin/timeout --kill-after=15s 7200s /nix/store/23zk8sgzamrbmj1fday15szf7f2279s8-nix-2.34.7/bin/nix --extra-experimental-features nix-command --extra-experimental-features flakes flake clone git+https://github.com/alphal00p/gammaloop --dest /tmp/nix-ci-worker/stable-pwd/repo/
  2. 0.06 s Cloning into '/tmp/nix-ci-worker/stable-pwd/repo'...
  3. 1.29 s remote: Enumerating objects: 85938, done.
  4. 1.84 s remote: Counting objects: 0% (1/9059) remote: Counting objects: 1% (91/9059) remote: Counting objects: 2% (182/9059) remote: Counting objects: 3% (272/9059) remote: Counting objects: 4% (363/9059) remote: Counting objects: 5% (453/9059) remote: Counting objects: 6% (544/9059) remote: Counting objects: 7% (635/9059) remote: Counting objects: 8% (725/9059) remote: Counting objects: 9% (816/9059) remote: Counting objects: 10% (906/9059) remote: Counting objects: 11% (997/9059) remote: Counting objects: 12% (1088/9059) remote: Counting objects: 13% (1178/9059) remote: Counting objects: 14% (1269/9059) remote: Counting objects: 15% (1359/9059) remote: Counting objects: 16% (1450/9059) remote: Counting objects: 17% (1541/9059) remote: Counting objects: 18% (1631/9059) remote: Counting objects: 19% (1722/9059) remote: Counting objects: 20% (1812/9059) remote: Counting objects: 21% (1903/9059) remote: Counting objects: 22% (1993/9059) remote: Counting objects: 23% (2084/9059) remote: Counting objects: 24% (2175/9059) remote: Counting objects: 25% (2265/9059) remote: Counting objects: 26% (2356/9059) remote: Counting objects: 27% (2446/9059) remote: Counting objects: 28% (2537/9059) remote: Counting objects: 29% (2628/9059) remote: Counting objects: 30% (2718/9059) remote: Counting objects: 31% (2809/9059) remote: Counting objects: 32% (2899/9059) remote: Counting objects: 33% (2990/9059) remote: Counting objects: 34% (3081/9059) remote: Counting objects: 35% (3171/9059) remote: Counting objects: 36% (3262/9059) remote: Counting objects: 37% (3352/9059) remote: Counting objects: 38% (3443/9059) remote: Counting objects: 39% (3534/9059) remote: Counting objects: 40% (3624/9059) remote: Counting objects: 41% (3715/9059) remote: Counting objects: 42% (3805/9059) remote: Counting objects: 43% (3896/9059) remote: Counting objects: 44% (3986/9059) remote: Counting objects: 45% (4077/9059) remote: Counting objects: 46% (4168/9059) remote: Counting objects: 47% (4258/9059) remote: Counting objects: 48% (4349/9059) remote: Counting objects: 49% (4439/9059) remote: Counting objects: 50% (4530/9059) remote: Counting objects: 51% (4621/9059) remote: Counting objects: 52% (4711/9059) remote: Counting objects: 53% (4802/9059) remote: Counting objects: 54% (4892/9059) remote: Counting objects: 55% (4983/9059) remote: Counting objects: 56% (5074/9059) remote: Counting objects: 57% (5164/9059) remote: Counting objects: 58% (5255/9059) remote: Counting objects: 59% (5345/9059) remote: Counting objects: 60% (5436/9059) remote: Counting objects: 61% (5526/9059) remote: Counting objects: 62% (5617/9059) remote: Counting objects: 63% (5708/9059) remote: Counting objects: 64% (5798/9059) remote: Counting objects: 65% (5889/9059) remote: Counting objects: 66% (5979/9059) remote: Counting objects: 67% (6070/9059) remote: Counting objects: 68% (6161/9059) remote: Counting objects: 69% (6251/9059) remote: Counting objects: 70% (6342/9059) remote: Counting objects: 71% (6432/9059) remote: Counting objects: 72% (6523/9059) remote: Counting objects: 73% (6614/9059) remote: Counting objects: 74% (6704/9059) remote: Counting objects: 75% (6795/9059) remote: Counting objects: 76% (6885/9059) remote: Counting objects: 77% (6976/9059) remote: Counting objects: 78% (7067/9059) remote: Counting objects: 79% (7157/9059) remote: Counting objects: 80% (7248/9059) remote: Counting objects: 81% (7338/9059) remote: Counting objects: 82% (7429/9059) remote: Counting objects: 83% (7519/9059) remote: Counting objects: 84% (7610/9059) remote: Counting objects: 85% (7701/9059) remote: Counting objects: 86% (7791/9059) remote: Counting objects: 87% (7882/9059) remote: Counting objects: 88% (7972/9059) remote: Counting objects: 89% (8063/9059) remote: Counting objects: 90% (8154/9059) remote: Counting objects: 91% (8244/9059) remote: Counting objects: 92% (8335/9059) remote: Counting objects: 93% (8425/9059) remote: Counting objects: 94% (8516/9059) remote: Counting objects: 95% (8607/9059) remote: Counting objects: 96% (8697/9059) remote: Counting objects: 97% (8788/9059) remote: Counting objects: 98% (8878/9059) remote: Counting objects: 99% (8969/9059) remote: Counting objects: 100% (9059/9059) remote: Counting objects: 100% (9059/9059), done.
  5. 3.41 s remote: Compressing objects: 0% (1/2011) remote: Compressing objects: 1% (21/2011) remote: Compressing objects: 2% (41/2011) remote: Compressing objects: 3% (61/2011) remote: Compressing objects: 4% (81/2011) remote: Compressing objects: 5% (101/2011) remote: Compressing objects: 6% (121/2011) remote: Compressing objects: 7% (141/2011) remote: Compressing objects: 8% (161/2011) remote: Compressing objects: 9% (181/2011) remote: Compressing objects: 10% (202/2011) remote: Compressing objects: 10% (215/2011) remote: Compressing objects: 11% (222/2011) remote: Compressing objects: 12% (242/2011) remote: Compressing objects: 13% (262/2011) remote: Compressing objects: 14% (282/2011) remote: Compressing objects: 15% (302/2011) remote: Compressing objects: 16% (322/2011) remote: Compressing objects: 17% (342/2011) remote: Compressing objects: 18% (362/2011) remote: Compressing objects: 19% (383/2011) remote: Compressing objects: 20% (403/2011) remote: Compressing objects: 21% (423/2011) remote: Compressing objects: 22% (443/2011) remote: Compressing objects: 23% (463/2011) remote: Compressing objects: 24% (483/2011) remote: Compressing objects: 25% (503/2011) remote: Compressing objects: 26% (523/2011) remote: Compressing objects: 27% (543/2011) remote: Compressing objects: 28% (564/2011) remote: Compressing objects: 28% (583/2011) remote: Compressing objects: 29% (584/2011) remote: Compressing objects: 30% (604/2011) remote: Compressing objects: 31% (624/2011) remote: Compressing objects: 32% (644/2011) remote: Compressing objects: 33% (664/2011) remote: Compressing objects: 34% (684/2011) remote: Compressing objects: 35% (704/2011) remote: Compressing objects: 36% (724/2011) remote: Compressing objects: 37% (745/2011) remote: Compressing objects: 38% (765/2011) remote: Compressing objects: 39% (785/2011) remote: Compressing objects: 40% (805/2011) remote: Compressing objects: 41% (825/2011) remote: Compressing objects: 42% (845/2011) remote: Compressing objects: 43% (865/2011) remote: Compressing objects: 44% (885/2011) remote: Compressing objects: 45% (905/2011) remote: Compressing objects: 46% (926/2011) remote: Compressing objects: 47% (946/2011) remote: Compressing objects: 48% (966/2011) remote: Compressing objects: 49% (986/2011) remote: Compressing objects: 50% (1006/2011) remote: Compressing objects: 51% (1026/2011) remote: Compressing objects: 52% (1046/2011) remote: Compressing objects: 53% (1066/2011) remote: Compressing objects: 54% (1086/2011) remote: Compressing objects: 55% (1107/2011) remote: Compressing objects: 56% (1127/2011) remote: Compressing objects: 57% (1147/2011) remote: Compressing objects: 58% (1167/2011) remote: Compressing objects: 59% (1187/2011) remote: Compressing objects: 60% (1207/2011) remote: Compressing objects: 61% (1227/2011) remote: Compressing objects: 62% (1247/2011) remote: Compressing objects: 63% (1267/2011) remote: Compressing objects: 64% (1288/2011) remote: Compressing objects: 65% (1308/2011) remote: Compressing objects: 66% (1328/2011) remote: Compressing objects: 67% (1348/2011) remote: Compressing objects: 68% (1368/2011) remote: Compressing objects: 69% (1388/2011) remote: Compressing objects: 70% (1408/2011) remote: Compressing objects: 71% (1428/2011) remote: Compressing objects: 72% (1448/2011) remote: Compressing objects: 73% (1469/2011) remote: Compressing objects: 74% (1489/2011) remote: Compressing objects: 75% (1509/2011) remote: Compressing objects: 76% (1529/2011) remote: Compressing objects: 77% (1549/2011) remote: Compressing objects: 78% (1569/2011) remote: Compressing objects: 79% (1589/2011) remote: Compressing objects: 80% (1609/2011) remote: Compressing objects: 81% (1629/2011) remote: Compressing objects: 82% (1650/2011) remote: Compressing objects: 83% (1670/2011) remote: Compressing objects: 84% (1690/2011) remote: Compressing objects: 85% (1710/2011) remote: Compressing objects: 86% (1730/2011) remote: Compressing objects: 87% (1750/2011) remote: Compressing objects: 88% (1770/2011) remote: Compressing objects: 89% (1790/2011) remote: Compressing objects: 90% (1810/2011) remote: Compressing objects: 91% (1831/2011) remote: Compressing objects: 92% (1851/2011) remote: Compressing objects: 93% (1871/2011) remote: Compressing objects: 94% (1891/2011) remote: Compressing objects: 95% (1911/2011) remote: Compressing objects: 96% (1931/2011) remote: Compressing objects: 97% (1951/2011) remote: Compressing objects: 98% (1971/2011) remote: Compressing objects: 99% (1991/2011) remote: Compressing objects: 100% (2011/2011) remote: Compressing objects: 100% (2011/2011), done.
  6. 7.75 s Receiving objects: 0% (1/85938) Receiving objects: 1% (860/85938) Receiving objects: 2% (1719/85938) Receiving objects: 3% (2579/85938) Receiving objects: 4% (3438/85938) Receiving objects: 5% (4297/85938) Receiving objects: 6% (5157/85938) Receiving objects: 7% (6016/85938) Receiving objects: 8% (6876/85938) Receiving objects: 9% (7735/85938), 13.05 MiB | 26.09 MiB/s Receiving objects: 10% (8594/85938), 13.05 MiB | 26.09 MiB/s Receiving objects: 11% (9454/85938), 13.05 MiB | 26.09 MiB/s Receiving objects: 12% (10313/85938), 13.05 MiB | 26.09 MiB/s Receiving objects: 13% (11172/85938), 13.05 MiB | 26.09 MiB/s Receiving objects: 14% (12032/85938), 13.05 MiB | 26.09 MiB/s Receiving objects: 15% (12891/85938), 13.05 MiB | 26.09 MiB/s Receiving objects: 16% (13751/85938), 13.05 MiB | 26.09 MiB/s Receiving objects: 17% (14610/85938), 13.05 MiB | 26.09 MiB/s Receiving objects: 18% (15469/85938), 13.05 MiB | 26.09 MiB/s Receiving objects: 19% (16329/85938), 13.05 MiB | 26.09 MiB/s Receiving objects: 20% (17188/85938), 13.05 MiB | 26.09 MiB/s Receiving objects: 21% (18047/85938), 13.05 MiB | 26.09 MiB/s Receiving objects: 22% (18907/85938), 13.05 MiB | 26.09 MiB/s Receiving objects: 23% (19766/85938), 13.05 MiB | 26.09 MiB/s Receiving objects: 24% (20626/85938), 13.05 MiB | 26.09 MiB/s Receiving objects: 25% (21485/85938), 13.05 MiB | 26.09 MiB/s Receiving objects: 26% (22344/85938), 13.05 MiB | 26.09 MiB/s Receiving objects: 27% (23204/85938), 13.05 MiB | 26.09 MiB/s Receiving objects: 28% (24063/85938), 13.05 MiB | 26.09 MiB/s Receiving objects: 29% (24923/85938), 13.05 MiB | 26.09 MiB/s Receiving objects: 30% (25782/85938), 13.05 MiB | 26.09 MiB/s Receiving objects: 31% (26641/85938), 13.05 MiB | 26.09 MiB/s Receiving objects: 32% (27501/85938), 13.05 MiB | 26.09 MiB/s Receiving objects: 33% (28360/85938), 13.05 MiB | 26.09 MiB/s Receiving objects: 34% (29219/85938), 13.05 MiB | 26.09 MiB/s Receiving objects: 35% (30079/85938), 13.05 MiB | 26.09 MiB/s Receiving objects: 36% (30938/85938), 13.05 MiB | 26.09 MiB/s Receiving objects: 37% (31798/85938), 13.05 MiB | 26.09 MiB/s Receiving objects: 38% (32657/85938), 13.05 MiB | 26.09 MiB/s Receiving objects: 39% (33516/85938), 13.05 MiB | 26.09 MiB/s Receiving objects: 39% (34015/85938), 33.37 MiB | 33.33 MiB/s Receiving objects: 40% (34376/85938), 33.37 MiB | 33.33 MiB/s Receiving objects: 41% (35235/85938), 33.37 MiB | 33.33 MiB/s Receiving objects: 42% (36094/85938), 33.37 MiB | 33.33 MiB/s Receiving objects: 43% (36954/85938), 33.37 MiB | 33.33 MiB/s Receiving objects: 44% (37813/85938), 33.37 MiB | 33.33 MiB/s Receiving objects: 45% (38673/85938), 33.37 MiB | 33.33 MiB/s Receiving objects: 46% (39532/85938), 33.37 MiB | 33.33 MiB/s Receiving objects: 47% (40391/85938), 33.37 MiB | 33.33 MiB/s Receiving objects: 48% (41251/85938), 33.37 MiB | 33.33 MiB/s Receiving objects: 49% (42110/85938), 33.37 MiB | 33.33 MiB/s Receiving objects: 50% (42969/85938), 51.25 MiB | 34.14 MiB/s Receiving objects: 51% (43829/85938), 51.25 MiB | 34.14 MiB/s Receiving objects: 52% (44688/85938), 51.25 MiB | 34.14 MiB/s Receiving objects: 53% (45548/85938), 51.25 MiB | 34.14 MiB/s Receiving objects: 54% (46407/85938), 51.25 MiB | 34.14 MiB/s Receiving objects: 55% (47266/85938), 51.25 MiB | 34.14 MiB/s Receiving objects: 56% (48126/85938), 51.25 MiB | 34.14 MiB/s Receiving objects: 57% (48985/85938), 51.25 MiB | 34.14 MiB/s Receiving objects: 58% (49845/85938), 51.25 MiB | 34.14 MiB/s Receiving objects: 58% (50129/85938), 69.64 MiB | 34.80 MiB/s Receiving objects: 59% (50704/85938), 69.64 MiB | 34.80 MiB/s Receiving objects: 60% (51563/85938), 69.64 MiB | 34.80 MiB/s Receiving objects: 61% (52423/85938), 69.64 MiB | 34.80 MiB/s Receiving objects: 62% (53282/85938), 69.64 MiB | 34.80 MiB/s Receiving objects: 63% (54141/85938), 69.64 MiB | 34.80 MiB/s Receiving objects: 64% (55001/85938), 69.64 MiB | 34.80 MiB/s Receiving objects: 65% (55860/85938), 69.64 MiB | 34.80 MiB/s Receiving objects: 66% (56720/85938), 69.64 MiB | 34.80 MiB/s Receiving objects: 67% (57579/85938), 88.25 MiB | 35.17 MiB/s Receiving objects: 68% (58438/85938), 88.25 MiB | 35.17 MiB/s Receiving objects: 68% (58615/85938), 88.25 MiB | 35.17 MiB/s Receiving objects: 69% (59298/85938), 107.53 MiB | 35.46 MiB/s Receiving objects: 70% (60157/85938), 107.53 MiB | 35.46 MiB/s Receiving objects: 71% (61016/85938), 107.53 MiB | 35.46 MiB/s Receiving objects: 72% (61876/85938), 107.53 MiB | 35.46 MiB/s Receiving objects: 73% (62735/85938), 107.53 MiB | 35.46 MiB/s Receiving objects: 74% (63595/85938), 107.53 MiB | 35.46 MiB/s Receiving objects: 75% (64454/85938), 126.83 MiB | 35.68 MiB/s Receiving objects: 76% (65313/85938), 126.83 MiB | 35.68 MiB/s Receiving objects: 77% (66173/85938), 126.83 MiB | 35.68 MiB/s Receiving objects: 78% (67032/85938), 126.83 MiB | 35.68 MiB/s Receiving objects: 79% (67892/85938), 126.83 MiB | 35.68 MiB/s Receiving objects: 80% (68751/85938), 126.83 MiB | 35.68 MiB/s Receiving objects: 81% (69610/85938), 126.83 MiB | 35.68 MiB/s Receiving objects: 82% (70470/85938), 126.83 MiB | 35.68 MiB/s Receiving objects: 83% (71329/85938), 126.83 MiB | 35.68 MiB/s Receiving objects: 84% (72188/85938), 126.83 MiB | 35.68 MiB/s Receiving objects: 85% (73048/85938), 126.83 MiB | 35.68 MiB/s Receiving objects: 86% (73907/85938), 126.83 MiB | 35.68 MiB/s Receiving objects: 86% (74125/85938), 126.83 MiB | 35.68 MiB/s Receiving objects: 87% (74767/85938), 146.25 MiB | 36.07 MiB/s Receiving objects: 88% (75626/85938), 146.25 MiB | 36.07 MiB/s Receiving objects: 89% (76485/85938), 146.25 MiB | 36.07 MiB/s Receiving objects: 90% (77345/85938), 146.25 MiB | 36.07 MiB/s Receiving objects: 91% (78204/85938), 146.25 MiB | 36.07 MiB/s Receiving objects: 92% (79063/85938), 146.25 MiB | 36.07 MiB/s Receiving objects: 93% (79923/85938), 146.25 MiB | 36.07 MiB/s Receiving objects: 94% (80782/85938), 146.25 MiB | 36.07 MiB/s Receiving objects: 95% (81642/85938), 146.25 MiB | 36.07 MiB/s Receiving objects: 96% (82501/85938), 146.25 MiB | 36.07 MiB/s Receiving objects: 97% (83360/85938), 146.25 MiB | 36.07 MiB/s Receiving objects: 98% (84220/85938), 146.25 MiB | 36.07 MiB/s Receiving objects: 99% (85079/85938), 146.25 MiB | 36.07 MiB/s remote: Total 85938 (delta 7876), reused 7163 (delta 7048), pack-reused 76879 (from 3)
  7. 7.75 s Receiving objects: 100% (85938/85938), 146.25 MiB | 36.07 MiB/s Receiving objects: 100% (85938/85938), 155.90 MiB | 35.93 MiB/s, done.
  8. 8.60 s Resolving deltas: 0% (0/58296) Resolving deltas: 1% (583/58296) Resolving deltas: 2% (1166/58296) Resolving deltas: 3% (1749/58296) Resolving deltas: 4% (2332/58296) Resolving deltas: 5% (2918/58296) Resolving deltas: 6% (3498/58296) Resolving deltas: 7% (4081/58296) Resolving deltas: 8% (4664/58296) Resolving deltas: 9% (5247/58296) Resolving deltas: 10% (5830/58296) Resolving deltas: 11% (6413/58296) Resolving deltas: 12% (6996/58296) Resolving deltas: 13% (7579/58296) Resolving deltas: 14% (8162/58296) Resolving deltas: 15% (8745/58296) Resolving deltas: 16% (9328/58296) Resolving deltas: 17% (9911/58296) Resolving deltas: 18% (10494/58296) Resolving deltas: 19% (11077/58296) Resolving deltas: 20% (11660/58296) Resolving deltas: 21% (12243/58296) Resolving deltas: 22% (12826/58296) Resolving deltas: 23% (13409/58296) Resolving deltas: 24% (13992/58296) Resolving deltas: 25% (14574/58296) Resolving deltas: 26% (15158/58296) Resolving deltas: 27% (15740/58296) Resolving deltas: 28% (16323/58296) Resolving deltas: 29% (16906/58296) Resolving deltas: 30% (17489/58296) Resolving deltas: 31% (18072/58296) Resolving deltas: 32% (18655/58296) Resolving deltas: 33% (19238/58296) Resolving deltas: 34% (19821/58296) Resolving deltas: 35% (20404/58296) Resolving deltas: 36% (20987/58296) Resolving deltas: 37% (21572/58296) Resolving deltas: 38% (22153/58296) Resolving deltas: 39% (22736/58296) Resolving deltas: 40% (23319/58296) Resolving deltas: 41% (23902/58296) Resolving deltas: 42% (24485/58296) Resolving deltas: 43% (25068/58296) Resolving deltas: 44% (25651/58296) Resolving deltas: 45% (26234/58296) Resolving deltas: 46% (26817/58296) Resolving deltas: 47% (27401/58296) Resolving deltas: 48% (27984/58296) Resolving deltas: 49% (28568/58296) Resolving deltas: 50% (29148/58296) Resolving deltas: 51% (29731/58296) Resolving deltas: 52% (30314/58296) Resolving deltas: 53% (30897/58296) Resolving deltas: 54% (31480/58296) Resolving deltas: 55% (32063/58296) Resolving deltas: 56% (32646/58296) Resolving deltas: 57% (33230/58296) Resolving deltas: 58% (33812/58296) Resolving deltas: 59% (34395/58296) Resolving deltas: 60% (34978/58296) Resolving deltas: 61% (35561/58296) Resolving deltas: 62% (36144/58296) Resolving deltas: 63% (36727/58296) Resolving deltas: 64% (37311/58296) Resolving deltas: 65% (37893/58296) Resolving deltas: 66% (38476/58296) Resolving deltas: 67% (39059/58296) Resolving deltas: 68% (39642/58296) Resolving deltas: 69% (40225/58296) Resolving deltas: 70% (40808/58296) Resolving deltas: 71% (41391/58296) Resolving deltas: 72% (41974/58296) Resolving deltas: 73% (42557/58296) Resolving deltas: 74% (43140/58296) Resolving deltas: 75% (43723/58296) Resolving deltas: 76% (44305/58296) Resolving deltas: 77% (44888/58296) Resolving deltas: 78% (45471/58296) Resolving deltas: 79% (46058/58296) Resolving deltas: 80% (46637/58296) Resolving deltas: 81% (47220/58296) Resolving deltas: 82% (47803/58296) Resolving deltas: 83% (48386/58296) Resolving deltas: 84% (48970/58296) Resolving deltas: 85% (49552/58296) Resolving deltas: 86% (50135/58296) Resolving deltas: 87% (50718/58296) Resolving deltas: 88% (51301/58296) Resolving deltas: 89% (51884/58296) Resolving deltas: 90% (52467/58296) Resolving deltas: 91% (53050/58296) Resolving deltas: 92% (53633/58296) Resolving deltas: 93% (54217/58296) Resolving deltas: 94% (54799/58296) Resolving deltas: 95% (55382/58296) Resolving deltas: 96% (55965/58296) Resolving deltas: 97% (56549/58296) Resolving deltas: 98% (57131/58296) Resolving deltas: 99% (57714/58296) Resolving deltas: 100% (58296/58296) Resolving deltas: 100% (58296/58296), done.
  9. 8.92 s Fetching commit 8ff1bc018af3c0d2f704a90b282acc7baaba46a1 for faster_uv_from_4d ...
  10. 8.92 s $ /nix/store/bcnisk3ydfgv26v2gw3zlky24g00yww2-git-2.54.0/bin/git fetch origin 8ff1bc018af3c0d2f704a90b282acc7baaba46a1
  11. 9.36 s From https://github.com/alphal00p/gammaloop
  12. 9.36 s * branch 8ff1bc018af3c0d2f704a90b282acc7baaba46a1 -> FETCH_HEAD
  13. 9.37 s $ /nix/store/9ypz3flqsrl5xl495mm8h645gadjsxi1-coreutils-9.11/bin/timeout --kill-after=15s 7200s /nix/store/bcnisk3ydfgv26v2gw3zlky24g00yww2-git-2.54.0/bin/git -c advice.detachedHead=false checkout 8ff1bc018af3c0d2f704a90b282acc7baaba46a1
  14. 9.64 s HEAD is now at 8ff1bc018 avoid copying completed evaluator inputs
  15. 9.64 s $ /nix/store/9ypz3flqsrl5xl495mm8h645gadjsxi1-coreutils-9.11/bin/timeout --kill-after=15s 7200s /nix/store/23zk8sgzamrbmj1fday15szf7f2279s8-nix-2.34.7/bin/nix --extra-experimental-features nix-command --extra-experimental-features flakes --log-format internal-json run .#packages.x86_64-linux.nix-ci-check-gammaloop-nextest-core --print-build-logs
  16. 13.64 s
  17. 13.78 s Downloading cached gammaloop-nextest-binaries-core-gammaloop-api from https://cache.nix-ci.com
  18. 13.78 s Downloading cached gammaloop-nextest-binaries-core-gammalooprs from https://cache.nix-ci.com
  19. 16.55 s Downloaded cached gammaloop-nextest-binaries-core-gammaloop-api (120.8 MiB) in 2.7s
  20. 16.55 s Progress: 0 of 1 built, 1 of 4 downloaded from cache (1 downloading)
  21. 16.78 s Downloaded cached gammaloop-nextest-binaries-core-gammalooprs (88.2 MiB) in 3.0s
  22. 16.78 s Progress: 0 of 1 built, 2 of 4 downloaded from cache
  23. 16.78 s Downloading cached gammaloop-nextest-binaries-core from https://cache.nix-ci.com
  24. 16.82 s Downloaded cached gammaloop-nextest-binaries-core (2032 B) in 40ms
  25. 16.82 s Progress: 0 of 1 built, 3 of 4 downloaded from cache
  26. 16.82 s Downloading cached nix-ci-check-gammaloop-nextest-core from https://cache.nix-ci.com
  27. 16.86 s Downloaded cached nix-ci-check-gammaloop-nextest-core (1016 B) in 40ms
  28. 16.86 s Progress: 0 of 1 built, 4 of 4 downloaded from cache
  29. 21.25 s evaluating derivation 'g copying '/nix/store/0m3g evaluating derivation 'g copying '/nix/store/0m3g evaluating derivation 'g copying '/nix/store/0m3g evaluating derivation 'g copying '/nix/store/0m3g evaluating derivation 'g querying gammaloop-nexte [0/1 built, 0.0 KiB DL] [1/0/1 built, 0.0 KiB DLgammaloop-nextest-core> Extracting 4 binaries (including 1 non-test binary), 1 build script output directory, and 2 linked paths to /build/nextest-archive-6lKoEM
  30. 21.87 s gammaloop-nextest-core> Extracted 20 files to /build/nextest-archive-6lKoEM in 0.63s
  31. 21.88 s gammaloop-nextest-core> ------------
  32. 21.89 s gammaloop-nextest-core> Nextest run ID 999e8155-f5a8-4b58-9e5c-a652b3a9bd0a with nextest profile: ci_gammaloop
  33. 21.89 s gammaloop-nextest-core> Starting 379 tests across 3 binaries
  34. 23.08 s gammaloop-nextest-core> ------------
  35. 23.08 s gammaloop-nextest-core> Summary [ 1.196s] 379 tests run: 379 passed, 0 skipped
  36. 23.20 s gammaloop-nextest-core>
  37. 23.20 s gammaloop-nextest-core> ========== nextest test summary ==========
  38. 23.20 s gammaloop-nextest-core> report: target/nextest/ci_gammaloop/junit.xml
  39. 23.20 s gammaloop-nextest-core> tests: 379, failures: 0, errors: 0
  40. 23.20 s gammaloop-nextest-core> No failing testcases found.
  41. 23.20 s gammaloop-nextest-core> =========================================
  42. 23.21 s gammaloop-nextest-core> Extracting 1 binary and 1 linked path to /build/nextest-archive-FEbgqF
  43. 23.27 s gammaloop-nextest-core> Extracted 7 files to /build/nextest-archive-FEbgqF in 0.06s
  44. 23.28 s gammaloop-nextest-core> ------------
  45. 23.28 s gammaloop-nextest-core> Nextest run ID af7bc79a-fed8-4b96-bca9-468be55ceb6f with nextest profile: ci_gammaloop
  46. 23.28 s gammaloop-nextest-core> Starting 19 tests across 1 binary
  47. 23.29 s gammaloop-nextest-core> ------------
  48. 23.29 s gammaloop-nextest-core> Summary [ 0.010s] 19 tests run: 19 passed, 0 skipped
  49. 23.32 s gammaloop-nextest-core>
  50. 23.32 s gammaloop-nextest-core> ========== nextest test summary ==========
  51. 23.32 s gammaloop-nextest-core> report: target/nextest/ci_gammaloop/junit.xml
  52. 23.32 s gammaloop-nextest-core> tests: 19, failures: 0, errors: 0
  53. 23.32 s gammaloop-nextest-core> No failing testcases found.
  54. 23.32 s gammaloop-nextest-core> =========================================
  55. 23.33 s gammaloop-nextest-core> Extracting 1 binary to /build/nextest-archive-fdCMiK
  56. 23.36 s gammaloop-nextest-core> Extracted 4 files to /build/nextest-archive-fdCMiK in 0.03s
  57. 23.36 s gammaloop-nextest-core> ------------
  58. 23.36 s gammaloop-nextest-core> Nextest run ID d27f9ec4-549d-488c-841b-61c39ff78091 with nextest profile: ci_gammaloop
  59. 23.36 s gammaloop-nextest-core> Starting 0 tests across 1 binary
  60. 23.36 s gammaloop-nextest-core> ------------
  61. 23.36 s gammaloop-nextest-core> Summary [ 0.000s] 0 tests run: 0 passed, 0 skipped
  62. 23.39 s gammaloop-nextest-core>
  63. 23.39 s gammaloop-nextest-core> ========== nextest test summary ==========
  64. 23.39 s gammaloop-nextest-core> report: target/nextest/ci_gammaloop/junit.xml
  65. 23.39 s gammaloop-nextest-core> tests: 0, failures: 0, errors: 0
  66. 23.39 s gammaloop-nextest-core> No failing testcases found.
  67. 23.39 s gammaloop-nextest-core> =========================================
  68. 23.40 s gammaloop-nextest-core> Extracting 4 binaries, 1 build script output directory, and 2 linked paths to /build/nextest-archive-x3Ccmn
  69. 23.84 s gammaloop-nextest-core> Extracted 18 files to /build/nextest-archive-x3Ccmn in 0.43s
  70. 23.85 s gammaloop-nextest-core> ------------
  71. 23.85 s gammaloop-nextest-core> Nextest run ID ca5b6b69-a703-4e48-bdde-ec456de55cd1 with nextest profile: ci_gammaloop
  72. 23.85 s gammaloop-nextest-core> Starting 706 tests across 4 binaries (60 tests skipped, including 59 tests via profile.ci_gammaloop.default-filter)
  73. 29.44 s gammaloop-nextest-core> FAIL [ 2.800s] (701/706) gammalooprs::test_renormalization finite_part_ghost_2loop
  74. 29.44 s gammaloop-nextest-core> stdout ---
  75. 29.44 s gammaloop-nextest-core>
  76. 29.44 s gammaloop-nextest-core> running 1 test
  77. 29.44 s gammaloop-nextest-core> test finite_part_ghost_2loop ... FAILED
  78. 29.44 s gammaloop-nextest-core>
  79. 29.44 s gammaloop-nextest-core> failures:
  80. 29.44 s gammaloop-nextest-core>
  81. 29.44 s gammaloop-nextest-core> failures:
  82. 29.44 s gammaloop-nextest-core> finite_part_ghost_2loop
  83. 29.44 s gammaloop-nextest-core>
  84. 29.44 s gammaloop-nextest-core> test result: FAILED. 0 passed; 1 failed; 0 ignored; 0 measured; 6 filtered out; finished in 2.79s
  85. 29.44 s gammaloop-nextest-core>
  86. 29.44 s gammaloop-nextest-core> stderr ---
  87. 29.44 s gammaloop-nextest-core> The application panicked (crashed).
  88. 29.44 s gammaloop-nextest-core> Message: assertion failed: (align_to_rqft(&a, &model) - expected).expand().is_zero()
  89. 29.44 s gammaloop-nextest-core> Location: crates/gammalooprs/tests/test_renormalization.rs:583
  90. 29.44 s gammaloop-nextest-core>
  91. 29.44 s gammaloop-nextest-core> ━━━━━━━━━━━━━━━━━━━━━━━━━━━━━━━━━━ BACKTRACE ━━━━━━━━━━━━━━━━━━━━━━━━━━━━━━━━━━━
  92. 29.44 s gammaloop-nextest-core> 1: <color_eyre[51793ea62743adbd]::config::PanicHook>::panic_report<unknown>
  93. 29.44 s gammaloop-nextest-core> at <unknown source file>:<unknown line>
  94. 29.44 s gammaloop-nextest-core> 2: <color_eyre[51793ea62743adbd]::config::PanicHook>::into_panic_hook::{closure#0}<unknown>
  95. 29.44 s gammaloop-nextest-core> at <unknown source file>:<unknown line>
  96. 29.44 s gammaloop-nextest-core> 3: std[bcb96dfbba0ab899]::panicking::panic_with_hook<unknown>
  97. 29.44 s gammaloop-nextest-core> at <unknown source file>:<unknown line>
  98. 29.44 s gammaloop-nextest-core> 4: std[bcb96dfbba0ab899]::panicking::panic_handler::{closure#0}<unknown>
  99. 29.44 s gammaloop-nextest-core> at <unknown source file>:<unknown line>
  100. 29.44 s gammaloop-nextest-core> 5: std[bcb96dfbba0ab899]::sys::backtrace::__rust_end_short_backtrace::<std[bcb96dfbba0ab899]::panicking::panic_handler::{closure#0}, !><unknown>
  101. 29.44 s gammaloop-nextest-core> at <unknown source file>:<unknown line>
  102. 29.44 s gammaloop-nextest-core> 6: __rustc[6c289b9f9c454d21]::rust_begin_unwind<unknown>
  103. 29.44 s gammaloop-nextest-core> at <unknown source file>:<unknown line>
  104. 29.44 s gammaloop-nextest-core> 7: core[940e698046960fd5]::panicking::panic_fmt<unknown>
  105. 29.44 s gammaloop-nextest-core> at <unknown source file>:<unknown line>
  106. 29.44 s gammaloop-nextest-core> 8: core[940e698046960fd5]::panicking::panic<unknown>
  107. 29.44 s gammaloop-nextest-core> at <unknown source file>:<unknown line>
  108. 29.44 s gammaloop-nextest-core> 9: <test_renormalization[5812939ef1a04d89]::finite_part_ghost_2loop::{closure#0} as core[940e698046960fd5]::ops::function::FnOnce<()>>::call_once<unknown>
  109. 29.44 s gammaloop-nextest-core> at <unknown source file>:<unknown line>
  110. 29.44 s gammaloop-nextest-core> 10: test[75d6903177b1d7e9]::__rust_begin_short_backtrace::<core[940e698046960fd5]::result::Result<(), alloc[2ea6bcb46fca0c42]::string::String>, fn() -> core[940e698046960fd5]::result::Result<(), alloc[2ea6bcb46fca0c42]::string::String>><unknown>
  111. 29.44 s gammaloop-nextest-core> at <unknown source file>:<unknown line>
  112. 29.44 s gammaloop-nextest-core> 11: test[75d6903177b1d7e9]::run_test::{closure#0}<unknown>
  113. 29.44 s gammaloop-nextest-core> at <unknown source file>:<unknown line>
  114. 29.44 s gammaloop-nextest-core> 12: std[bcb96dfbba0ab899]::sys::backtrace::__rust_begin_short_backtrace::<test[75d6903177b1d7e9]::run_test::{closure#1}, ()><unknown>
  115. 29.44 s gammaloop-nextest-core> at <unknown source file>:<unknown line>
  116. 29.44 s gammaloop-nextest-core> 13: <std[bcb96dfbba0ab899]::thread::lifecycle::spawn_unchecked<test[75d6903177b1d7e9]::run_test::{closure#1}, ()>::{closure#1} as core[940e698046960fd5]::ops::function::FnOnce<()>>::call_once::{shim:vtable#0}<unknown>
  117. 29.44 s gammaloop-nextest-core> at <unknown source file>:<unknown line>
  118. 29.44 s gammaloop-nextest-core> 14: <std[bcb96dfbba0ab899]::sys::thread::unix::Thread>::new::thread_start<unknown>
  119. 29.44 s gammaloop-nextest-core> at <unknown source file>:<unknown line>
  120. 29.44 s gammaloop-nextest-core> 15: start_thread<unknown>
  121. 29.44 s gammaloop-nextest-core> at <unknown source file>:<unknown line>
  122. 29.44 s gammaloop-nextest-core> 16: __clone3<unknown>
  123. 29.44 s gammaloop-nextest-core> at <unknown source file>:<unknown line>
  124. 29.44 s gammaloop-nextest-core>
  125. 29.44 s gammaloop-nextest-core> Run with COLORBT_SHOW_HIDDEN=1 environment variable to disable frame filtering.
  126. 29.44 s gammaloop-nextest-core> Run with RUST_BACKTRACE=full to include source snippets.
  127. 29.44 s gammaloop-nextest-core>
  128. 33.81 s gammaloop-nextest-core> ------------
  129. 33.81 s gammaloop-nextest-core> Summary [ 9.961s] 706 tests run: 705 passed, 1 failed, 60 skipped
  130. 33.81 s gammaloop-nextest-core> FAIL [ 2.800s] (701/706) gammalooprs::test_renormalization finite_part_ghost_2loop
  131. 33.81 s gammaloop-nextest-core> stdout ---
  132. 33.81 s gammaloop-nextest-core>
  133. 33.81 s gammaloop-nextest-core> running 1 test
  134. 33.81 s gammaloop-nextest-core> test finite_part_ghost_2loop ... FAILED
  135. 33.81 s gammaloop-nextest-core>
  136. 33.81 s gammaloop-nextest-core> failures:
  137. 33.81 s gammaloop-nextest-core>
  138. 33.81 s gammaloop-nextest-core> failures:
  139. 33.81 s gammaloop-nextest-core> finite_part_ghost_2loop
  140. 33.81 s gammaloop-nextest-core>
  141. 33.81 s gammaloop-nextest-core> test result: FAILED. 0 passed; 1 failed; 0 ignored; 0 measured; 6 filtered out; finished in 2.79s
  142. 33.81 s gammaloop-nextest-core>
  143. 33.81 s gammaloop-nextest-core> stderr ---
  144. 33.81 s gammaloop-nextest-core> The application panicked (crashed).
  145. 33.81 s gammaloop-nextest-core> Message: assertion failed: (align_to_rqft(&a, &model) - expected).expand().is_zero()
  146. 33.81 s gammaloop-nextest-core> Location: crates/gammalooprs/tests/test_renormalization.rs:583
  147. 33.81 s gammaloop-nextest-core>
  148. 33.81 s gammaloop-nextest-core> ━━━━━━━━━━━━━━━━━━━━━━━━━━━━━━━━━━ BACKTRACE ━━━━━━━━━━━━━━━━━━━━━━━━━━━━━━━━━━━
  149. 33.81 s gammaloop-nextest-core> 1: <color_eyre[51793ea62743adbd]::config::PanicHook>::panic_report<unknown>
  150. 33.81 s gammaloop-nextest-core> at <unknown source file>:<unknown line>
  151. 33.81 s gammaloop-nextest-core> 2: <color_eyre[51793ea62743adbd]::config::PanicHook>::into_panic_hook::{closure#0}<unknown>
  152. 33.81 s gammaloop-nextest-core> at <unknown source file>:<unknown line>
  153. 33.81 s gammaloop-nextest-core> 3: std[bcb96dfbba0ab899]::panicking::panic_with_hook<unknown>
  154. 33.81 s gammaloop-nextest-core> at <unknown source file>:<unknown line>
  155. 33.81 s gammaloop-nextest-core> 4: std[bcb96dfbba0ab899]::panicking::panic_handler::{closure#0}<unknown>
  156. 33.81 s gammaloop-nextest-core> at <unknown source file>:<unknown line>
  157. 33.81 s gammaloop-nextest-core> 5: std[bcb96dfbba0ab899]::sys::backtrace::__rust_end_short_backtrace::<std[bcb96dfbba0ab899]::panicking::panic_handler::{closure#0}, !><unknown>
  158. 33.81 s gammaloop-nextest-core> at <unknown source file>:<unknown line>
  159. 33.81 s gammaloop-nextest-core> 6: __rustc[6c289b9f9c454d21]::rust_begin_unwind<unknown>
  160. 33.81 s gammaloop-nextest-core> at <unknown source file>:<unknown line>
  161. 33.81 s gammaloop-nextest-core> 7: core[940e698046960fd5]::panicking::panic_fmt<unknown>
  162. 33.81 s gammaloop-nextest-core> at <unknown source file>:<unknown line>
  163. 33.81 s gammaloop-nextest-core> 8: core[940e698046960fd5]::panicking::panic<unknown>
  164. 33.81 s gammaloop-nextest-core> at <unknown source file>:<unknown line>
  165. 33.81 s gammaloop-nextest-core> 9: <test_renormalization[5812939ef1a04d89]::finite_part_ghost_2loop::{closure#0} as core[940e698046960fd5]::ops::function::FnOnce<()>>::call_once<unknown>
  166. 33.81 s gammaloop-nextest-core> at <unknown source file>:<unknown line>
  167. 33.81 s gammaloop-nextest-core> 10: test[75d6903177b1d7e9]::__rust_begin_short_backtrace::<core[940e698046960fd5]::result::Result<(), alloc[2ea6bcb46fca0c42]::string::String>, fn() -> core[940e698046960fd5]::result::Result<(), alloc[2ea6bcb46fca0c42]::string::String>><unknown>
  168. 33.81 s gammaloop-nextest-core> at <unknown source file>:<unknown line>
  169. 33.81 s gammaloop-nextest-core> 11: test[75d6903177b1d7e9]::run_test::{closure#0}<unknown>
  170. 33.81 s gammaloop-nextest-core> at <unknown source file>:<unknown line>
  171. 33.81 s gammaloop-nextest-core> 12: std[bcb96dfbba0ab899]::sys::backtrace::__rust_begin_short_backtrace::<test[75d6903177b1d7e9]::run_test::{closure#1}, ()><unknown>
  172. 33.81 s gammaloop-nextest-core> at <unknown source file>:<unknown line>
  173. 33.81 s gammaloop-nextest-core> 13: <std[bcb96dfbba0ab899]::thread::lifecycle::spawn_unchecked<test[75d6903177b1d7e9]::run_test::{closure#1}, ()>::{closure#1} as core[940e698046960fd5]::ops::function::FnOnce<()>>::call_once::{shim:vtable#0}<unknown>
  174. 33.81 s gammaloop-nextest-core> at <unknown source file>:<unknown line>
  175. 33.81 s gammaloop-nextest-core> 14: <std[bcb96dfbba0ab899]::sys::thread::unix::Thread>::new::thread_start<unknown>
  176. 33.81 s gammaloop-nextest-core> at <unknown source file>:<unknown line>
  177. 33.81 s gammaloop-nextest-core> 15: start_thread<unknown>
  178. 33.81 s gammaloop-nextest-core> at <unknown source file>:<unknown line>
  179. 33.81 s gammaloop-nextest-core> 16: __clone3<unknown>
  180. 33.81 s gammaloop-nextest-core> at <unknown source file>:<unknown line>
  181. 33.81 s gammaloop-nextest-core>
  182. 33.81 s gammaloop-nextest-core> Run with COLORBT_SHOW_HIDDEN=1 environment variable to disable frame filtering.
  183. 33.81 s gammaloop-nextest-core> Run with RUST_BACKTRACE=full to include source snippets.
  184. 33.81 s gammaloop-nextest-core>
  185. 33.87 s gammaloop-nextest-core> error: test run failed
  186. 33.90 s gammaloop-nextest-core>
  187. 33.90 s gammaloop-nextest-core> ========== nextest test summary ==========
  188. 33.90 s gammaloop-nextest-core> report: target/nextest/ci_gammaloop/junit.xml
  189. 33.90 s gammaloop-nextest-core> tests: 706, failures: 1, errors: 0
  190. 33.90 s gammaloop-nextest-core>
  191. 33.90 s gammaloop-nextest-core> 1. gammalooprs::test_renormalization::finite_part_ghost_2loop
  192. 33.90 s gammaloop-nextest-core> failure: test failure with exit code 101
  193. 33.90 s gammaloop-nextest-core> system-out
  194. 33.90 s gammaloop-nextest-core> running 1 test
  195. 33.90 s gammaloop-nextest-core> test finite_part_ghost_2loop ... FAILED
  196. 33.90 s gammaloop-nextest-core>
  197. 33.90 s gammaloop-nextest-core> failures:
  198. 33.90 s gammaloop-nextest-core>
  199. 33.90 s gammaloop-nextest-core> failures:
  200. 33.90 s gammaloop-nextest-core> finite_part_ghost_2loop
  201. 33.90 s gammaloop-nextest-core>
  202. 33.90 s gammaloop-nextest-core> test result: FAILED. 0 passed; 1 failed; 0 ignored; 0 measured; 6 filtered out; finished in 2.79s
  203. 33.90 s gammaloop-nextest-core> system-err
  204. 33.90 s gammaloop-nextest-core> The application panicked (crashed).
  205. 33.90 s gammaloop-nextest-core> Message: assertion failed: (align_to_rqft(&a, &model) - expected).expand().is_zero()
  206. 33.90 s gammaloop-nextest-core> Location: crates/gammalooprs/tests/test_renormalization.rs:583
  207. 33.90 s gammaloop-nextest-core>
  208. 33.90 s gammaloop-nextest-core> ━━━━━━━━━━━━━━━━━━━━━━━━━━━━━━━━━━ BACKTRACE ━━━━━━━━━━━━━━━━━━━━━━━━━━━━━━━━━━━
  209. 33.90 s gammaloop-nextest-core> 1: <color_eyre[51793ea62743adbd]::config::PanicHook>::panic_report<unknown>
  210. 33.90 s gammaloop-nextest-core> at <unknown source file>:<unknown line>
  211. 33.90 s gammaloop-nextest-core> 2: <color_eyre[51793ea62743adbd]::config::PanicHook>::into_panic_hook::{closure#0}<unknown>
  212. 33.90 s gammaloop-nextest-core> at <unknown source file>:<unknown line>
  213. 33.90 s gammaloop-nextest-core> 3: std[bcb96dfbba0ab899]::panicking::panic_with_hook<unknown>
  214. 33.90 s gammaloop-nextest-core> at <unknown source file>:<unknown line>
  215. 33.90 s gammaloop-nextest-core> 4: std[bcb96dfbba0ab899]::panicking::panic_handler::{closure#0}<unknown>
  216. 33.90 s gammaloop-nextest-core> at <unknown source file>:<unknown line>
  217. 33.90 s gammaloop-nextest-core> 5: std[bcb96dfbba0ab899]::sys::backtrace::__rust_end_short_backtrace::<std[bcb96dfbba0ab899]::panicking::panic_handler::{closure#0}, !><unknown>
  218. 33.90 s gammaloop-nextest-core> at <unknown source file>:<unknown line>
  219. 33.90 s gammaloop-nextest-core> 6: __rustc[6c289b9f9c454d21]::rust_begin_unwind<unknown>
  220. 33.90 s gammaloop-nextest-core> at <unknown source file>:<unknown line>
  221. 33.90 s gammaloop-nextest-core> 7: core[940e698046960fd5]::panicking::panic_fmt<unknown>
  222. 33.90 s gammaloop-nextest-core> at <unknown source file>:<unknown line>
  223. 33.90 s gammaloop-nextest-core> 8: core[940e698046960fd5]::panicking::panic<unknown>
  224. 33.90 s gammaloop-nextest-core> at <unknown source file>:<unknown line>
  225. 33.90 s gammaloop-nextest-core> 9: <test_renormalization[5812939ef1a04d89]::finite_part_ghost_2loop::{closure#0} as core[940e698046960fd5]::ops::function::FnOnce<()>>::call_once<unknown>
  226. 33.90 s gammaloop-nextest-core> at <unknown source file>:<unknown line>
  227. 33.90 s gammaloop-nextest-core> 10: test[75d6903177b1d7e9]::__rust_begin_short_backtrace::<core[940e698046960fd5]::result::Result<(), alloc[2ea6bcb46fca0c42]::string::String>, fn() -> core[940e698046960fd5]::result::Result<(), alloc[2ea6bcb46fca0c42]::string::String>><unknown>
  228. 33.90 s gammaloop-nextest-core> at <unknown source file>:<unknown line>
  229. 33.90 s gammaloop-nextest-core> 11: test[75d6903177b1d7e9]::run_test::{closure#0}<unknown>
  230. 33.90 s gammaloop-nextest-core> at <unknown source file>:<unknown line>
  231. 33.90 s gammaloop-nextest-core> 12: std[bcb96dfbba0ab899]::sys::backtrace::__rust_begin_short_backtrace::<test[75d6903177b1d7e9]::run_test::{closure#1}, ()><unknown>
  232. 33.90 s gammaloop-nextest-core> at <unknown source file>:<unknown line>
  233. 33.90 s gammaloop-nextest-core> 13: <std[bcb96dfbba0ab899]::thread::lifecycle::spawn_unchecked<test[75d6903177b1d7e9]::run_test::{closure#1}, ()>::{closure#1} as core[940e698046960fd5]::ops::function::FnOnce<()>>::call_once::{shim:vtable#0}<unknown>
  234. 33.90 s gammaloop-nextest-core> at <unknown source file>:<unknown line>
  235. 33.90 s gammaloop-nextest-core> 14: <std[bcb96dfbba0ab899]::sys::thread::unix::Thread>::new::thread_start<unknown>
  236. 33.90 s gammaloop-nextest-core> at <unknown source file>:<unknown line>
  237. 33.90 s gammaloop-nextest-core> 15: start_thread<unknown>
  238. 33.90 s gammaloop-nextest-core> at <unknown source file>:<unknown line>
  239. 33.90 s gammaloop-nextest-core> 16: __clone3<unknown>
  240. 33.90 s gammaloop-nextest-core> at <unknown source file>:<unknown line>
  241. 33.90 s gammaloop-nextest-core>
  242. 33.90 s gammaloop-nextest-core> Run with COLORBT_SHOW_HIDDEN=1 environment variable to disable frame filtering.
  243. 33.90 s gammaloop-nextest-core> Run with RUST_BACKTRACE=full to include source snippets.
  244. 33.90 s gammaloop-nextest-core> =========================================
  245. 33.91 s gammaloop-nextest-core> Extracting 1 binary, 1 build script output directory, and 1 linked path to /build/nextest-archive-tSIcA4
  246. 33.98 s gammaloop-nextest-core> Extracted 7 files to /build/nextest-archive-tSIcA4 in 0.07s
  247. 33.99 s gammaloop-nextest-core> ------------
  248. 33.99 s gammaloop-nextest-core> Nextest run ID 5626530f-3540-4996-941f-ef71bc55e752 with nextest profile: ci_gammaloop
  249. 33.99 s gammaloop-nextest-core> Starting 105 tests across 1 binary
  250. 49.08 s gammaloop-nextest-core> ------------
  251. 49.08 s gammaloop-nextest-core> Summary [ 15.088s] 105 tests run: 105 passed, 0 skipped
  252. 49.12 s gammaloop-nextest-core>
  253. 49.12 s gammaloop-nextest-core> ========== nextest test summary ==========
  254. 49.12 s gammaloop-nextest-core> report: target/nextest/ci_gammaloop/junit.xml
  255. 49.12 s gammaloop-nextest-core> tests: 105, failures: 0, errors: 0
  256. 49.12 s gammaloop-nextest-core> No failing testcases found.
  257. 49.12 s gammaloop-nextest-core> =========================================
  258. 49.15 s error: Cannot build '/nix/store/6vhb553172wiyjq4h3y72x5wjfx0as4q-gammaloop-nextest-core.drv'.
  259. 49.15 s Reason: builder failed with exit code 100.
  260. 49.15 s Output paths:
  261. 49.15 s /nix/store/48prb7ip4yi61z4gj4s0fcz17hlxwqmh-gammaloop-nextest-core
  262. 49.15 s Last 229 log lines:
  263. 49.15 s > Extracting 4 binaries (including 1 non-test binary), 1 build script output directory, and 2 linked paths to /build/nextest-archive-6lKoEM
  264. 49.15 s > Extracted 20 files to /build/nextest-archive-6lKoEM in 0.63s
  265. 49.15 s > ------------
  266. 49.15 s > Nextest run ID 999e8155-f5a8-4b58-9e5c-a652b3a9bd0a with nextest profile: ci_gammaloop
  267. 49.15 s > Starting 379 tests across 3 binaries
  268. 49.15 s > ------------
  269. 49.15 s > Summary [ 1.196s] 379 tests run: 379 passed, 0 skipped
  270. 49.15 s >
  271. 49.15 s > ========== nextest test summary ==========
  272. 49.15 s > report: target/nextest/ci_gammaloop/junit.xml
  273. 49.15 s > tests: 379, failures: 0, errors: 0
  274. 49.15 s > No failing testcases found.
  275. 49.15 s > =========================================
  276. 49.15 s > Extracting 1 binary and 1 linked path to /build/nextest-archive-FEbgqF
  277. 49.15 s > Extracted 7 files to /build/nextest-archive-FEbgqF in 0.06s
  278. 49.15 s > ------------
  279. 49.15 s > Nextest run ID af7bc79a-fed8-4b96-bca9-468be55ceb6f with nextest profile: ci_gammaloop
  280. 49.15 s > Starting 19 tests across 1 binary
  281. 49.15 s > ------------
  282. 49.15 s > Summary [ 0.010s] 19 tests run: 19 passed, 0 skipped
  283. 49.15 s >
  284. 49.15 s > ========== nextest test summary ==========
  285. 49.15 s > report: target/nextest/ci_gammaloop/junit.xml
  286. 49.15 s > tests: 19, failures: 0, errors: 0
  287. 49.15 s > No failing testcases found.
  288. 49.15 s > =========================================
  289. 49.15 s > Extracting 1 binary to /build/nextest-archive-fdCMiK
  290. 49.15 s > Extracted 4 files to /build/nextest-archive-fdCMiK in 0.03s
  291. 49.15 s > ------------
  292. 49.15 s > Nextest run ID d27f9ec4-549d-488c-841b-61c39ff78091 with nextest profile: ci_gammaloop
  293. 49.15 s > Starting 0 tests across 1 binary
  294. 49.15 s > ------------
  295. 49.15 s > Summary [ 0.000s] 0 tests run: 0 passed, 0 skipped
  296. 49.15 s >
  297. 49.15 s > ========== nextest test summary ==========
  298. 49.15 s > report: target/nextest/ci_gammaloop/junit.xml
  299. 49.15 s > tests: 0, failures: 0, errors: 0
  300. 49.15 s > No failing testcases found.
  301. 49.15 s > =========================================
  302. 49.15 s > Extracting 4 binaries, 1 build script output directory, and 2 linked paths to /build/nextest-archive-x3Ccmn
  303. 49.15 s > Extracted 18 files to /build/nextest-archive-x3Ccmn in 0.43s
  304. 49.15 s > ------------
  305. 49.15 s > Nextest run ID ca5b6b69-a703-4e48-bdde-ec456de55cd1 with nextest profile: ci_gammaloop
  306. 49.15 s > Starting 706 tests across 4 binaries (60 tests skipped, including 59 tests via profile.ci_gammaloop.default-filter)
  307. 49.15 s > FAIL [ 2.800s] (701/706) gammalooprs::test_renormalization finite_part_ghost_2loop
  308. 49.15 s > stdout ---
  309. 49.15 s >
  310. 49.15 s > running 1 test
  311. 49.15 s > test finite_part_ghost_2loop ... FAILED
  312. 49.15 s >
  313. 49.15 s > failures:
  314. 49.15 s >
  315. 49.15 s > failures:
  316. 49.15 s > finite_part_ghost_2loop
  317. 49.15 s >
  318. 49.15 s > test result: FAILED. 0 passed; 1 failed; 0 ignored; 0 measured; 6 filtered out; finished in 2.79s
  319. 49.15 s >
  320. 49.15 s > stderr ---
  321. 49.15 s > The application panicked (crashed).
  322. 49.15 s > Message: assertion failed: (align_to_rqft(&a, &model) - expected).expand().is_zero()
  323. 49.15 s > Location: crates/gammalooprs/tests/test_renormalization.rs:583
  324. 49.15 s >
  325. 49.15 s > ━━━━━━━━━━━━━━━━━━━━━━━━━━━━━━━━━━ BACKTRACE ━━━━━━━━━━━━━━━━━━━━━━━━━━━━━━━━━━━
  326. 49.15 s > 1: <color_eyre[51793ea62743adbd]::config::PanicHook>::panic_report<unknown>
  327. 49.15 s > at <unknown source file>:<unknown line>
  328. 49.15 s > 2: <color_eyre[51793ea62743adbd]::config::PanicHook>::into_panic_hook::{closure#0}<unknown>
  329. 49.15 s > at <unknown source file>:<unknown line>
  330. 49.15 s > 3: std[bcb96dfbba0ab899]::panicking::panic_with_hook<unknown>
  331. 49.15 s > at <unknown source file>:<unknown line>
  332. 49.15 s > 4: std[bcb96dfbba0ab899]::panicking::panic_handler::{closure#0}<unknown>
  333. 49.15 s > at <unknown source file>:<unknown line>
  334. 49.15 s > 5: std[bcb96dfbba0ab899]::sys::backtrace::__rust_end_short_backtrace::<std[bcb96dfbba0ab899]::panicking::panic_handler::{closure#0}, !><unknown>
  335. 49.15 s > at <unknown source file>:<unknown line>
  336. 49.15 s > 6: __rustc[6c289b9f9c454d21]::rust_begin_unwind<unknown>
  337. 49.15 s > at <unknown source file>:<unknown line>
  338. 49.15 s > 7: core[940e698046960fd5]::panicking::panic_fmt<unknown>
  339. 49.15 s > at <unknown source file>:<unknown line>
  340. 49.15 s > 8: core[940e698046960fd5]::panicking::panic<unknown>
  341. 49.15 s > at <unknown source file>:<unknown line>
  342. 49.15 s > 9: <test_renormalization[5812939ef1a04d89]::finite_part_ghost_2loop::{closure#0} as core[940e698046960fd5]::ops::function::FnOnce<()>>::call_once<unknown>
  343. 49.15 s > at <unknown source file>:<unknown line>
  344. 49.15 s > 10: test[75d6903177b1d7e9]::__rust_begin_short_backtrace::<core[940e698046960fd5]::result::Result<(), alloc[2ea6bcb46fca0c42]::string::String>, fn() -> core[940e698046960fd5]::result::Result<(), alloc[2ea6bcb46fca0c42]::string::String>><unknown>
  345. 49.15 s > at <unknown source file>:<unknown line>
  346. 49.15 s > 11: test[75d6903177b1d7e9]::run_test::{closure#0}<unknown>
  347. 49.15 s > at <unknown source file>:<unknown line>
  348. 49.15 s > 12: std[bcb96dfbba0ab899]::sys::backtrace::__rust_begin_short_backtrace::<test[75d6903177b1d7e9]::run_test::{closure#1}, ()><unknown>
  349. 49.16 s > at <unknown source file>:<unknown line>
  350. 49.16 s > 13: <std[bcb96dfbba0ab899]::thread::lifecycle::spawn_unchecked<test[75d6903177b1d7e9]::run_test::{closure#1}, ()>::{closure#1} as core[940e698046960fd5]::ops::function::FnOnce<()>>::call_once::{shim:vtable#0}<unknown>
  351. 49.16 s > at <unknown source file>:<unknown line>
  352. 49.16 s > 14: <std[bcb96dfbba0ab899]::sys::thread::unix::Thread>::new::thread_start<unknown>
  353. 49.16 s > at <unknown source file>:<unknown line>
  354. 49.16 s > 15: start_thread<unknown>
  355. 49.16 s > at <unknown source file>:<unknown line>
  356. 49.16 s > 16: __clone3<unknown>
  357. 49.16 s > at <unknown source file>:<unknown line>
  358. 49.16 s >
  359. 49.16 s > Run with COLORBT_SHOW_HIDDEN=1 environment variable to disable frame filtering.
  360. 49.16 s > Run with RUST_BACKTRACE=full to include source snippets.
  361. 49.16 s >
  362. 49.16 s > ------------
  363. 49.16 s > Summary [ 9.961s] 706 tests run: 705 passed, 1 failed, 60 skipped
  364. 49.16 s > FAIL [ 2.800s] (701/706) gammalooprs::test_renormalization finite_part_ghost_2loop
  365. 49.16 s > stdout ---
  366. 49.16 s >
  367. 49.16 s > running 1 test
  368. 49.16 s > test finite_part_ghost_2loop ... FAILED
  369. 49.16 s >
  370. 49.16 s > failures:
  371. 49.16 s >
  372. 49.16 s > failures:
  373. 49.16 s > finite_part_ghost_2loop
  374. 49.16 s >
  375. 49.16 s > test result: FAILED. 0 passed; 1 failed; 0 ignored; 0 measured; 6 filtered out; finished in 2.79s
  376. 49.16 s >
  377. 49.16 s > stderr ---
  378. 49.16 s > The application panicked (crashed).
  379. 49.16 s > Message: assertion failed: (align_to_rqft(&a, &model) - expected).expand().is_zero()
  380. 49.16 s > Location: crates/gammalooprs/tests/test_renormalization.rs:583
  381. 49.16 s >
  382. 49.16 s > ━━━━━━━━━━━━━━━━━━━━━━━━━━━━━━━━━━ BACKTRACE ━━━━━━━━━━━━━━━━━━━━━━━━━━━━━━━━━━━
  383. 49.16 s > 1: <color_eyre[51793ea62743adbd]::config::PanicHook>::panic_report<unknown>
  384. 49.16 s > at <unknown source file>:<unknown line>
  385. 49.16 s > 2: <color_eyre[51793ea62743adbd]::config::PanicHook>::into_panic_hook::{closure#0}<unknown>
  386. 49.16 s > at <unknown source file>:<unknown line>
  387. 49.16 s > 3: std[bcb96dfbba0ab899]::panicking::panic_with_hook<unknown>
  388. 49.16 s > at <unknown source file>:<unknown line>
  389. 49.16 s > 4: std[bcb96dfbba0ab899]::panicking::panic_handler::{closure#0}<unknown>
  390. 49.16 s > at <unknown source file>:<unknown line>
  391. 49.16 s > 5: std[bcb96dfbba0ab899]::sys::backtrace::__rust_end_short_backtrace::<std[bcb96dfbba0ab899]::panicking::panic_handler::{closure#0}, !><unknown>
  392. 49.16 s > at <unknown source file>:<unknown line>
  393. 49.16 s > 6: __rustc[6c289b9f9c454d21]::rust_begin_unwind<unknown>
  394. 49.16 s > at <unknown source file>:<unknown line>
  395. 49.16 s > 7: core[940e698046960fd5]::panicking::panic_fmt<unknown>
  396. 49.16 s > at <unknown source file>:<unknown line>
  397. 49.16 s > 8: core[940e698046960fd5]::panicking::panic<unknown>
  398. 49.16 s > at <unknown source file>:<unknown line>
  399. 49.16 s > 9: <test_renormalization[5812939ef1a04d89]::finite_part_ghost_2loop::{closure#0} as core[940e698046960fd5]::ops::function::FnOnce<()>>::call_once<unknown>
  400. 49.16 s > at <unknown source file>:<unknown line>
  401. 49.16 s > 10: test[75d6903177b1d7e9]::__rust_begin_short_backtrace::<core[940e698046960fd5]::result::Result<(), alloc[2ea6bcb46fca0c42]::string::String>, fn() -> core[940e698046960fd5]::result::Result<(), alloc[2ea6bcb46fca0c42]::string::String>><unknown>
  402. 49.16 s > at <unknown source file>:<unknown line>
  403. 49.16 s > 11: test[75d6903177b1d7e9]::run_test::{closure#0}<unknown>
  404. 49.16 s > at <unknown source file>:<unknown line>
  405. 49.16 s > 12: std[bcb96dfbba0ab899]::sys::backtrace::__rust_begin_short_backtrace::<test[75d6903177b1d7e9]::run_test::{closure#1}, ()><unknown>
  406. 49.16 s > at <unknown source file>:<unknown line>
  407. 49.16 s > 13: <std[bcb96dfbba0ab899]::thread::lifecycle::spawn_unchecked<test[75d6903177b1d7e9]::run_test::{closure#1}, ()>::{closure#1} as core[940e698046960fd5]::ops::function::FnOnce<()>>::call_once::{shim:vtable#0}<unknown>
  408. 49.16 s > at <unknown source file>:<unknown line>
  409. 49.16 s > 14: <std[bcb96dfbba0ab899]::sys::thread::unix::Thread>::new::thread_start<unknown>
  410. 49.16 s > at <unknown source file>:<unknown line>
  411. 49.16 s > 15: start_thread<unknown>
  412. 49.16 s > at <unknown source file>:<unknown line>
  413. 49.16 s > 16: __clone3<unknown>
  414. 49.16 s > at <unknown source file>:<unknown line>
  415. 49.16 s >
  416. 49.16 s > Run with COLORBT_SHOW_HIDDEN=1 environment variable to disable frame filtering.
  417. 49.16 s > Run with RUST_BACKTRACE=full to include source snippets.
  418. 49.16 s >
  419. 49.16 s > error: test run failed
  420. 49.16 s >
  421. 49.16 s > ========== nextest test summary ==========
  422. 49.16 s > report: target/nextest/ci_gammaloop/junit.xml
  423. 49.16 s > tests: 706, failures: 1, errors: 0
  424. 49.16 s >
  425. 49.16 s > 1. gammalooprs::test_renormalization::finite_part_ghost_2loop
  426. 49.16 s > failure: test failure with exit code 101
  427. 49.16 s > system-out
  428. 49.16 s > running 1 test
  429. 49.16 s > test finite_part_ghost_2loop ... FAILED
  430. 49.16 s >
  431. 49.16 s > failures:
  432. 49.16 s >
  433. 49.16 s > failures:
  434. 49.16 s > finite_part_ghost_2loop
  435. 49.16 s >
  436. 49.16 s > test result: FAILED. 0 passed; 1 failed; 0 ignored; 0 measured; 6 filtered out; finished in 2.79s
  437. 49.16 s > system-err
  438. 49.16 s > The application panicked (crashed).
  439. 49.16 s > Message: assertion failed: (align_to_rqft(&a, &model) - expected).expand().is_zero()
  440. 49.16 s > Location: crates/gammalooprs/tests/test_renormalization.rs:583
  441. 49.16 s >
  442. 49.16 s > ━━━━━━━━━━━━━━━━━━━━━━━━━━━━━━━━━━ BACKTRACE ━━━━━━━━━━━━━━━━━━━━━━━━━━━━━━━━━━━
  443. 49.16 s > 1: <color_eyre[51793ea62743adbd]::config::PanicHook>::panic_report<unknown>
  444. 49.16 s > at <unknown source file>:<unknown line>
  445. 49.16 s > 2: <color_eyre[51793ea62743adbd]::config::PanicHook>::into_panic_hook::{closure#0}<unknown>
  446. 49.16 s > at <unknown source file>:<unknown line>
  447. 49.16 s > 3: std[bcb96dfbba0ab899]::panicking::panic_with_hook<unknown>
  448. 49.16 s > at <unknown source file>:<unknown line>
  449. 49.16 s > 4: std[bcb96dfbba0ab899]::panicking::panic_handler::{closure#0}<unknown>
  450. 49.16 s > at <unknown source file>:<unknown line>
  451. 49.16 s > 5: std[bcb96dfbba0ab899]::sys::backtrace::__rust_end_short_backtrace::<std[bcb96dfbba0ab899]::panicking::panic_handler::{closure#0}, !><unknown>
  452. 49.16 s > at <unknown source file>:<unknown line>
  453. 49.16 s > 6: __rustc[6c289b9f9c454d21]::rust_begin_unwind<unknown>
  454. 49.16 s > at <unknown source file>:<unknown line>
  455. 49.16 s > 7: core[940e698046960fd5]::panicking::panic_fmt<unknown>
  456. 49.16 s > at <unknown source file>:<unknown line>
  457. 49.16 s > 8: core[940e698046960fd5]::panicking::panic<unknown>
  458. 49.16 s > at <unknown source file>:<unknown line>
  459. 49.16 s > 9: <test_renormalization[5812939ef1a04d89]::finite_part_ghost_2loop::{closure#0} as core[940e698046960fd5]::ops::function::FnOnce<()>>::call_once<unknown>
  460. 49.16 s > at <unknown source file>:<unknown line>
  461. 49.16 s > 10: test[75d6903177b1d7e9]::__rust_begin_short_backtrace::<core[940e698046960fd5]::result::Result<(), alloc[2ea6bcb46fca0c42]::string::String>, fn() -> core[940e698046960fd5]::result::Result<(), alloc[2ea6bcb46fca0c42]::string::String>><unknown>
  462. 49.16 s > at <unknown source file>:<unknown line>
  463. 49.16 s > 11: test[75d6903177b1d7e9]::run_test::{closure#0}<unknown>
  464. 49.16 s > at <unknown source file>:<unknown line>
  465. 49.16 s > 12: std[bcb96dfbba0ab899]::sys::backtrace::__rust_begin_short_backtrace::<test[75d6903177b1d7e9]::run_test::{closure#1}, ()><unknown>
  466. 49.16 s > at <unknown source file>:<unknown line>
  467. 49.16 s > 13: <std[bcb96dfbba0ab899]::thread::lifecycle::spawn_unchecked<test[75d6903177b1d7e9]::run_test::{closure#1}, ()>::{closure#1} as core[940e698046960fd5]::ops::function::FnOnce<()>>::call_once::{shim:vtable#0}<unknown>
  468. 49.16 s > at <unknown source file>:<unknown line>
  469. 49.16 s > 14: <std[bcb96dfbba0ab899]::sys::thread::unix::Thread>::new::thread_start<unknown>
  470. 49.16 s > at <unknown source file>:<unknown line>
  471. 49.16 s > 15: start_thread<unknown>
  472. 49.16 s > at <unknown source file>:<unknown line>
  473. 49.16 s > 16: __clone3<unknown>
  474. 49.16 s > at <unknown source file>:<unknown line>
  475. 49.16 s >
  476. 49.16 s > Run with COLORBT_SHOW_HIDDEN=1 environment variable to disable frame filtering.
  477. 49.16 s > Run with RUST_BACKTRACE=full to include source snippets.
  478. 49.16 s > =========================================
  479. 49.16 s > Extracting 1 binary, 1 build script output directory, and 1 linked path to /build/nextest-archive-tSIcA4
  480. 49.16 s > Extracted 7 files to /build/nextest-archive-tSIcA4 in 0.07s
  481. 49.16 s > ------------
  482. 49.16 s > Nextest run ID 5626530f-3540-4996-941f-ef71bc55e752 with nextest profile: ci_gammaloop
  483. 49.16 s > Starting 105 tests across 1 binary
  484. 49.16 s > ------------
  485. 49.16 s > Summary [ 15.088s] 105 tests run: 105 passed, 0 skipped
  486. 49.16 s >
  487. 49.16 s > ========== nextest test summary ==========
  488. 49.16 s > report: target/nextest/ci_gammaloop/junit.xml
  489. 49.16 s > tests: 105, failures: 0, errors: 0
  490. 49.16 s > No failing testcases found.
  491. 49.16 s > =========================================
  492. 49.16 s For full logs, run:
  493. 49.16 s nix log /nix/store/6vhb553172wiyjq4h3y72x5wjfx0as4q-gammaloop-nextest-core.drv
  494. 49.28 s [0 built (1 failed), 0.0Run failed.