0.01 s
$ /nix/store/9ypz3flqsrl5xl495mm8h645gadjsxi1-coreutils-9.11/bin/timeout --kill-after=15s 7200s /nix/store/23zk8sgzamrbmj1fday15szf7f2279s8-nix-2.34.7/bin/nix --extra-experimental-features nix-command --extra-experimental-features flakes flake clone git+https://github.com/alphal00p/gammaloop --dest /tmp/nix-ci-worker/stable-pwd/repo/
0.18 s
Cloning into '/tmp/nix-ci-worker/stable-pwd/repo'...
1.10 s
remote: Enumerating objects: 85938, done.
1.32 s
remote: Counting objects: 0% (1/9031)
remote: Counting objects: 1% (91/9031)
remote: Counting objects: 2% (181/9031)
remote: Counting objects: 3% (271/9031)
remote: Counting objects: 4% (362/9031)
remote: Counting objects: 5% (452/9031)
remote: Counting objects: 6% (542/9031)
remote: Counting objects: 7% (633/9031)
remote: Counting objects: 8% (723/9031)
remote: Counting objects: 9% (813/9031)
remote: Counting objects: 10% (904/9031)
remote: Counting objects: 11% (994/9031)
remote: Counting objects: 12% (1084/9031)
remote: Counting objects: 13% (1175/9031)
remote: Counting objects: 14% (1265/9031)
remote: Counting objects: 15% (1355/9031)
remote: Counting objects: 16% (1445/9031)
remote: Counting objects: 17% (1536/9031)
remote: Counting objects: 18% (1626/9031)
remote: Counting objects: 19% (1716/9031)
remote: Counting objects: 20% (1807/9031)
remote: Counting objects: 21% (1897/9031)
remote: Counting objects: 22% (1987/9031)
remote: Counting objects: 23% (2078/9031)
remote: Counting objects: 24% (2168/9031)
remote: Counting objects: 25% (2258/9031)
remote: Counting objects: 26% (2349/9031)
remote: Counting objects: 27% (2439/9031)
remote: Counting objects: 28% (2529/9031)
remote: Counting objects: 29% (2619/9031)
remote: Counting objects: 30% (2710/9031)
remote: Counting objects: 31% (2800/9031)
remote: Counting objects: 32% (2890/9031)
remote: Counting objects: 33% (2981/9031)
remote: Counting objects: 34% (3071/9031)
remote: Counting objects: 35% (3161/9031)
remote: Counting objects: 36% (3252/9031)
remote: Counting objects: 37% (3342/9031)
remote: Counting objects: 38% (3432/9031)
remote: Counting objects: 39% (3523/9031)
remote: Counting objects: 40% (3613/9031)
remote: Counting objects: 41% (3703/9031)
remote: Counting objects: 42% (3794/9031)
remote: Counting objects: 43% (3884/9031)
remote: Counting objects: 44% (3974/9031)
remote: Counting objects: 45% (4064/9031)
remote: Counting objects: 46% (4155/9031)
remote: Counting objects: 47% (4245/9031)
remote: Counting objects: 48% (4335/9031)
remote: Counting objects: 49% (4426/9031)
remote: Counting objects: 50% (4516/9031)
remote: Counting objects: 51% (4606/9031)
remote: Counting objects: 52% (4697/9031)
remote: Counting objects: 53% (4787/9031)
remote: Counting objects: 54% (4877/9031)
remote: Counting objects: 55% (4968/9031)
remote: Counting objects: 56% (5058/9031)
remote: Counting objects: 57% (5148/9031)
remote: Counting objects: 58% (5238/9031)
remote: Counting objects: 59% (5329/9031)
remote: Counting objects: 60% (5419/9031)
remote: Counting objects: 61% (5509/9031)
remote: Counting objects: 62% (5600/9031)
remote: Counting objects: 63% (5690/9031)
remote: Counting objects: 64% (5780/9031)
remote: Counting objects: 65% (5871/9031)
remote: Counting objects: 66% (5961/9031)
remote: Counting objects: 67% (6051/9031)
remote: Counting objects: 68% (6142/9031)
remote: Counting objects: 69% (6232/9031)
remote: Counting objects: 70% (6322/9031)
remote: Counting objects: 71% (6413/9031)
remote: Counting objects: 72% (6503/9031)
remote: Counting objects: 73% (6593/9031)
remote: Counting objects: 74% (6683/9031)
remote: Counting objects: 75% (6774/9031)
remote: Counting objects: 76% (6864/9031)
remote: Counting objects: 77% (6954/9031)
remote: Counting objects: 78% (7045/9031)
remote: Counting objects: 79% (7135/9031)
remote: Counting objects: 80% (7225/9031)
remote: Counting objects: 81% (7316/9031)
remote: Counting objects: 82% (7406/9031)
remote: Counting objects: 83% (7496/9031)
remote: Counting objects: 84% (7587/9031)
remote: Counting objects: 85% (7677/9031)
remote: Counting objects: 86% (7767/9031)
remote: Counting objects: 87% (7857/9031)
remote: Counting objects: 88% (7948/9031)
remote: Counting objects: 89% (8038/9031)
remote: Counting objects: 90% (8128/9031)
remote: Counting objects: 91% (8219/9031)
remote: Counting objects: 92% (8309/9031)
remote: Counting objects: 93% (8399/9031)
remote: Counting objects: 94% (8490/9031)
remote: Counting objects: 95% (8580/9031)
remote: Counting objects: 96% (8670/9031)
remote: Counting objects: 97% (8761/9031)
remote: Counting objects: 98% (8851/9031)
remote: Counting objects: 99% (8941/9031)
remote: Counting objects: 100% (9031/9031)
remote: Counting objects: 100% (9031/9031), done.
3.19 s
remote: Compressing objects: 0% (1/2008)
remote: Compressing objects: 1% (21/2008)
remote: Compressing objects: 2% (41/2008)
remote: Compressing objects: 3% (61/2008)
remote: Compressing objects: 4% (81/2008)
remote: Compressing objects: 5% (101/2008)
remote: Compressing objects: 6% (121/2008)
remote: Compressing objects: 7% (141/2008)
remote: Compressing objects: 8% (161/2008)
remote: Compressing objects: 9% (181/2008)
remote: Compressing objects: 10% (201/2008)
remote: Compressing objects: 10% (218/2008)
remote: Compressing objects: 11% (221/2008)
remote: Compressing objects: 12% (241/2008)
remote: Compressing objects: 13% (262/2008)
remote: Compressing objects: 14% (282/2008)
remote: Compressing objects: 15% (302/2008)
remote: Compressing objects: 16% (322/2008)
remote: Compressing objects: 17% (342/2008)
remote: Compressing objects: 18% (362/2008)
remote: Compressing objects: 19% (382/2008)
remote: Compressing objects: 20% (402/2008)
remote: Compressing objects: 21% (422/2008)
remote: Compressing objects: 22% (442/2008)
remote: Compressing objects: 23% (462/2008)
remote: Compressing objects: 24% (482/2008)
remote: Compressing objects: 25% (502/2008)
remote: Compressing objects: 26% (523/2008)
remote: Compressing objects: 27% (543/2008)
remote: Compressing objects: 28% (563/2008)
remote: Compressing objects: 29% (583/2008)
remote: Compressing objects: 30% (603/2008)
remote: Compressing objects: 31% (623/2008)
remote: Compressing objects: 31% (637/2008)
remote: Compressing objects: 32% (643/2008)
remote: Compressing objects: 33% (663/2008)
remote: Compressing objects: 34% (683/2008)
remote: Compressing objects: 35% (703/2008)
remote: Compressing objects: 36% (723/2008)
remote: Compressing objects: 37% (743/2008)
remote: Compressing objects: 38% (764/2008)
remote: Compressing objects: 39% (784/2008)
remote: Compressing objects: 40% (804/2008)
remote: Compressing objects: 41% (824/2008)
remote: Compressing objects: 42% (844/2008)
remote: Compressing objects: 43% (864/2008)
remote: Compressing objects: 44% (884/2008)
remote: Compressing objects: 45% (904/2008)
remote: Compressing objects: 46% (924/2008)
remote: Compressing objects: 47% (944/2008)
remote: Compressing objects: 48% (964/2008)
remote: Compressing objects: 49% (984/2008)
remote: Compressing objects: 50% (1004/2008)
remote: Compressing objects: 51% (1025/2008)
remote: Compressing objects: 52% (1045/2008)
remote: Compressing objects: 53% (1065/2008)
remote: Compressing objects: 54% (1085/2008)
remote: Compressing objects: 55% (1105/2008)
remote: Compressing objects: 56% (1125/2008)
remote: Compressing objects: 57% (1145/2008)
remote: Compressing objects: 58% (1165/2008)
remote: Compressing objects: 59% (1185/2008)
remote: Compressing objects: 60% (1205/2008)
remote: Compressing objects: 61% (1225/2008)
remote: Compressing objects: 62% (1245/2008)
remote: Compressing objects: 63% (1266/2008)
remote: Compressing objects: 64% (1286/2008)
remote: Compressing objects: 65% (1306/2008)
remote: Compressing objects: 66% (1326/2008)
remote: Compressing objects: 67% (1346/2008)
remote: Compressing objects: 68% (1366/2008)
remote: Compressing objects: 69% (1386/2008)
remote: Compressing objects: 70% (1406/2008)
remote: Compressing objects: 71% (1426/2008)
remote: Compressing objects: 72% (1446/2008)
remote: Compressing objects: 73% (1466/2008)
remote: Compressing objects: 74% (1486/2008)
remote: Compressing objects: 75% (1506/2008)
remote: Compressing objects: 76% (1527/2008)
remote: Compressing objects: 77% (1547/2008)
remote: Compressing objects: 78% (1567/2008)
remote: Compressing objects: 79% (1587/2008)
remote: Compressing objects: 80% (1607/2008)
remote: Compressing objects: 81% (1627/2008)
remote: Compressing objects: 82% (1647/2008)
remote: Compressing objects: 83% (1667/2008)
remote: Compressing objects: 84% (1687/2008)
remote: Compressing objects: 85% (1707/2008)
remote: Compressing objects: 86% (1727/2008)
remote: Compressing objects: 87% (1747/2008)
remote: Compressing objects: 88% (1768/2008)
remote: Compressing objects: 89% (1788/2008)
remote: Compressing objects: 90% (1808/2008)
remote: Compressing objects: 91% (1828/2008)
remote: Compressing objects: 92% (1848/2008)
remote: Compressing objects: 93% (1868/2008)
remote: Compressing objects: 94% (1888/2008)
remote: Compressing objects: 95% (1908/2008)
remote: Compressing objects: 96% (1928/2008)
remote: Compressing objects: 97% (1948/2008)
remote: Compressing objects: 98% (1968/2008)
remote: Compressing objects: 99% (1988/2008)
remote: Compressing objects: 100% (2008/2008)
remote: Compressing objects: 100% (2008/2008), done.
7.84 s
Receiving objects: 0% (1/85938)
Receiving objects: 1% (860/85938)
Receiving objects: 2% (1719/85938)
Receiving objects: 3% (2579/85938)
Receiving objects: 4% (3438/85938)
Receiving objects: 5% (4297/85938)
Receiving objects: 6% (5157/85938)
Receiving objects: 7% (6016/85938)
Receiving objects: 8% (6876/85938)
Receiving objects: 9% (7735/85938), 13.04 MiB | 26.05 MiB/s
Receiving objects: 10% (8594/85938), 13.04 MiB | 26.05 MiB/s
Receiving objects: 11% (9454/85938), 13.04 MiB | 26.05 MiB/s
Receiving objects: 12% (10313/85938), 13.04 MiB | 26.05 MiB/s
Receiving objects: 13% (11172/85938), 13.04 MiB | 26.05 MiB/s
Receiving objects: 14% (12032/85938), 13.04 MiB | 26.05 MiB/s
Receiving objects: 15% (12891/85938), 13.04 MiB | 26.05 MiB/s
Receiving objects: 16% (13751/85938), 13.04 MiB | 26.05 MiB/s
Receiving objects: 17% (14610/85938), 13.04 MiB | 26.05 MiB/s
Receiving objects: 18% (15469/85938), 13.04 MiB | 26.05 MiB/s
Receiving objects: 19% (16329/85938), 13.04 MiB | 26.05 MiB/s
Receiving objects: 20% (17188/85938), 13.04 MiB | 26.05 MiB/s
Receiving objects: 21% (18047/85938), 13.04 MiB | 26.05 MiB/s
Receiving objects: 22% (18907/85938), 13.04 MiB | 26.05 MiB/s
Receiving objects: 23% (19766/85938), 13.04 MiB | 26.05 MiB/s
Receiving objects: 24% (20626/85938), 13.04 MiB | 26.05 MiB/s
Receiving objects: 25% (21485/85938), 13.04 MiB | 26.05 MiB/s
Receiving objects: 26% (22344/85938), 13.04 MiB | 26.05 MiB/s
Receiving objects: 27% (23204/85938), 13.04 MiB | 26.05 MiB/s
Receiving objects: 28% (24063/85938), 13.04 MiB | 26.05 MiB/s
Receiving objects: 29% (24923/85938), 13.04 MiB | 26.05 MiB/s
Receiving objects: 30% (25782/85938), 13.04 MiB | 26.05 MiB/s
Receiving objects: 31% (26641/85938), 13.04 MiB | 26.05 MiB/s
Receiving objects: 32% (27501/85938), 13.04 MiB | 26.05 MiB/s
Receiving objects: 33% (28360/85938), 13.04 MiB | 26.05 MiB/s
Receiving objects: 34% (29219/85938), 13.04 MiB | 26.05 MiB/s
Receiving objects: 35% (30079/85938), 13.04 MiB | 26.05 MiB/s
Receiving objects: 36% (30938/85938), 13.04 MiB | 26.05 MiB/s
Receiving objects: 37% (31798/85938), 13.04 MiB | 26.05 MiB/s
Receiving objects: 38% (32657/85938), 13.04 MiB | 26.05 MiB/s
Receiving objects: 39% (33516/85938), 13.04 MiB | 26.05 MiB/s
Receiving objects: 39% (34274/85938), 32.63 MiB | 32.30 MiB/s
Receiving objects: 40% (34376/85938), 32.63 MiB | 32.30 MiB/s
Receiving objects: 41% (35235/85938), 32.63 MiB | 32.30 MiB/s
Receiving objects: 42% (36094/85938), 32.63 MiB | 32.30 MiB/s
Receiving objects: 43% (36954/85938), 32.63 MiB | 32.30 MiB/s
Receiving objects: 44% (37813/85938), 32.63 MiB | 32.30 MiB/s
Receiving objects: 45% (38673/85938), 32.63 MiB | 32.30 MiB/s
Receiving objects: 46% (39532/85938), 32.63 MiB | 32.30 MiB/s
Receiving objects: 47% (40391/85938), 32.63 MiB | 32.30 MiB/s
Receiving objects: 48% (41251/85938), 32.63 MiB | 32.30 MiB/s
Receiving objects: 49% (42110/85938), 32.63 MiB | 32.30 MiB/s
Receiving objects: 50% (42969/85938), 50.25 MiB | 33.28 MiB/s
Receiving objects: 51% (43829/85938), 50.25 MiB | 33.28 MiB/s
Receiving objects: 52% (44688/85938), 50.25 MiB | 33.28 MiB/s
Receiving objects: 53% (45548/85938), 50.25 MiB | 33.28 MiB/s
Receiving objects: 54% (46407/85938), 50.25 MiB | 33.28 MiB/s
Receiving objects: 55% (47266/85938), 50.25 MiB | 33.28 MiB/s
Receiving objects: 56% (48126/85938), 50.25 MiB | 33.28 MiB/s
Receiving objects: 56% (48914/85938), 66.54 MiB | 32.85 MiB/s
Receiving objects: 57% (48985/85938), 66.54 MiB | 32.85 MiB/s
Receiving objects: 58% (49845/85938), 66.54 MiB | 32.85 MiB/s
Receiving objects: 59% (50704/85938), 66.54 MiB | 32.85 MiB/s
Receiving objects: 60% (51563/85938), 66.54 MiB | 32.85 MiB/s
Receiving objects: 61% (52423/85938), 66.54 MiB | 32.85 MiB/s
Receiving objects: 62% (53282/85938), 66.54 MiB | 32.85 MiB/s
Receiving objects: 63% (54141/85938), 66.54 MiB | 32.85 MiB/s
Receiving objects: 64% (55001/85938), 66.54 MiB | 32.85 MiB/s
Receiving objects: 65% (55860/85938), 66.54 MiB | 32.85 MiB/s
Receiving objects: 66% (56720/85938), 66.54 MiB | 32.85 MiB/s
Receiving objects: 66% (57371/85938), 101.19 MiB | 33.27 MiB/s
Receiving objects: 67% (57579/85938), 101.19 MiB | 33.27 MiB/s
Receiving objects: 68% (58438/85938), 101.19 MiB | 33.27 MiB/s
Receiving objects: 69% (59298/85938), 101.19 MiB | 33.27 MiB/s
Receiving objects: 70% (60157/85938), 101.19 MiB | 33.27 MiB/s
Receiving objects: 71% (61016/85938), 101.19 MiB | 33.27 MiB/s
Receiving objects: 72% (61876/85938), 101.19 MiB | 33.27 MiB/s
Receiving objects: 73% (62735/85938), 101.19 MiB | 33.27 MiB/s
Receiving objects: 74% (63595/85938), 119.04 MiB | 33.62 MiB/s
Receiving objects: 75% (64454/85938), 119.04 MiB | 33.62 MiB/s
Receiving objects: 76% (65313/85938), 119.04 MiB | 33.62 MiB/s
Receiving objects: 77% (66173/85938), 119.04 MiB | 33.62 MiB/s
Receiving objects: 78% (67032/85938), 119.04 MiB | 33.62 MiB/s
Receiving objects: 79% (67892/85938), 119.04 MiB | 33.62 MiB/s
Receiving objects: 80% (68751/85938), 119.04 MiB | 33.62 MiB/s
Receiving objects: 80% (68823/85938), 119.04 MiB | 33.62 MiB/s
Receiving objects: 81% (69610/85938), 119.04 MiB | 33.62 MiB/s
Receiving objects: 82% (70470/85938), 135.91 MiB | 33.50 MiB/s
Receiving objects: 83% (71329/85938), 135.91 MiB | 33.50 MiB/s
Receiving objects: 84% (72188/85938), 135.91 MiB | 33.50 MiB/s
Receiving objects: 85% (73048/85938), 135.91 MiB | 33.50 MiB/s
Receiving objects: 86% (73907/85938), 135.91 MiB | 33.50 MiB/s
Receiving objects: 87% (74767/85938), 135.91 MiB | 33.50 MiB/s
Receiving objects: 88% (75626/85938), 135.91 MiB | 33.50 MiB/s
Receiving objects: 89% (76485/85938), 135.91 MiB | 33.50 MiB/s
Receiving objects: 90% (77345/85938), 135.91 MiB | 33.50 MiB/s
Receiving objects: 91% (78204/85938), 135.91 MiB | 33.50 MiB/s
Receiving objects: 92% (79063/85938), 135.91 MiB | 33.50 MiB/s
Receiving objects: 93% (79923/85938), 135.91 MiB | 33.50 MiB/s
Receiving objects: 94% (80782/85938), 135.91 MiB | 33.50 MiB/s
Receiving objects: 95% (81642/85938), 135.91 MiB | 33.50 MiB/s
Receiving objects: 96% (82501/85938), 135.91 MiB | 33.50 MiB/s
Receiving objects: 97% (83360/85938), 135.91 MiB | 33.50 MiB/s
Receiving objects: 98% (84220/85938), 135.91 MiB | 33.50 MiB/s
Receiving objects: 99% (85079/85938), 153.27 MiB | 33.63 MiB/s
remote: Total 85938 (delta 7848), reused 7138 (delta 7023), pack-reused 76907 (from 3)
7.84 s
Receiving objects: 100% (85938/85938), 153.27 MiB | 33.63 MiB/s
Receiving objects: 100% (85938/85938), 155.89 MiB | 33.56 MiB/s, done.
11.44 s
Resolving deltas: 0% (0/58296)
Resolving deltas: 1% (583/58296)
Resolving deltas: 2% (1166/58296)
Resolving deltas: 3% (1749/58296)
Resolving deltas: 4% (2332/58296)
Resolving deltas: 5% (2915/58296)
Resolving deltas: 6% (3498/58296)
Resolving deltas: 7% (4081/58296)
Resolving deltas: 8% (4664/58296)
Resolving deltas: 9% (5247/58296)
Resolving deltas: 10% (5832/58296)
Resolving deltas: 11% (6413/58296)
Resolving deltas: 12% (6996/58296)
Resolving deltas: 13% (7579/58296)
Resolving deltas: 14% (8162/58296)
Resolving deltas: 15% (8745/58296)
Resolving deltas: 16% (9328/58296)
Resolving deltas: 17% (9911/58296)
Resolving deltas: 18% (10494/58296)
Resolving deltas: 19% (11077/58296)
Resolving deltas: 20% (11660/58296)
Resolving deltas: 21% (12243/58296)
Resolving deltas: 22% (12826/58296)
Resolving deltas: 23% (13409/58296)
Resolving deltas: 24% (13992/58296)
Resolving deltas: 25% (14574/58296)
Resolving deltas: 26% (15157/58296)
Resolving deltas: 27% (15740/58296)
Resolving deltas: 28% (16323/58296)
Resolving deltas: 29% (16906/58296)
Resolving deltas: 30% (17489/58296)
Resolving deltas: 31% (18072/58296)
Resolving deltas: 32% (18655/58296)
Resolving deltas: 33% (19238/58296)
Resolving deltas: 34% (19822/58296)
Resolving deltas: 35% (20404/58296)
Resolving deltas: 36% (20987/58296)
Resolving deltas: 37% (21570/58296)
Resolving deltas: 38% (22153/58296)
Resolving deltas: 39% (22737/58296)
Resolving deltas: 40% (23319/58296)
Resolving deltas: 41% (23902/58296)
Resolving deltas: 42% (24485/58296)
Resolving deltas: 43% (25068/58296)
Resolving deltas: 44% (25651/58296)
Resolving deltas: 45% (26234/58296)
Resolving deltas: 46% (26817/58296)
Resolving deltas: 47% (27400/58296)
Resolving deltas: 48% (27983/58296)
Resolving deltas: 49% (28566/58296)
Resolving deltas: 50% (29149/58296)
Resolving deltas: 51% (29731/58296)
Resolving deltas: 51% (30182/58296)
Resolving deltas: 52% (30314/58296)
Resolving deltas: 53% (30897/58296)
Resolving deltas: 54% (31480/58296)
Resolving deltas: 55% (32064/58296)
Resolving deltas: 56% (32646/58296)
Resolving deltas: 57% (33229/58296)
Resolving deltas: 58% (33812/58296)
Resolving deltas: 59% (34395/58296)
Resolving deltas: 60% (34978/58296)
Resolving deltas: 61% (35561/58296)
Resolving deltas: 62% (36144/58296)
Resolving deltas: 63% (36727/58296)
Resolving deltas: 64% (37310/58296)
Resolving deltas: 64% (37398/58296)
Resolving deltas: 65% (37893/58296)
Resolving deltas: 66% (38476/58296)
Resolving deltas: 67% (39059/58296)
Resolving deltas: 68% (39642/58296)
Resolving deltas: 69% (40225/58296)
Resolving deltas: 70% (40808/58296)
Resolving deltas: 71% (41391/58296)
Resolving deltas: 72% (41975/58296)
Resolving deltas: 73% (42557/58296)
Resolving deltas: 74% (43140/58296)
Resolving deltas: 75% (43722/58296)
Resolving deltas: 76% (44305/58296)
Resolving deltas: 77% (44888/58296)
Resolving deltas: 78% (45471/58296)
Resolving deltas: 79% (46054/58296)
Resolving deltas: 80% (46637/58296)
Resolving deltas: 81% (47220/58296)
Resolving deltas: 81% (47314/58296)
Resolving deltas: 82% (47803/58296)
Resolving deltas: 83% (48386/58296)
Resolving deltas: 84% (48969/58296)
Resolving deltas: 85% (49552/58296)
Resolving deltas: 86% (50135/58296)
Resolving deltas: 87% (50718/58296)
Resolving deltas: 88% (51301/58296)
Resolving deltas: 89% (51884/58296)
Resolving deltas: 90% (52467/58296)
Resolving deltas: 91% (53050/58296)
Resolving deltas: 92% (53633/58296)
Resolving deltas: 93% (54216/58296)
Resolving deltas: 94% (54799/58296)
Resolving deltas: 95% (55382/58296)
Resolving deltas: 96% (55965/58296)
Resolving deltas: 97% (56548/58296)
Resolving deltas: 98% (57131/58296)
Resolving deltas: 99% (57715/58296)
Resolving deltas: 100% (58296/58296)
Resolving deltas: 100% (58296/58296), done.
12.17 s
Fetching commit 8ff1bc018af3c0d2f704a90b282acc7baaba46a1 for faster_uv_from_4d ...
12.17 s
$ /nix/store/bcnisk3ydfgv26v2gw3zlky24g00yww2-git-2.54.0/bin/git fetch origin 8ff1bc018af3c0d2f704a90b282acc7baaba46a1
12.77 s
From https://github.com/alphal00p/gammaloop
12.77 s
* branch 8ff1bc018af3c0d2f704a90b282acc7baaba46a1 -> FETCH_HEAD
12.82 s
$ /nix/store/9ypz3flqsrl5xl495mm8h645gadjsxi1-coreutils-9.11/bin/timeout --kill-after=15s 7200s /nix/store/bcnisk3ydfgv26v2gw3zlky24g00yww2-git-2.54.0/bin/git -c advice.detachedHead=false checkout 8ff1bc018af3c0d2f704a90b282acc7baaba46a1
13.22 s
HEAD is now at 8ff1bc018 avoid copying completed evaluator inputs
13.23 s
$ /nix/store/9ypz3flqsrl5xl495mm8h645gadjsxi1-coreutils-9.11/bin/timeout --kill-after=15s 7200s /nix/store/23zk8sgzamrbmj1fday15szf7f2279s8-nix-2.34.7/bin/nix --extra-experimental-features nix-command --extra-experimental-features flakes --log-format internal-json run .#packages.x86_64-linux.nix-ci-check-gammaloop-nextest-core --print-build-logs
20.41 s
29.76 s
evaluating derivation 'g
copying '/nix/store/0m3g
evaluating derivation 'g
copying '/nix/store/0m3g
evaluating derivation 'g
copying '/nix/store/0m3g
evaluating derivation 'g
copying '/nix/store/0m3g
evaluating derivation 'g
copying '/nix/store/0m3g
evaluating derivation 'g
copying '/nix/store/0m3g
evaluating derivation 'g
copying '/nix/store/0m3g
evaluating derivation 'g
copying '/nix/store/0m3g
evaluating derivation 'g
copying '/nix/store/0m3g
evaluating derivation 'g
copying '/nix/store/0m3g
evaluating derivation 'g
querying gammaloop-nexte
[0.6 KiB DL]
[0 /1 built, 1 copied (4.
[1 /0 /1 built, 1 copied (gammaloop-nextest-core> Extracting 4 binaries (including 1 non-test binary), 1 build script output directory, and 2 linked paths to /build/nextest-archive-OTL72q
30.77 s
gammaloop-nextest-core> Extracted 20 files to /build/nextest-archive-OTL72q in 1.01s
30.82 s
gammaloop-nextest-core> ------------
30.82 s
gammaloop-nextest-core> Nextest run ID 1069e523-1b7c-45ba-9985-faa5066435f3 with nextest profile: ci_gammaloop
30.82 s
gammaloop-nextest-core> Starting 379 tests across 3 binaries
33.43 s
gammaloop-nextest-core> ------------
33.43 s
gammaloop-nextest-core> Summary [ 2.613s] 379 tests run: 379 passed , 0 skipped
33.75 s
gammaloop-nextest-core>
33.75 s
gammaloop-nextest-core> ========== nextest test summary ==========
33.75 s
gammaloop-nextest-core> report: target/nextest/ci_gammaloop/junit.xml
33.75 s
gammaloop-nextest-core> tests: 379, failures: 0, errors: 0
33.75 s
gammaloop-nextest-core> No failing testcases found.
33.75 s
gammaloop-nextest-core> =========================================
33.78 s
gammaloop-nextest-core> Extracting 1 binary and 1 linked path to /build/nextest-archive-UOg38p
33.89 s
gammaloop-nextest-core> Extracted 7 files to /build/nextest-archive-UOg38p in 0.12s
33.94 s
gammaloop-nextest-core> ------------
33.94 s
gammaloop-nextest-core> Nextest run ID 7397d2ca-13b9-4f4f-8f95-db59b95f1161 with nextest profile: ci_gammaloop
33.94 s
gammaloop-nextest-core> Starting 19 tests across 1 binary
34.00 s
gammaloop-nextest-core> ------------
34.00 s
gammaloop-nextest-core> Summary [ 0.051s] 19 tests run: 19 passed , 0 skipped
34.06 s
gammaloop-nextest-core>
34.06 s
gammaloop-nextest-core> ========== nextest test summary ==========
34.06 s
gammaloop-nextest-core> report: target/nextest/ci_gammaloop/junit.xml
34.06 s
gammaloop-nextest-core> tests: 19, failures: 0, errors: 0
34.06 s
gammaloop-nextest-core> No failing testcases found.
34.06 s
gammaloop-nextest-core> =========================================
34.08 s
gammaloop-nextest-core> Extracting 1 binary to /build/nextest-archive-6trA0A
34.14 s
gammaloop-nextest-core> Extracted 4 files to /build/nextest-archive-6trA0A in 0.06s
34.17 s
gammaloop-nextest-core> ------------
34.17 s
gammaloop-nextest-core> Nextest run ID 33373904-72ae-42d8-9cd7-74cbe08fb3c2 with nextest profile: ci_gammaloop
34.17 s
gammaloop-nextest-core> Starting 0 tests across 1 binary
34.17 s
gammaloop-nextest-core> ------------
34.17 s
gammaloop-nextest-core> Summary [ 0.000s] 0 tests run: 0 passed , 0 skipped
34.25 s
gammaloop-nextest-core>
34.25 s
gammaloop-nextest-core> ========== nextest test summary ==========
34.25 s
gammaloop-nextest-core> report: target/nextest/ci_gammaloop/junit.xml
34.25 s
gammaloop-nextest-core> tests: 0, failures: 0, errors: 0
34.25 s
gammaloop-nextest-core> No failing testcases found.
34.25 s
gammaloop-nextest-core> =========================================
34.29 s
gammaloop-nextest-core> Extracting 4 binaries, 1 build script output directory, and 2 linked paths to /build/nextest-archive-biFZtc
35.22 s
gammaloop-nextest-core> Extracted 18 files to /build/nextest-archive-biFZtc in 0.94s
35.29 s
gammaloop-nextest-core> ------------
35.29 s
gammaloop-nextest-core> Nextest run ID ee873168-501f-4e14-98c7-800f8b42cb85 with nextest profile: ci_gammaloop
35.29 s
gammaloop-nextest-core> Starting 706 tests across 4 binaries (60 tests skipped , including 59 tests via profile.ci_gammaloop.default-filter )
56.08 s
gammaloop-nextest-core> FAIL [ 6.960s] (700/706) gammalooprs::test_renormalization finite_part_ghost_2loop
56.08 s
gammaloop-nextest-core> stdout ---
56.08 s
gammaloop-nextest-core>
56.08 s
gammaloop-nextest-core> running 1 test
56.08 s
gammaloop-nextest-core> test finite_part_ghost_2loop ... FAILED
56.08 s
gammaloop-nextest-core>
56.08 s
gammaloop-nextest-core> failures:
56.08 s
gammaloop-nextest-core>
56.08 s
gammaloop-nextest-core> failures:
56.08 s
gammaloop-nextest-core> finite_part_ghost_2loop
56.08 s
gammaloop-nextest-core>
56.08 s
gammaloop-nextest-core> test result: FAILED. 0 passed; 1 failed; 0 ignored; 0 measured; 6 filtered out; finished in 6.93s
56.08 s
gammaloop-nextest-core>
56.08 s
gammaloop-nextest-core> stderr ---
56.08 s
gammaloop-nextest-core> The application panicked (crashed).
56.08 s
gammaloop-nextest-core> Message: assertion failed: (align_to_rqft(&a, &model) - expected).expand().is_zero()
56.08 s
gammaloop-nextest-core> Location: crates/gammalooprs/tests/test_renormalization.rs :583
56.08 s
gammaloop-nextest-core>
56.08 s
gammaloop-nextest-core> ━━━━━━━━━━━━━━━━━━━━━━━━━━━━━━━━━━ BACKTRACE ━━━━━━━━━━━━━━━━━━━━━━━━━━━━━━━━━━━
56.08 s
gammaloop-nextest-core> 1: <color_eyre[51793ea62743adbd]::config::PanicHook>::panic_report <unknown>
56.08 s
gammaloop-nextest-core> at <unknown source file> :<unknown line>
56.08 s
gammaloop-nextest-core> 2: <color_eyre[51793ea62743adbd]::config::PanicHook>::into_panic_hook::{closure#0} <unknown>
56.08 s
gammaloop-nextest-core> at <unknown source file> :<unknown line>
56.08 s
gammaloop-nextest-core> 3: std[bcb96dfbba0ab899]::panicking::panic_with_hook <unknown>
56.08 s
gammaloop-nextest-core> at <unknown source file> :<unknown line>
56.08 s
gammaloop-nextest-core> 4: std[bcb96dfbba0ab899]::panicking::panic_handler::{closure#0} <unknown>
56.08 s
gammaloop-nextest-core> at <unknown source file> :<unknown line>
56.08 s
gammaloop-nextest-core> 5: std[bcb96dfbba0ab899]::sys::backtrace::__rust_end_short_backtrace::<std[bcb96dfbba0ab899]::panicking::panic_handler::{closure#0}, !> <unknown>
56.08 s
gammaloop-nextest-core> at <unknown source file> :<unknown line>
56.08 s
gammaloop-nextest-core> 6: __rustc[6c289b9f9c454d21]::rust_begin_unwind <unknown>
56.08 s
gammaloop-nextest-core> at <unknown source file> :<unknown line>
56.08 s
gammaloop-nextest-core> 7: core[940e698046960fd5]::panicking::panic_fmt <unknown>
56.08 s
gammaloop-nextest-core> at <unknown source file> :<unknown line>
56.08 s
gammaloop-nextest-core> 8: core[940e698046960fd5]::panicking::panic <unknown>
56.08 s
gammaloop-nextest-core> at <unknown source file> :<unknown line>
56.08 s
gammaloop-nextest-core> 9: <test_renormalization[5812939ef1a04d89]::finite_part_ghost_2loop::{closure#0} as core[940e698046960fd5]::ops::function::FnOnce<()>>::call_once <unknown>
56.08 s
gammaloop-nextest-core> at <unknown source file> :<unknown line>
56.08 s
gammaloop-nextest-core> 10: test[75d6903177b1d7e9]::__rust_begin_short_backtrace::<core[940e698046960fd5]::result::Result<(), alloc[2ea6bcb46fca0c42]::string::String>, fn() -> core[940e698046960fd5]::result::Result<(), alloc[2ea6bcb46fca0c42]::string::String>> <unknown>
56.08 s
gammaloop-nextest-core> at <unknown source file> :<unknown line>
56.08 s
gammaloop-nextest-core> 11: test[75d6903177b1d7e9]::run_test::{closure#0} <unknown>
56.08 s
gammaloop-nextest-core> at <unknown source file> :<unknown line>
56.08 s
gammaloop-nextest-core> 12: std[bcb96dfbba0ab899]::sys::backtrace::__rust_begin_short_backtrace::<test[75d6903177b1d7e9]::run_test::{closure#1}, ()> <unknown>
56.08 s
gammaloop-nextest-core> at <unknown source file> :<unknown line>
56.08 s
gammaloop-nextest-core> 13: <std[bcb96dfbba0ab899]::thread::lifecycle::spawn_unchecked<test[75d6903177b1d7e9]::run_test::{closure#1}, ()>::{closure#1} as core[940e698046960fd5]::ops::function::FnOnce<()>>::call_once::{shim:vtable#0} <unknown>
56.08 s
gammaloop-nextest-core> at <unknown source file> :<unknown line>
56.08 s
gammaloop-nextest-core> 14: <std[bcb96dfbba0ab899]::sys::thread::unix::Thread>::new::thread_start <unknown>
56.08 s
gammaloop-nextest-core> at <unknown source file> :<unknown line>
56.08 s
gammaloop-nextest-core> 15: start_thread <unknown>
56.08 s
gammaloop-nextest-core> at <unknown source file> :<unknown line>
56.08 s
gammaloop-nextest-core> 16: __clone3 <unknown>
56.08 s
gammaloop-nextest-core> at <unknown source file> :<unknown line>
56.08 s
gammaloop-nextest-core>
56.08 s
gammaloop-nextest-core> Run with COLORBT_SHOW_HIDDEN=1 environment variable to disable frame filtering.
56.08 s
gammaloop-nextest-core> Run with RUST_BACKTRACE=full to include source snippets.
56.08 s
gammaloop-nextest-core>
64.61 s
gammaloop-nextest-core> ------------
64.61 s
gammaloop-nextest-core> Summary [ 29.317s] 706 tests run: 705 passed , 1 failed , 60 skipped
64.61 s
gammaloop-nextest-core> FAIL [ 6.960s] (700/706) gammalooprs::test_renormalization finite_part_ghost_2loop
64.61 s
gammaloop-nextest-core> stdout ---
64.61 s
gammaloop-nextest-core>
64.61 s
gammaloop-nextest-core> running 1 test
64.61 s
gammaloop-nextest-core> test finite_part_ghost_2loop ... FAILED
64.61 s
gammaloop-nextest-core>
64.61 s
gammaloop-nextest-core> failures:
64.61 s
gammaloop-nextest-core>
64.61 s
gammaloop-nextest-core> failures:
64.61 s
gammaloop-nextest-core> finite_part_ghost_2loop
64.61 s
gammaloop-nextest-core>
64.61 s
gammaloop-nextest-core> test result: FAILED. 0 passed; 1 failed; 0 ignored; 0 measured; 6 filtered out; finished in 6.93s
64.61 s
gammaloop-nextest-core>
64.61 s
gammaloop-nextest-core> stderr ---
64.61 s
gammaloop-nextest-core> The application panicked (crashed).
64.61 s
gammaloop-nextest-core> Message: assertion failed: (align_to_rqft(&a, &model) - expected).expand().is_zero()
64.61 s
gammaloop-nextest-core> Location: crates/gammalooprs/tests/test_renormalization.rs :583
64.61 s
gammaloop-nextest-core>
64.61 s
gammaloop-nextest-core> ━━━━━━━━━━━━━━━━━━━━━━━━━━━━━━━━━━ BACKTRACE ━━━━━━━━━━━━━━━━━━━━━━━━━━━━━━━━━━━
64.61 s
gammaloop-nextest-core> 1: <color_eyre[51793ea62743adbd]::config::PanicHook>::panic_report <unknown>
64.61 s
gammaloop-nextest-core> at <unknown source file> :<unknown line>
64.61 s
gammaloop-nextest-core> 2: <color_eyre[51793ea62743adbd]::config::PanicHook>::into_panic_hook::{closure#0} <unknown>
64.61 s
gammaloop-nextest-core> at <unknown source file> :<unknown line>
64.61 s
gammaloop-nextest-core> 3: std[bcb96dfbba0ab899]::panicking::panic_with_hook <unknown>
64.61 s
gammaloop-nextest-core> at <unknown source file> :<unknown line>
64.61 s
gammaloop-nextest-core> 4: std[bcb96dfbba0ab899]::panicking::panic_handler::{closure#0} <unknown>
64.61 s
gammaloop-nextest-core> at <unknown source file> :<unknown line>
64.61 s
gammaloop-nextest-core> 5: std[bcb96dfbba0ab899]::sys::backtrace::__rust_end_short_backtrace::<std[bcb96dfbba0ab899]::panicking::panic_handler::{closure#0}, !> <unknown>
64.61 s
gammaloop-nextest-core> at <unknown source file> :<unknown line>
64.61 s
gammaloop-nextest-core> 6: __rustc[6c289b9f9c454d21]::rust_begin_unwind <unknown>
64.61 s
gammaloop-nextest-core> at <unknown source file> :<unknown line>
64.61 s
gammaloop-nextest-core> 7: core[940e698046960fd5]::panicking::panic_fmt <unknown>
64.61 s
gammaloop-nextest-core> at <unknown source file> :<unknown line>
64.61 s
gammaloop-nextest-core> 8: core[940e698046960fd5]::panicking::panic <unknown>
64.61 s
gammaloop-nextest-core> at <unknown source file> :<unknown line>
64.61 s
gammaloop-nextest-core> 9: <test_renormalization[5812939ef1a04d89]::finite_part_ghost_2loop::{closure#0} as core[940e698046960fd5]::ops::function::FnOnce<()>>::call_once <unknown>
64.61 s
gammaloop-nextest-core> at <unknown source file> :<unknown line>
64.61 s
gammaloop-nextest-core> 10: test[75d6903177b1d7e9]::__rust_begin_short_backtrace::<core[940e698046960fd5]::result::Result<(), alloc[2ea6bcb46fca0c42]::string::String>, fn() -> core[940e698046960fd5]::result::Result<(), alloc[2ea6bcb46fca0c42]::string::String>> <unknown>
64.61 s
gammaloop-nextest-core> at <unknown source file> :<unknown line>
64.61 s
gammaloop-nextest-core> 11: test[75d6903177b1d7e9]::run_test::{closure#0} <unknown>
64.61 s
gammaloop-nextest-core> at <unknown source file> :<unknown line>
64.61 s
gammaloop-nextest-core> 12: std[bcb96dfbba0ab899]::sys::backtrace::__rust_begin_short_backtrace::<test[75d6903177b1d7e9]::run_test::{closure#1}, ()> <unknown>
64.61 s
gammaloop-nextest-core> at <unknown source file> :<unknown line>
64.61 s
gammaloop-nextest-core> 13: <std[bcb96dfbba0ab899]::thread::lifecycle::spawn_unchecked<test[75d6903177b1d7e9]::run_test::{closure#1}, ()>::{closure#1} as core[940e698046960fd5]::ops::function::FnOnce<()>>::call_once::{shim:vtable#0} <unknown>
64.61 s
gammaloop-nextest-core> at <unknown source file> :<unknown line>
64.61 s
gammaloop-nextest-core> 14: <std[bcb96dfbba0ab899]::sys::thread::unix::Thread>::new::thread_start <unknown>
64.61 s
gammaloop-nextest-core> at <unknown source file> :<unknown line>
64.61 s
gammaloop-nextest-core> 15: start_thread <unknown>
64.61 s
gammaloop-nextest-core> at <unknown source file> :<unknown line>
64.61 s
gammaloop-nextest-core> 16: __clone3 <unknown>
64.61 s
gammaloop-nextest-core> at <unknown source file> :<unknown line>
64.61 s
gammaloop-nextest-core>
64.61 s
gammaloop-nextest-core> Run with COLORBT_SHOW_HIDDEN=1 environment variable to disable frame filtering.
64.61 s
gammaloop-nextest-core> Run with RUST_BACKTRACE=full to include source snippets.
64.61 s
gammaloop-nextest-core>
64.69 s
gammaloop-nextest-core> error : test run failed
64.75 s
gammaloop-nextest-core>
64.75 s
gammaloop-nextest-core> ========== nextest test summary ==========
64.75 s
gammaloop-nextest-core> report: target/nextest/ci_gammaloop/junit.xml
64.75 s
gammaloop-nextest-core> tests: 706, failures: 1, errors: 0
64.75 s
gammaloop-nextest-core>
64.75 s
gammaloop-nextest-core> 1. gammalooprs::test_renormalization::finite_part_ghost_2loop
64.75 s
gammaloop-nextest-core> failure: test failure with exit code 101
64.75 s
gammaloop-nextest-core> system-out
64.75 s
gammaloop-nextest-core> running 1 test
64.75 s
gammaloop-nextest-core> test finite_part_ghost_2loop ... FAILED
64.75 s
gammaloop-nextest-core>
64.75 s
gammaloop-nextest-core> failures:
64.75 s
gammaloop-nextest-core>
64.75 s
gammaloop-nextest-core> failures:
64.75 s
gammaloop-nextest-core> finite_part_ghost_2loop
64.75 s
gammaloop-nextest-core>
64.75 s
gammaloop-nextest-core> test result: FAILED. 0 passed; 1 failed; 0 ignored; 0 measured; 6 filtered out; finished in 6.93s
64.75 s
gammaloop-nextest-core> system-err
64.75 s
gammaloop-nextest-core> The application panicked (crashed).
64.75 s
gammaloop-nextest-core> Message: assertion failed: (align_to_rqft(&a, &model) - expected).expand().is_zero()
64.75 s
gammaloop-nextest-core> Location: crates/gammalooprs/tests/test_renormalization.rs:583
64.75 s
gammaloop-nextest-core>
64.75 s
gammaloop-nextest-core> ━━━━━━━━━━━━━━━━━━━━━━━━━━━━━━━━━━ BACKTRACE ━━━━━━━━━━━━━━━━━━━━━━━━━━━━━━━━━━━
64.75 s
gammaloop-nextest-core> 1: <color_eyre[51793ea62743adbd]::config::PanicHook>::panic_report<unknown>
64.75 s
gammaloop-nextest-core> at <unknown source file>:<unknown line>
64.75 s
gammaloop-nextest-core> 2: <color_eyre[51793ea62743adbd]::config::PanicHook>::into_panic_hook::{closure#0}<unknown>
64.75 s
gammaloop-nextest-core> at <unknown source file>:<unknown line>
64.75 s
gammaloop-nextest-core> 3: std[bcb96dfbba0ab899]::panicking::panic_with_hook<unknown>
64.75 s
gammaloop-nextest-core> at <unknown source file>:<unknown line>
64.75 s
gammaloop-nextest-core> 4: std[bcb96dfbba0ab899]::panicking::panic_handler::{closure#0}<unknown>
64.75 s
gammaloop-nextest-core> at <unknown source file>:<unknown line>
64.75 s
gammaloop-nextest-core> 5: std[bcb96dfbba0ab899]::sys::backtrace::__rust_end_short_backtrace::<std[bcb96dfbba0ab899]::panicking::panic_handler::{closure#0}, !><unknown>
64.75 s
gammaloop-nextest-core> at <unknown source file>:<unknown line>
64.75 s
gammaloop-nextest-core> 6: __rustc[6c289b9f9c454d21]::rust_begin_unwind<unknown>
64.75 s
gammaloop-nextest-core> at <unknown source file>:<unknown line>
64.75 s
gammaloop-nextest-core> 7: core[940e698046960fd5]::panicking::panic_fmt<unknown>
64.75 s
gammaloop-nextest-core> at <unknown source file>:<unknown line>
64.75 s
gammaloop-nextest-core> 8: core[940e698046960fd5]::panicking::panic<unknown>
64.75 s
gammaloop-nextest-core> at <unknown source file>:<unknown line>
64.75 s
gammaloop-nextest-core> 9: <test_renormalization[5812939ef1a04d89]::finite_part_ghost_2loop::{closure#0} as core[940e698046960fd5]::ops::function::FnOnce<()>>::call_once<unknown>
64.75 s
gammaloop-nextest-core> at <unknown source file>:<unknown line>
64.75 s
gammaloop-nextest-core> 10: test[75d6903177b1d7e9]::__rust_begin_short_backtrace::<core[940e698046960fd5]::result::Result<(), alloc[2ea6bcb46fca0c42]::string::String>, fn() -> core[940e698046960fd5]::result::Result<(), alloc[2ea6bcb46fca0c42]::string::String>><unknown>
64.75 s
gammaloop-nextest-core> at <unknown source file>:<unknown line>
64.75 s
gammaloop-nextest-core> 11: test[75d6903177b1d7e9]::run_test::{closure#0}<unknown>
64.75 s
gammaloop-nextest-core> at <unknown source file>:<unknown line>
64.75 s
gammaloop-nextest-core> 12: std[bcb96dfbba0ab899]::sys::backtrace::__rust_begin_short_backtrace::<test[75d6903177b1d7e9]::run_test::{closure#1}, ()><unknown>
64.75 s
gammaloop-nextest-core> at <unknown source file>:<unknown line>
64.75 s
gammaloop-nextest-core> 13: <std[bcb96dfbba0ab899]::thread::lifecycle::spawn_unchecked<test[75d6903177b1d7e9]::run_test::{closure#1}, ()>::{closure#1} as core[940e698046960fd5]::ops::function::FnOnce<()>>::call_once::{shim:vtable#0}<unknown>
64.75 s
gammaloop-nextest-core> at <unknown source file>:<unknown line>
64.75 s
gammaloop-nextest-core> 14: <std[bcb96dfbba0ab899]::sys::thread::unix::Thread>::new::thread_start<unknown>
64.75 s
gammaloop-nextest-core> at <unknown source file>:<unknown line>
64.75 s
gammaloop-nextest-core> 15: start_thread<unknown>
64.75 s
gammaloop-nextest-core> at <unknown source file>:<unknown line>
64.75 s
gammaloop-nextest-core> 16: __clone3<unknown>
64.75 s
gammaloop-nextest-core> at <unknown source file>:<unknown line>
64.75 s
gammaloop-nextest-core>
64.75 s
gammaloop-nextest-core> Run with COLORBT_SHOW_HIDDEN=1 environment variable to disable frame filtering.
64.75 s
gammaloop-nextest-core> Run with RUST_BACKTRACE=full to include source snippets.
64.75 s
gammaloop-nextest-core> =========================================
64.79 s
gammaloop-nextest-core> Extracting 1 binary, 1 build script output directory, and 1 linked path to /build/nextest-archive-7WAvrH
64.92 s
gammaloop-nextest-core> Extracted 7 files to /build/nextest-archive-7WAvrH in 0.13s
64.96 s
gammaloop-nextest-core> ------------
64.96 s
gammaloop-nextest-core> Nextest run ID 9dd2940b-b100-4189-a271-ca81597be599 with nextest profile: ci_gammaloop
64.96 s
gammaloop-nextest-core> Starting 105 tests across 1 binary
87.64 s
gammaloop-nextest-core> ------------
87.64 s
gammaloop-nextest-core> Summary [ 22.679s] 105 tests run: 105 passed , 0 skipped
87.70 s
gammaloop-nextest-core>
87.70 s
gammaloop-nextest-core> ========== nextest test summary ==========
87.70 s
gammaloop-nextest-core> report: target/nextest/ci_gammaloop/junit.xml
87.70 s
gammaloop-nextest-core> tests: 105, failures: 0, errors: 0
87.70 s
gammaloop-nextest-core> No failing testcases found.
87.70 s
gammaloop-nextest-core> =========================================
87.77 s
[0 built (1 failed ), 1 cerror: Cannot build '/nix/store/6vhb553172wiyjq4h3y72x5wjfx0as4q-gammaloop-nextest-core.drv '.
87.77 s
Reason: builder failed with exit code 100 .
87.77 s
Output paths:
87.77 s
/nix/store/48prb7ip4yi61z4gj4s0fcz17hlxwqmh-gammaloop-nextest-core
87.77 s
Last 229 log lines:
87.77 s
> Extracting 4 binaries (including 1 non-test binary), 1 build script output directory, and 2 linked paths to /build/nextest-archive-OTL72q
87.77 s
> Extracted 20 files to /build/nextest-archive-OTL72q in 1.01s
87.77 s
> ------------
87.77 s
> Nextest run ID 1069e523-1b7c-45ba-9985-faa5066435f3 with nextest profile: ci_gammaloop
87.77 s
> Starting 379 tests across 3 binaries
87.77 s
> ------------
87.77 s
> Summary [ 2.613s] 379 tests run: 379 passed , 0 skipped
87.77 s
>
87.77 s
> ========== nextest test summary ==========
87.77 s
> report: target/nextest/ci_gammaloop/junit.xml
87.77 s
> tests: 379, failures: 0, errors: 0
87.77 s
> No failing testcases found.
87.77 s
> =========================================
87.77 s
> Extracting 1 binary and 1 linked path to /build/nextest-archive-UOg38p
87.77 s
> Extracted 7 files to /build/nextest-archive-UOg38p in 0.12s
87.77 s
> ------------
87.77 s
> Nextest run ID 7397d2ca-13b9-4f4f-8f95-db59b95f1161 with nextest profile: ci_gammaloop
87.77 s
> Starting 19 tests across 1 binary
87.77 s
> ------------
87.77 s
> Summary [ 0.051s] 19 tests run: 19 passed , 0 skipped
87.77 s
>
87.77 s
> ========== nextest test summary ==========
87.77 s
> report: target/nextest/ci_gammaloop/junit.xml
87.77 s
> tests: 19, failures: 0, errors: 0
87.77 s
> No failing testcases found.
87.77 s
> =========================================
87.77 s
> Extracting 1 binary to /build/nextest-archive-6trA0A
87.77 s
> Extracted 4 files to /build/nextest-archive-6trA0A in 0.06s
87.77 s
> ------------
87.77 s
> Nextest run ID 33373904-72ae-42d8-9cd7-74cbe08fb3c2 with nextest profile: ci_gammaloop
87.77 s
> Starting 0 tests across 1 binary
87.77 s
> ------------
87.77 s
> Summary [ 0.000s] 0 tests run: 0 passed , 0 skipped
87.77 s
>
87.77 s
> ========== nextest test summary ==========
87.77 s
> report: target/nextest/ci_gammaloop/junit.xml
87.77 s
> tests: 0, failures: 0, errors: 0
87.77 s
> No failing testcases found.
87.77 s
> =========================================
87.77 s
> Extracting 4 binaries, 1 build script output directory, and 2 linked paths to /build/nextest-archive-biFZtc
87.77 s
> Extracted 18 files to /build/nextest-archive-biFZtc in 0.94s
87.77 s
> ------------
87.77 s
> Nextest run ID ee873168-501f-4e14-98c7-800f8b42cb85 with nextest profile: ci_gammaloop
87.77 s
> Starting 706 tests across 4 binaries (60 tests skipped , including 59 tests via profile.ci_gammaloop.default-filter )
87.77 s
> FAIL [ 6.960s] (700/706) gammalooprs::test_renormalization finite_part_ghost_2loop
87.77 s
> stdout ---
87.77 s
>
87.77 s
> running 1 test
87.77 s
> test finite_part_ghost_2loop ... FAILED
87.77 s
>
87.77 s
> failures:
87.77 s
>
87.77 s
> failures:
87.77 s
> finite_part_ghost_2loop
87.77 s
>
87.77 s
> test result: FAILED. 0 passed; 1 failed; 0 ignored; 0 measured; 6 filtered out; finished in 6.93s
87.77 s
>
87.77 s
> stderr ---
87.77 s
> The application panicked (crashed).
87.77 s
> Message: assertion failed: (align_to_rqft(&a, &model) - expected).expand().is_zero()
87.77 s
> Location: crates/gammalooprs/tests/test_renormalization.rs :583
87.77 s
>
87.77 s
> ━━━━━━━━━━━━━━━━━━━━━━━━━━━━━━━━━━ BACKTRACE ━━━━━━━━━━━━━━━━━━━━━━━━━━━━━━━━━━━
87.77 s
> 1: <color_eyre[51793ea62743adbd]::config::PanicHook>::panic_report <unknown>
87.77 s
> at <unknown source file> :<unknown line>
87.77 s
> 2: <color_eyre[51793ea62743adbd]::config::PanicHook>::into_panic_hook::{closure#0} <unknown>
87.77 s
> at <unknown source file> :<unknown line>
87.77 s
> 3: std[bcb96dfbba0ab899]::panicking::panic_with_hook <unknown>
87.77 s
> at <unknown source file> :<unknown line>
87.77 s
> 4: std[bcb96dfbba0ab899]::panicking::panic_handler::{closure#0} <unknown>
87.77 s
> at <unknown source file> :<unknown line>
87.77 s
> 5: std[bcb96dfbba0ab899]::sys::backtrace::__rust_end_short_backtrace::<std[bcb96dfbba0ab899]::panicking::panic_handler::{closure#0}, !> <unknown>
87.77 s
> at <unknown source file> :<unknown line>
87.77 s
> 6: __rustc[6c289b9f9c454d21]::rust_begin_unwind <unknown>
87.77 s
> at <unknown source file> :<unknown line>
87.77 s
> 7: core[940e698046960fd5]::panicking::panic_fmt <unknown>
87.77 s
> at <unknown source file> :<unknown line>
87.77 s
> 8: core[940e698046960fd5]::panicking::panic <unknown>
87.77 s
> at <unknown source file> :<unknown line>
87.77 s
> 9: <test_renormalization[5812939ef1a04d89]::finite_part_ghost_2loop::{closure#0} as core[940e698046960fd5]::ops::function::FnOnce<()>>::call_once <unknown>
87.77 s
> at <unknown source file> :<unknown line>
87.77 s
> 10: test[75d6903177b1d7e9]::__rust_begin_short_backtrace::<core[940e698046960fd5]::result::Result<(), alloc[2ea6bcb46fca0c42]::string::String>, fn() -> core[940e698046960fd5]::result::Result<(), alloc[2ea6bcb46fca0c42]::string::String>> <unknown>
87.77 s
> at <unknown source file> :<unknown line>
87.77 s
> 11: test[75d6903177b1d7e9]::run_test::{closure#0} <unknown>
87.77 s
> at <unknown source file> :<unknown line>
87.77 s
> 12: std[bcb96dfbba0ab899]::sys::backtrace::__rust_begin_short_backtrace::<test[75d6903177b1d7e9]::run_test::{closure#1}, ()> <unknown>
87.77 s
> at <unknown source file> :<unknown line>
87.77 s
> 13: <std[bcb96dfbba0ab899]::thread::lifecycle::spawn_unchecked<test[75d6903177b1d7e9]::run_test::{closure#1}, ()>::{closure#1} as core[940e698046960fd5]::ops::function::FnOnce<()>>::call_once::{shim:vtable#0} <unknown>
87.77 s
> at <unknown source file> :<unknown line>
87.77 s
> 14: <std[bcb96dfbba0ab899]::sys::thread::unix::Thread>::new::thread_start <unknown>
87.77 s
> at <unknown source file> :<unknown line>
87.77 s
> 15: start_thread <unknown>
87.77 s
> at <unknown source file> :<unknown line>
87.77 s
> 16: __clone3 <unknown>
87.77 s
> at <unknown source file> :<unknown line>
87.77 s
>
87.77 s
> Run with COLORBT_SHOW_HIDDEN=1 environment variable to disable frame filtering.
87.77 s
> Run with RUST_BACKTRACE=full to include source snippets.
87.77 s
>
87.77 s
> ------------
87.77 s
> Summary [ 29.317s] 706 tests run: 705 passed , 1 failed , 60 skipped
87.77 s
> FAIL [ 6.960s] (700/706) gammalooprs::test_renormalization finite_part_ghost_2loop
87.77 s
> stdout ---
87.77 s
>
87.77 s
> running 1 test
87.77 s
> test finite_part_ghost_2loop ... FAILED
87.77 s
>
87.77 s
> failures:
87.77 s
>
87.77 s
> failures:
87.77 s
> finite_part_ghost_2loop
87.77 s
>
87.77 s
> test result: FAILED. 0 passed; 1 failed; 0 ignored; 0 measured; 6 filtered out; finished in 6.93s
87.77 s
>
87.77 s
> stderr ---
87.77 s
> The application panicked (crashed).
87.77 s
> Message: assertion failed: (align_to_rqft(&a, &model) - expected).expand().is_zero()
87.77 s
> Location: crates/gammalooprs/tests/test_renormalization.rs :583
87.77 s
>
87.77 s
> ━━━━━━━━━━━━━━━━━━━━━━━━━━━━━━━━━━ BACKTRACE ━━━━━━━━━━━━━━━━━━━━━━━━━━━━━━━━━━━
87.77 s
> 1: <color_eyre[51793ea62743adbd]::config::PanicHook>::panic_report <unknown>
87.77 s
> at <unknown source file> :<unknown line>
87.77 s
> 2: <color_eyre[51793ea62743adbd]::config::PanicHook>::into_panic_hook::{closure#0} <unknown>
87.77 s
> at <unknown source file> :<unknown line>
87.77 s
> 3: std[bcb96dfbba0ab899]::panicking::panic_with_hook <unknown>
87.77 s
> at <unknown source file> :<unknown line>
87.77 s
> 4: std[bcb96dfbba0ab899]::panicking::panic_handler::{closure#0} <unknown>
87.77 s
> at <unknown source file> :<unknown line>
87.77 s
> 5: std[bcb96dfbba0ab899]::sys::backtrace::__rust_end_short_backtrace::<std[bcb96dfbba0ab899]::panicking::panic_handler::{closure#0}, !> <unknown>
87.77 s
> at <unknown source file> :<unknown line>
87.77 s
> 6: __rustc[6c289b9f9c454d21]::rust_begin_unwind <unknown>
87.77 s
> at <unknown source file> :<unknown line>
87.77 s
> 7: core[940e698046960fd5]::panicking::panic_fmt <unknown>
87.77 s
> at <unknown source file> :<unknown line>
87.77 s
> 8: core[940e698046960fd5]::panicking::panic <unknown>
87.77 s
> at <unknown source file> :<unknown line>
87.77 s
> 9: <test_renormalization[5812939ef1a04d89]::finite_part_ghost_2loop::{closure#0} as core[940e698046960fd5]::ops::function::FnOnce<()>>::call_once <unknown>
87.77 s
> at <unknown source file> :<unknown line>
87.77 s
> 10: test[75d6903177b1d7e9]::__rust_begin_short_backtrace::<core[940e698046960fd5]::result::Result<(), alloc[2ea6bcb46fca0c42]::string::String>, fn() -> core[940e698046960fd5]::result::Result<(), alloc[2ea6bcb46fca0c42]::string::String>> <unknown>
87.77 s
> at <unknown source file> :<unknown line>
87.77 s
> 11: test[75d6903177b1d7e9]::run_test::{closure#0} <unknown>
87.77 s
> at <unknown source file> :<unknown line>
87.77 s
> 12: std[bcb96dfbba0ab899]::sys::backtrace::__rust_begin_short_backtrace::<test[75d6903177b1d7e9]::run_test::{closure#1}, ()> <unknown>
87.77 s
> at <unknown source file> :<unknown line>
87.77 s
> 13: <std[bcb96dfbba0ab899]::thread::lifecycle::spawn_unchecked<test[75d6903177b1d7e9]::run_test::{closure#1}, ()>::{closure#1} as core[940e698046960fd5]::ops::function::FnOnce<()>>::call_once::{shim:vtable#0} <unknown>
87.77 s
> at <unknown source file> :<unknown line>
87.77 s
> 14: <std[bcb96dfbba0ab899]::sys::thread::unix::Thread>::new::thread_start <unknown>
87.77 s
> at <unknown source file> :<unknown line>
87.77 s
> 15: start_thread <unknown>
87.77 s
> at <unknown source file> :<unknown line>
87.77 s
> 16: __clone3 <unknown>
87.77 s
> at <unknown source file> :<unknown line>
87.77 s
>
87.77 s
> Run with COLORBT_SHOW_HIDDEN=1 environment variable to disable frame filtering.
87.77 s
> Run with RUST_BACKTRACE=full to include source snippets.
87.77 s
>
87.77 s
> error : test run failed
87.77 s
>
87.77 s
> ========== nextest test summary ==========
87.77 s
> report: target/nextest/ci_gammaloop/junit.xml
87.77 s
> tests: 706, failures: 1, errors: 0
87.77 s
>
87.77 s
> 1. gammalooprs::test_renormalization::finite_part_ghost_2loop
87.77 s
> failure: test failure with exit code 101
87.77 s
> system-out
87.77 s
> running 1 test
87.77 s
> test finite_part_ghost_2loop ... FAILED
87.77 s
>
87.77 s
> failures:
87.77 s
>
87.77 s
> failures:
87.77 s
> finite_part_ghost_2loop
87.77 s
>
87.77 s
> test result: FAILED. 0 passed; 1 failed; 0 ignored; 0 measured; 6 filtered out; finished in 6.93s
87.77 s
> system-err
87.77 s
> The application panicked (crashed).
87.77 s
> Message: assertion failed: (align_to_rqft(&a, &model) - expected).expand().is_zero()
87.77 s
> Location: crates/gammalooprs/tests/test_renormalization.rs:583
87.77 s
>
87.77 s
> ━━━━━━━━━━━━━━━━━━━━━━━━━━━━━━━━━━ BACKTRACE ━━━━━━━━━━━━━━━━━━━━━━━━━━━━━━━━━━━
87.77 s
> 1: <color_eyre[51793ea62743adbd]::config::PanicHook>::panic_report<unknown>
87.77 s
> at <unknown source file>:<unknown line>
87.77 s
> 2: <color_eyre[51793ea62743adbd]::config::PanicHook>::into_panic_hook::{closure#0}<unknown>
87.77 s
> at <unknown source file>:<unknown line>
87.77 s
> 3: std[bcb96dfbba0ab899]::panicking::panic_with_hook<unknown>
87.77 s
> at <unknown source file>:<unknown line>
87.77 s
> 4: std[bcb96dfbba0ab899]::panicking::panic_handler::{closure#0}<unknown>
87.77 s
> at <unknown source file>:<unknown line>
87.77 s
> 5: std[bcb96dfbba0ab899]::sys::backtrace::__rust_end_short_backtrace::<std[bcb96dfbba0ab899]::panicking::panic_handler::{closure#0}, !><unknown>
87.77 s
> at <unknown source file>:<unknown line>
87.77 s
> 6: __rustc[6c289b9f9c454d21]::rust_begin_unwind<unknown>
87.77 s
> at <unknown source file>:<unknown line>
87.77 s
> 7: core[940e698046960fd5]::panicking::panic_fmt<unknown>
87.77 s
> at <unknown source file>:<unknown line>
87.77 s
> 8: core[940e698046960fd5]::panicking::panic<unknown>
87.77 s
> at <unknown source file>:<unknown line>
87.77 s
> 9: <test_renormalization[5812939ef1a04d89]::finite_part_ghost_2loop::{closure#0} as core[940e698046960fd5]::ops::function::FnOnce<()>>::call_once<unknown>
87.77 s
> at <unknown source file>:<unknown line>
87.77 s
> 10: test[75d6903177b1d7e9]::__rust_begin_short_backtrace::<core[940e698046960fd5]::result::Result<(), alloc[2ea6bcb46fca0c42]::string::String>, fn() -> core[940e698046960fd5]::result::Result<(), alloc[2ea6bcb46fca0c42]::string::String>><unknown>
87.77 s
> at <unknown source file>:<unknown line>
87.77 s
> 11: test[75d6903177b1d7e9]::run_test::{closure#0}<unknown>
87.77 s
> at <unknown source file>:<unknown line>
87.77 s
> 12: std[bcb96dfbba0ab899]::sys::backtrace::__rust_begin_short_backtrace::<test[75d6903177b1d7e9]::run_test::{closure#1}, ()><unknown>
87.77 s
> at <unknown source file>:<unknown line>
87.77 s
> 13: <std[bcb96dfbba0ab899]::thread::lifecycle::spawn_unchecked<test[75d6903177b1d7e9]::run_test::{closure#1}, ()>::{closure#1} as core[940e698046960fd5]::ops::function::FnOnce<()>>::call_once::{shim:vtable#0}<unknown>
87.77 s
> at <unknown source file>:<unknown line>
87.77 s
> 14: <std[bcb96dfbba0ab899]::sys::thread::unix::Thread>::new::thread_start<unknown>
87.77 s
> at <unknown source file>:<unknown line>
87.77 s
> 15: start_thread<unknown>
87.77 s
> at <unknown source file>:<unknown line>
87.77 s
> 16: __clone3<unknown>
87.77 s
> at <unknown source file>:<unknown line>
87.77 s
>
87.77 s
> Run with COLORBT_SHOW_HIDDEN=1 environment variable to disable frame filtering.
87.77 s
> Run with RUST_BACKTRACE=full to include source snippets.
87.77 s
> =========================================
87.77 s
> Extracting 1 binary, 1 build script output directory, and 1 linked path to /build/nextest-archive-7WAvrH
87.77 s
> Extracted 7 files to /build/nextest-archive-7WAvrH in 0.13s
87.77 s
> ------------
87.77 s
> Nextest run ID 9dd2940b-b100-4189-a271-ca81597be599 with nextest profile: ci_gammaloop
87.77 s
> Starting 105 tests across 1 binary
87.77 s
> ------------
87.77 s
> Summary [ 22.679s] 105 tests run: 105 passed , 0 skipped
87.77 s
>
87.77 s
> ========== nextest test summary ==========
87.77 s
> report: target/nextest/ci_gammaloop/junit.xml
87.77 s
> tests: 105, failures: 0, errors: 0
87.77 s
> No failing testcases found.
87.77 s
> =========================================
87.77 s
For full logs, run:
87.77 s
nix log /nix/store/6vhb553172wiyjq4h3y72x5wjfx0as4q-gammaloop-nextest-core.drv
87.95 s
Run failed.