1. 0.00 s $ /nix/store/9ypz3flqsrl5xl495mm8h645gadjsxi1-coreutils-9.11/bin/timeout --kill-after=15s 7200s /nix/store/23zk8sgzamrbmj1fday15szf7f2279s8-nix-2.34.7/bin/nix --extra-experimental-features nix-command --extra-experimental-features flakes flake clone git+https://github.com/alphal00p/gammaloop --dest /tmp/nix-ci-worker/stable-pwd/repo/
  2. 0.07 s Cloning into '/tmp/nix-ci-worker/stable-pwd/repo'...
  3. 0.71 s remote: Enumerating objects: 85276, done.
  4. 0.82 s remote: Counting objects: 0% (1/8981) remote: Counting objects: 1% (90/8981) remote: Counting objects: 2% (180/8981) remote: Counting objects: 3% (270/8981) remote: Counting objects: 4% (360/8981) remote: Counting objects: 5% (450/8981) remote: Counting objects: 6% (539/8981) remote: Counting objects: 7% (629/8981) remote: Counting objects: 8% (719/8981) remote: Counting objects: 9% (809/8981) remote: Counting objects: 10% (899/8981) remote: Counting objects: 11% (988/8981) remote: Counting objects: 12% (1078/8981) remote: Counting objects: 13% (1168/8981) remote: Counting objects: 14% (1258/8981) remote: Counting objects: 15% (1348/8981) remote: Counting objects: 16% (1437/8981) remote: Counting objects: 17% (1527/8981) remote: Counting objects: 18% (1617/8981) remote: Counting objects: 19% (1707/8981) remote: Counting objects: 20% (1797/8981) remote: Counting objects: 21% (1887/8981) remote: Counting objects: 22% (1976/8981) remote: Counting objects: 23% (2066/8981) remote: Counting objects: 24% (2156/8981) remote: Counting objects: 25% (2246/8981) remote: Counting objects: 26% (2336/8981) remote: Counting objects: 27% (2425/8981) remote: Counting objects: 28% (2515/8981) remote: Counting objects: 29% (2605/8981) remote: Counting objects: 30% (2695/8981) remote: Counting objects: 31% (2785/8981) remote: Counting objects: 32% (2874/8981) remote: Counting objects: 33% (2964/8981) remote: Counting objects: 34% (3054/8981) remote: Counting objects: 35% (3144/8981) remote: Counting objects: 36% (3234/8981) remote: Counting objects: 37% (3323/8981) remote: Counting objects: 38% (3413/8981) remote: Counting objects: 39% (3503/8981) remote: Counting objects: 40% (3593/8981) remote: Counting objects: 41% (3683/8981) remote: Counting objects: 42% (3773/8981) remote: Counting objects: 43% (3862/8981) remote: Counting objects: 44% (3952/8981) remote: Counting objects: 45% (4042/8981) remote: Counting objects: 46% (4132/8981) remote: Counting objects: 47% (4222/8981) remote: Counting objects: 48% (4311/8981) remote: Counting objects: 49% (4401/8981) remote: Counting objects: 50% (4491/8981) remote: Counting objects: 51% (4581/8981) remote: Counting objects: 52% (4671/8981) remote: Counting objects: 53% (4760/8981) remote: Counting objects: 54% (4850/8981) remote: Counting objects: 55% (4940/8981) remote: Counting objects: 56% (5030/8981) remote: Counting objects: 57% (5120/8981) remote: Counting objects: 58% (5209/8981) remote: Counting objects: 59% (5299/8981) remote: Counting objects: 60% (5389/8981) remote: Counting objects: 61% (5479/8981) remote: Counting objects: 62% (5569/8981) remote: Counting objects: 63% (5659/8981) remote: Counting objects: 64% (5748/8981) remote: Counting objects: 65% (5838/8981) remote: Counting objects: 66% (5928/8981) remote: Counting objects: 67% (6018/8981) remote: Counting objects: 68% (6108/8981) remote: Counting objects: 69% (6197/8981) remote: Counting objects: 70% (6287/8981) remote: Counting objects: 71% (6377/8981) remote: Counting objects: 72% (6467/8981) remote: Counting objects: 73% (6557/8981) remote: Counting objects: 74% (6646/8981) remote: Counting objects: 75% (6736/8981) remote: Counting objects: 76% (6826/8981) remote: Counting objects: 77% (6916/8981) remote: Counting objects: 78% (7006/8981) remote: Counting objects: 79% (7095/8981) remote: Counting objects: 80% (7185/8981) remote: Counting objects: 81% (7275/8981) remote: Counting objects: 82% (7365/8981) remote: Counting objects: 83% (7455/8981) remote: Counting objects: 84% (7545/8981) remote: Counting objects: 85% (7634/8981) remote: Counting objects: 86% (7724/8981) remote: Counting objects: 87% (7814/8981) remote: Counting objects: 88% (7904/8981) remote: Counting objects: 89% (7994/8981) remote: Counting objects: 90% (8083/8981) remote: Counting objects: 91% (8173/8981) remote: Counting objects: 92% (8263/8981) remote: Counting objects: 93% (8353/8981) remote: Counting objects: 94% (8443/8981) remote: Counting objects: 95% (8532/8981) remote: Counting objects: 96% (8622/8981) remote: Counting objects: 97% (8712/8981) remote: Counting objects: 98% (8802/8981) remote: Counting objects: 99% (8892/8981) remote: Counting objects: 100% (8981/8981) remote: Counting objects: 100% (8981/8981), done.
  5. 2.74 s remote: Compressing objects: 0% (1/1985) remote: Compressing objects: 1% (20/1985) remote: Compressing objects: 2% (40/1985) remote: Compressing objects: 3% (60/1985) remote: Compressing objects: 4% (80/1985) remote: Compressing objects: 5% (100/1985) remote: Compressing objects: 6% (120/1985) remote: Compressing objects: 7% (139/1985) remote: Compressing objects: 8% (159/1985) remote: Compressing objects: 9% (179/1985) remote: Compressing objects: 10% (199/1985) remote: Compressing objects: 10% (207/1985) remote: Compressing objects: 11% (219/1985) remote: Compressing objects: 12% (239/1985) remote: Compressing objects: 13% (259/1985) remote: Compressing objects: 14% (278/1985) remote: Compressing objects: 15% (298/1985) remote: Compressing objects: 16% (318/1985) remote: Compressing objects: 17% (338/1985) remote: Compressing objects: 18% (358/1985) remote: Compressing objects: 19% (378/1985) remote: Compressing objects: 20% (397/1985) remote: Compressing objects: 21% (417/1985) remote: Compressing objects: 22% (437/1985) remote: Compressing objects: 23% (457/1985) remote: Compressing objects: 24% (477/1985) remote: Compressing objects: 25% (497/1985) remote: Compressing objects: 26% (517/1985) remote: Compressing objects: 27% (536/1985) remote: Compressing objects: 28% (556/1985) remote: Compressing objects: 29% (576/1985) remote: Compressing objects: 30% (596/1985) remote: Compressing objects: 31% (616/1985) remote: Compressing objects: 32% (636/1985) remote: Compressing objects: 33% (656/1985) remote: Compressing objects: 34% (675/1985) remote: Compressing objects: 35% (695/1985) remote: Compressing objects: 36% (715/1985) remote: Compressing objects: 37% (735/1985) remote: Compressing objects: 38% (755/1985) remote: Compressing objects: 39% (775/1985) remote: Compressing objects: 40% (794/1985) remote: Compressing objects: 41% (814/1985) remote: Compressing objects: 42% (834/1985) remote: Compressing objects: 43% (854/1985) remote: Compressing objects: 44% (874/1985) remote: Compressing objects: 45% (894/1985) remote: Compressing objects: 46% (914/1985) remote: Compressing objects: 47% (933/1985) remote: Compressing objects: 48% (953/1985) remote: Compressing objects: 49% (973/1985) remote: Compressing objects: 50% (993/1985) remote: Compressing objects: 51% (1013/1985) remote: Compressing objects: 52% (1033/1985) remote: Compressing objects: 53% (1053/1985) remote: Compressing objects: 54% (1072/1985) remote: Compressing objects: 55% (1092/1985) remote: Compressing objects: 56% (1112/1985) remote: Compressing objects: 57% (1132/1985) remote: Compressing objects: 58% (1152/1985) remote: Compressing objects: 59% (1172/1985) remote: Compressing objects: 60% (1191/1985) remote: Compressing objects: 61% (1211/1985) remote: Compressing objects: 62% (1231/1985) remote: Compressing objects: 63% (1251/1985) remote: Compressing objects: 64% (1271/1985) remote: Compressing objects: 65% (1291/1985) remote: Compressing objects: 66% (1311/1985) remote: Compressing objects: 67% (1330/1985) remote: Compressing objects: 68% (1350/1985) remote: Compressing objects: 69% (1370/1985) remote: Compressing objects: 70% (1390/1985) remote: Compressing objects: 71% (1410/1985) remote: Compressing objects: 72% (1430/1985) remote: Compressing objects: 73% (1450/1985) remote: Compressing objects: 74% (1469/1985) remote: Compressing objects: 75% (1489/1985) remote: Compressing objects: 76% (1509/1985) remote: Compressing objects: 77% (1529/1985) remote: Compressing objects: 78% (1549/1985) remote: Compressing objects: 79% (1569/1985) remote: Compressing objects: 80% (1588/1985) remote: Compressing objects: 80% (1599/1985) remote: Compressing objects: 81% (1608/1985) remote: Compressing objects: 82% (1628/1985) remote: Compressing objects: 83% (1648/1985) remote: Compressing objects: 84% (1668/1985) remote: Compressing objects: 85% (1688/1985) remote: Compressing objects: 86% (1708/1985) remote: Compressing objects: 87% (1727/1985) remote: Compressing objects: 88% (1747/1985) remote: Compressing objects: 89% (1767/1985) remote: Compressing objects: 90% (1787/1985) remote: Compressing objects: 91% (1807/1985) remote: Compressing objects: 92% (1827/1985) remote: Compressing objects: 93% (1847/1985) remote: Compressing objects: 94% (1866/1985) remote: Compressing objects: 95% (1886/1985) remote: Compressing objects: 96% (1906/1985) remote: Compressing objects: 97% (1926/1985) remote: Compressing objects: 98% (1946/1985) remote: Compressing objects: 99% (1966/1985) remote: Compressing objects: 100% (1985/1985) remote: Compressing objects: 100% (1985/1985), done.
  6. 6.99 s Receiving objects: 0% (1/85276) Receiving objects: 1% (853/85276) Receiving objects: 2% (1706/85276) Receiving objects: 3% (2559/85276) Receiving objects: 4% (3412/85276) Receiving objects: 5% (4264/85276) Receiving objects: 6% (5117/85276) Receiving objects: 7% (5970/85276) Receiving objects: 8% (6823/85276) Receiving objects: 9% (7675/85276), 16.82 MiB | 33.62 MiB/s Receiving objects: 10% (8528/85276), 16.82 MiB | 33.62 MiB/s Receiving objects: 11% (9381/85276), 16.82 MiB | 33.62 MiB/s Receiving objects: 12% (10234/85276), 16.82 MiB | 33.62 MiB/s Receiving objects: 13% (11086/85276), 16.82 MiB | 33.62 MiB/s Receiving objects: 14% (11939/85276), 16.82 MiB | 33.62 MiB/s Receiving objects: 15% (12792/85276), 16.82 MiB | 33.62 MiB/s Receiving objects: 16% (13645/85276), 16.82 MiB | 33.62 MiB/s Receiving objects: 17% (14497/85276), 16.82 MiB | 33.62 MiB/s Receiving objects: 18% (15350/85276), 16.82 MiB | 33.62 MiB/s Receiving objects: 19% (16203/85276), 16.82 MiB | 33.62 MiB/s Receiving objects: 20% (17056/85276), 16.82 MiB | 33.62 MiB/s Receiving objects: 21% (17908/85276), 16.82 MiB | 33.62 MiB/s Receiving objects: 22% (18761/85276), 16.82 MiB | 33.62 MiB/s Receiving objects: 23% (19614/85276), 16.82 MiB | 33.62 MiB/s Receiving objects: 24% (20467/85276), 16.82 MiB | 33.62 MiB/s Receiving objects: 25% (21319/85276), 16.82 MiB | 33.62 MiB/s Receiving objects: 26% (22172/85276), 16.82 MiB | 33.62 MiB/s Receiving objects: 27% (23025/85276), 16.82 MiB | 33.62 MiB/s Receiving objects: 28% (23878/85276), 16.82 MiB | 33.62 MiB/s Receiving objects: 29% (24731/85276), 16.82 MiB | 33.62 MiB/s Receiving objects: 30% (25583/85276), 16.82 MiB | 33.62 MiB/s Receiving objects: 31% (26436/85276), 16.82 MiB | 33.62 MiB/s Receiving objects: 32% (27289/85276), 16.82 MiB | 33.62 MiB/s Receiving objects: 33% (28142/85276), 16.82 MiB | 33.62 MiB/s Receiving objects: 34% (28994/85276), 16.82 MiB | 33.62 MiB/s Receiving objects: 35% (29847/85276), 16.82 MiB | 33.62 MiB/s Receiving objects: 36% (30700/85276), 16.82 MiB | 33.62 MiB/s Receiving objects: 37% (31553/85276), 16.82 MiB | 33.62 MiB/s Receiving objects: 38% (32405/85276), 16.82 MiB | 33.62 MiB/s Receiving objects: 39% (33258/85276), 16.82 MiB | 33.62 MiB/s Receiving objects: 40% (34111/85276), 16.82 MiB | 33.62 MiB/s Receiving objects: 40% (34247/85276), 35.72 MiB | 35.68 MiB/s Receiving objects: 41% (34964/85276), 35.72 MiB | 35.68 MiB/s Receiving objects: 42% (35816/85276), 35.72 MiB | 35.68 MiB/s Receiving objects: 43% (36669/85276), 35.72 MiB | 35.68 MiB/s Receiving objects: 44% (37522/85276), 35.72 MiB | 35.68 MiB/s Receiving objects: 45% (38375/85276), 35.72 MiB | 35.68 MiB/s Receiving objects: 46% (39227/85276), 35.72 MiB | 35.68 MiB/s Receiving objects: 47% (40080/85276), 35.72 MiB | 35.68 MiB/s Receiving objects: 48% (40933/85276), 35.72 MiB | 35.68 MiB/s Receiving objects: 49% (41786/85276), 35.72 MiB | 35.68 MiB/s Receiving objects: 50% (42638/85276), 35.72 MiB | 35.68 MiB/s Receiving objects: 51% (43491/85276), 35.72 MiB | 35.68 MiB/s Receiving objects: 52% (44344/85276), 35.72 MiB | 35.68 MiB/s Receiving objects: 53% (45197/85276), 35.72 MiB | 35.68 MiB/s Receiving objects: 54% (46050/85276), 54.84 MiB | 36.04 MiB/s Receiving objects: 55% (46902/85276), 54.84 MiB | 36.04 MiB/s Receiving objects: 56% (47755/85276), 54.84 MiB | 36.04 MiB/s Receiving objects: 57% (48608/85276), 54.84 MiB | 36.04 MiB/s Receiving objects: 58% (49461/85276), 54.84 MiB | 36.04 MiB/s Receiving objects: 59% (50313/85276), 54.84 MiB | 36.04 MiB/s Receiving objects: 60% (51166/85276), 54.84 MiB | 36.04 MiB/s Receiving objects: 60% (51247/85276), 54.84 MiB | 36.04 MiB/s Receiving objects: 61% (52019/85276), 74.04 MiB | 36.26 MiB/s Receiving objects: 62% (52872/85276), 74.04 MiB | 36.26 MiB/s Receiving objects: 63% (53724/85276), 74.04 MiB | 36.26 MiB/s Receiving objects: 64% (54577/85276), 74.04 MiB | 36.26 MiB/s Receiving objects: 65% (55430/85276), 74.04 MiB | 36.26 MiB/s Receiving objects: 66% (56283/85276), 74.04 MiB | 36.26 MiB/s Receiving objects: 67% (57135/85276), 74.04 MiB | 36.26 MiB/s Receiving objects: 68% (57988/85276), 93.51 MiB | 36.49 MiB/s Receiving objects: 69% (58841/85276), 93.51 MiB | 36.49 MiB/s Receiving objects: 70% (59694/85276), 93.51 MiB | 36.49 MiB/s Receiving objects: 70% (59751/85276), 93.51 MiB | 36.49 MiB/s Receiving objects: 71% (60546/85276), 93.51 MiB | 36.49 MiB/s Receiving objects: 72% (61399/85276), 113.03 MiB | 36.66 MiB/s Receiving objects: 73% (62252/85276), 113.03 MiB | 36.66 MiB/s Receiving objects: 74% (63105/85276), 113.03 MiB | 36.66 MiB/s Receiving objects: 75% (63957/85276), 113.03 MiB | 36.66 MiB/s Receiving objects: 76% (64810/85276), 113.03 MiB | 36.66 MiB/s Receiving objects: 77% (65663/85276), 131.75 MiB | 36.56 MiB/s Receiving objects: 78% (66516/85276), 131.75 MiB | 36.56 MiB/s Receiving objects: 79% (67369/85276), 131.75 MiB | 36.56 MiB/s Receiving objects: 80% (68221/85276), 131.75 MiB | 36.56 MiB/s Receiving objects: 81% (69074/85276), 131.75 MiB | 36.56 MiB/s Receiving objects: 82% (69927/85276), 131.75 MiB | 36.56 MiB/s Receiving objects: 83% (70780/85276), 131.75 MiB | 36.56 MiB/s Receiving objects: 84% (71632/85276), 131.75 MiB | 36.56 MiB/s Receiving objects: 85% (72485/85276), 131.75 MiB | 36.56 MiB/s Receiving objects: 86% (73338/85276), 131.75 MiB | 36.56 MiB/s Receiving objects: 87% (74191/85276), 131.75 MiB | 36.56 MiB/s Receiving objects: 87% (74845/85276), 131.75 MiB | 36.56 MiB/s Receiving objects: 88% (75043/85276), 131.75 MiB | 36.56 MiB/s Receiving objects: 89% (75896/85276), 131.75 MiB | 36.56 MiB/s Receiving objects: 90% (76749/85276), 131.75 MiB | 36.56 MiB/s Receiving objects: 91% (77602/85276), 131.75 MiB | 36.56 MiB/s Receiving objects: 92% (78454/85276), 131.75 MiB | 36.56 MiB/s Receiving objects: 93% (79307/85276), 131.75 MiB | 36.56 MiB/s Receiving objects: 94% (80160/85276), 131.75 MiB | 36.56 MiB/s Receiving objects: 95% (81013/85276), 150.80 MiB | 36.75 MiB/s Receiving objects: 96% (81865/85276), 150.80 MiB | 36.75 MiB/s Receiving objects: 97% (82718/85276), 150.80 MiB | 36.75 MiB/s Receiving objects: 98% (83571/85276), 150.80 MiB | 36.75 MiB/s Receiving objects: 99% (84424/85276), 150.80 MiB | 36.75 MiB/s remote: Total 85276 (delta 7823), reused 7079 (delta 6996), pack-reused 76295 (from 3)
  7. 6.99 s Receiving objects: 100% (85276/85276), 150.80 MiB | 36.75 MiB/s Receiving objects: 100% (85276/85276), 155.08 MiB | 36.56 MiB/s, done.
  8. 7.93 s Resolving deltas: 0% (0/57741) Resolving deltas: 1% (578/57741) Resolving deltas: 2% (1155/57741) Resolving deltas: 3% (1733/57741) Resolving deltas: 4% (2310/57741) Resolving deltas: 5% (2888/57741) Resolving deltas: 6% (3466/57741) Resolving deltas: 7% (4042/57741) Resolving deltas: 8% (4621/57741) Resolving deltas: 9% (5197/57741) Resolving deltas: 10% (5775/57741) Resolving deltas: 11% (6352/57741) Resolving deltas: 12% (6930/57741) Resolving deltas: 13% (7507/57741) Resolving deltas: 14% (8084/57741) Resolving deltas: 15% (8662/57741) Resolving deltas: 16% (9239/57741) Resolving deltas: 17% (9816/57741) Resolving deltas: 18% (10394/57741) Resolving deltas: 19% (10971/57741) Resolving deltas: 20% (11550/57741) Resolving deltas: 21% (12126/57741) Resolving deltas: 22% (12704/57741) Resolving deltas: 23% (13281/57741) Resolving deltas: 24% (13858/57741) Resolving deltas: 25% (14436/57741) Resolving deltas: 26% (15013/57741) Resolving deltas: 27% (15591/57741) Resolving deltas: 28% (16168/57741) Resolving deltas: 29% (16746/57741) Resolving deltas: 30% (17323/57741) Resolving deltas: 31% (17900/57741) Resolving deltas: 32% (18478/57741) Resolving deltas: 33% (19059/57741) Resolving deltas: 34% (19632/57741) Resolving deltas: 35% (20210/57741) Resolving deltas: 36% (20788/57741) Resolving deltas: 37% (21365/57741) Resolving deltas: 38% (21944/57741) Resolving deltas: 39% (22520/57741) Resolving deltas: 40% (23099/57741) Resolving deltas: 41% (23674/57741) Resolving deltas: 42% (24252/57741) Resolving deltas: 43% (24829/57741) Resolving deltas: 44% (25407/57741) Resolving deltas: 45% (25985/57741) Resolving deltas: 46% (26561/57741) Resolving deltas: 47% (27139/57741) Resolving deltas: 48% (27716/57741) Resolving deltas: 49% (28295/57741) Resolving deltas: 50% (28871/57741) Resolving deltas: 51% (29448/57741) Resolving deltas: 52% (30026/57741) Resolving deltas: 53% (30603/57741) Resolving deltas: 54% (31181/57741) Resolving deltas: 55% (31758/57741) Resolving deltas: 56% (32335/57741) Resolving deltas: 57% (32913/57741) Resolving deltas: 58% (33490/57741) Resolving deltas: 59% (34068/57741) Resolving deltas: 60% (34645/57741) Resolving deltas: 61% (35224/57741) Resolving deltas: 62% (35801/57741) Resolving deltas: 63% (36378/57741) Resolving deltas: 64% (36956/57741) Resolving deltas: 65% (37532/57741) Resolving deltas: 66% (38110/57741) Resolving deltas: 67% (38687/57741) Resolving deltas: 68% (39264/57741) Resolving deltas: 69% (39842/57741) Resolving deltas: 70% (40419/57741) Resolving deltas: 71% (40998/57741) Resolving deltas: 72% (41574/57741) Resolving deltas: 73% (42151/57741) Resolving deltas: 74% (42729/57741) Resolving deltas: 75% (43306/57741) Resolving deltas: 76% (43885/57741) Resolving deltas: 77% (44461/57741) Resolving deltas: 78% (45038/57741) Resolving deltas: 79% (45616/57741) Resolving deltas: 80% (46193/57741) Resolving deltas: 81% (46772/57741) Resolving deltas: 82% (47348/57741) Resolving deltas: 83% (47926/57741) Resolving deltas: 84% (48503/57741) Resolving deltas: 85% (49080/57741) Resolving deltas: 86% (49659/57741) Resolving deltas: 87% (50235/57741) Resolving deltas: 88% (50813/57741) Resolving deltas: 89% (51391/57741) Resolving deltas: 90% (51967/57741) Resolving deltas: 91% (52546/57741) Resolving deltas: 92% (53123/57741) Resolving deltas: 93% (53700/57741) Resolving deltas: 94% (54277/57741) Resolving deltas: 95% (54854/57741) Resolving deltas: 96% (55434/57741) Resolving deltas: 97% (56009/57741) Resolving deltas: 98% (56587/57741) Resolving deltas: 99% (57164/57741) Resolving deltas: 100% (57741/57741) Resolving deltas: 100% (57741/57741), done.
  9. 8.38 s Fetching commit d5938769c07785f101c69d5e83add27f6e396ad5 for faster_uv_from_4d ...
  10. 8.38 s $ /nix/store/bcnisk3ydfgv26v2gw3zlky24g00yww2-git-2.54.0/bin/git fetch origin d5938769c07785f101c69d5e83add27f6e396ad5
  11. 8.79 s From https://github.com/alphal00p/gammaloop
  12. 8.79 s * branch d5938769c07785f101c69d5e83add27f6e396ad5 -> FETCH_HEAD
  13. 8.80 s $ /nix/store/9ypz3flqsrl5xl495mm8h645gadjsxi1-coreutils-9.11/bin/timeout --kill-after=15s 7200s /nix/store/bcnisk3ydfgv26v2gw3zlky24g00yww2-git-2.54.0/bin/git -c advice.detachedHead=false checkout d5938769c07785f101c69d5e83add27f6e396ad5
  14. 9.09 s HEAD is now at d5938769c batch residue integrand sums after cut validation
  15. 9.09 s $ /nix/store/9ypz3flqsrl5xl495mm8h645gadjsxi1-coreutils-9.11/bin/timeout --kill-after=15s 7200s /nix/store/23zk8sgzamrbmj1fday15szf7f2279s8-nix-2.34.7/bin/nix --extra-experimental-features nix-command --extra-experimental-features flakes --log-format internal-json run .#packages.x86_64-linux.nix-ci-check-gammaloop-nextest-core --print-build-logs
  16. 13.34 s
  17. 18.55 s evaluating derivation 'g copying '/nix/store/hwbq evaluating derivation 'g copying '/nix/store/hwbq evaluating derivation 'g copying '/nix/store/hwbq evaluating derivation 'g copying '/nix/store/hwbq evaluating derivation 'g copying '/nix/store/hwbq evaluating derivation 'g querying gammaloop-nexte querying info about miss querying gammaloop-nexte [0/1 built, 0.0 KiB DL] [1/0/1 built, 0.0 KiB DLgammaloop-nextest-core> Extracting 4 binaries (including 1 non-test binary), 1 build script output directory, and 2 linked paths to /build/nextest-archive-DF84rT
  18. 19.26 s gammaloop-nextest-core> Extracted 20 files to /build/nextest-archive-DF84rT in 0.71s
  19. 19.27 s gammaloop-nextest-core> ------------
  20. 19.27 s gammaloop-nextest-core> Nextest run ID 9fdf3c4e-6100-4b73-86c8-ab215768fdb4 with nextest profile: ci_gammaloop
  21. 19.27 s gammaloop-nextest-core> Starting 379 tests across 3 binaries
  22. 20.58 s gammaloop-nextest-core> ------------
  23. 20.58 s gammaloop-nextest-core> Summary [ 1.309s] 379 tests run: 379 passed, 0 skipped
  24. 20.72 s gammaloop-nextest-core>
  25. 20.72 s gammaloop-nextest-core> ========== nextest test summary ==========
  26. 20.72 s gammaloop-nextest-core> report: target/nextest/ci_gammaloop/junit.xml
  27. 20.72 s gammaloop-nextest-core> tests: 379, failures: 0, errors: 0
  28. 20.72 s gammaloop-nextest-core> No failing testcases found.
  29. 20.72 s gammaloop-nextest-core> =========================================
  30. 20.74 s gammaloop-nextest-core> Extracting 1 binary and 1 linked path to /build/nextest-archive-olYUk0
  31. 20.80 s gammaloop-nextest-core> Extracted 7 files to /build/nextest-archive-olYUk0 in 0.07s
  32. 20.81 s gammaloop-nextest-core> ------------
  33. 20.81 s gammaloop-nextest-core> Nextest run ID d502760b-a43f-4f3d-9bda-39c7b5c3e5d2 with nextest profile: ci_gammaloop
  34. 20.81 s gammaloop-nextest-core> Starting 19 tests across 1 binary
  35. 20.82 s gammaloop-nextest-core> ------------
  36. 20.82 s gammaloop-nextest-core> Summary [ 0.012s] 19 tests run: 19 passed, 0 skipped
  37. 20.86 s gammaloop-nextest-core>
  38. 20.86 s gammaloop-nextest-core> ========== nextest test summary ==========
  39. 20.86 s gammaloop-nextest-core> report: target/nextest/ci_gammaloop/junit.xml
  40. 20.86 s gammaloop-nextest-core> tests: 19, failures: 0, errors: 0
  41. 20.86 s gammaloop-nextest-core> No failing testcases found.
  42. 20.86 s gammaloop-nextest-core> =========================================
  43. 20.88 s gammaloop-nextest-core> Extracting 1 binary to /build/nextest-archive-YR7ezD
  44. 20.91 s gammaloop-nextest-core> Extracted 4 files to /build/nextest-archive-YR7ezD in 0.03s
  45. 20.92 s gammaloop-nextest-core> ------------
  46. 20.92 s gammaloop-nextest-core> Nextest run ID f5fe14df-ea6b-42e8-9903-9a32b4f735a3 with nextest profile: ci_gammaloop
  47. 20.92 s gammaloop-nextest-core> Starting 0 tests across 1 binary
  48. 20.92 s gammaloop-nextest-core> ------------
  49. 20.92 s gammaloop-nextest-core> Summary [ 0.000s] 0 tests run: 0 passed, 0 skipped
  50. 20.95 s gammaloop-nextest-core>
  51. 20.95 s gammaloop-nextest-core> ========== nextest test summary ==========
  52. 20.95 s gammaloop-nextest-core> report: target/nextest/ci_gammaloop/junit.xml
  53. 20.95 s gammaloop-nextest-core> tests: 0, failures: 0, errors: 0
  54. 20.95 s gammaloop-nextest-core> No failing testcases found.
  55. 20.95 s gammaloop-nextest-core> =========================================
  56. 20.97 s gammaloop-nextest-core> Extracting 4 binaries, 1 build script output directory, and 2 linked paths to /build/nextest-archive-AdEWkA
  57. 21.48 s gammaloop-nextest-core> Extracted 18 files to /build/nextest-archive-AdEWkA in 0.52s
  58. 21.49 s gammaloop-nextest-core> ------------
  59. 21.49 s gammaloop-nextest-core> Nextest run ID 443e119a-471c-4eb4-b650-502439245be1 with nextest profile: ci_gammaloop
  60. 21.49 s gammaloop-nextest-core> Starting 702 tests across 4 binaries (60 tests skipped, including 59 tests via profile.ci_gammaloop.default-filter)
  61. 27.82 s gammaloop-nextest-core> FAIL [ 3.124s] (697/702) gammalooprs::test_renormalization finite_part_ghost_2loop
  62. 27.82 s gammaloop-nextest-core> stdout ---
  63. 27.82 s gammaloop-nextest-core>
  64. 27.82 s gammaloop-nextest-core> running 1 test
  65. 27.82 s gammaloop-nextest-core> test finite_part_ghost_2loop ... FAILED
  66. 27.82 s gammaloop-nextest-core>
  67. 27.82 s gammaloop-nextest-core> failures:
  68. 27.82 s gammaloop-nextest-core>
  69. 27.82 s gammaloop-nextest-core> failures:
  70. 27.82 s gammaloop-nextest-core> finite_part_ghost_2loop
  71. 27.82 s gammaloop-nextest-core>
  72. 27.82 s gammaloop-nextest-core> test result: FAILED. 0 passed; 1 failed; 0 ignored; 0 measured; 6 filtered out; finished in 3.12s
  73. 27.82 s gammaloop-nextest-core>
  74. 27.82 s gammaloop-nextest-core> stderr ---
  75. 27.82 s gammaloop-nextest-core> The application panicked (crashed).
  76. 27.82 s gammaloop-nextest-core> Message: assertion failed: (align_to_rqft(&a, &model) - expected).expand().is_zero()
  77. 27.82 s gammaloop-nextest-core> Location: crates/gammalooprs/tests/test_renormalization.rs:583
  78. 27.82 s gammaloop-nextest-core>
  79. 27.82 s gammaloop-nextest-core> ━━━━━━━━━━━━━━━━━━━━━━━━━━━━━━━━━━ BACKTRACE ━━━━━━━━━━━━━━━━━━━━━━━━━━━━━━━━━━━
  80. 27.82 s gammaloop-nextest-core> 1: <color_eyre[51793ea62743adbd]::config::PanicHook>::panic_report<unknown>
  81. 27.82 s gammaloop-nextest-core> at <unknown source file>:<unknown line>
  82. 27.82 s gammaloop-nextest-core> 2: <color_eyre[51793ea62743adbd]::config::PanicHook>::into_panic_hook::{closure#0}<unknown>
  83. 27.82 s gammaloop-nextest-core> at <unknown source file>:<unknown line>
  84. 27.82 s gammaloop-nextest-core> 3: std[bcb96dfbba0ab899]::panicking::panic_with_hook<unknown>
  85. 27.82 s gammaloop-nextest-core> at <unknown source file>:<unknown line>
  86. 27.82 s gammaloop-nextest-core> 4: std[bcb96dfbba0ab899]::panicking::panic_handler::{closure#0}<unknown>
  87. 27.82 s gammaloop-nextest-core> at <unknown source file>:<unknown line>
  88. 27.82 s gammaloop-nextest-core> 5: std[bcb96dfbba0ab899]::sys::backtrace::__rust_end_short_backtrace::<std[bcb96dfbba0ab899]::panicking::panic_handler::{closure#0}, !><unknown>
  89. 27.82 s gammaloop-nextest-core> at <unknown source file>:<unknown line>
  90. 27.82 s gammaloop-nextest-core> 6: __rustc[6c289b9f9c454d21]::rust_begin_unwind<unknown>
  91. 27.82 s gammaloop-nextest-core> at <unknown source file>:<unknown line>
  92. 27.82 s gammaloop-nextest-core> 7: core[940e698046960fd5]::panicking::panic_fmt<unknown>
  93. 27.82 s gammaloop-nextest-core> at <unknown source file>:<unknown line>
  94. 27.82 s gammaloop-nextest-core> 8: core[940e698046960fd5]::panicking::panic<unknown>
  95. 27.82 s gammaloop-nextest-core> at <unknown source file>:<unknown line>
  96. 27.82 s gammaloop-nextest-core> 9: <test_renormalization[5812939ef1a04d89]::finite_part_ghost_2loop::{closure#0} as core[940e698046960fd5]::ops::function::FnOnce<()>>::call_once<unknown>
  97. 27.82 s gammaloop-nextest-core> at <unknown source file>:<unknown line>
  98. 27.82 s gammaloop-nextest-core> 10: test[75d6903177b1d7e9]::__rust_begin_short_backtrace::<core[940e698046960fd5]::result::Result<(), alloc[2ea6bcb46fca0c42]::string::String>, fn() -> core[940e698046960fd5]::result::Result<(), alloc[2ea6bcb46fca0c42]::string::String>><unknown>
  99. 27.82 s gammaloop-nextest-core> at <unknown source file>:<unknown line>
  100. 27.82 s gammaloop-nextest-core> 11: test[75d6903177b1d7e9]::run_test::{closure#0}<unknown>
  101. 27.82 s gammaloop-nextest-core> at <unknown source file>:<unknown line>
  102. 27.82 s gammaloop-nextest-core> 12: std[bcb96dfbba0ab899]::sys::backtrace::__rust_begin_short_backtrace::<test[75d6903177b1d7e9]::run_test::{closure#1}, ()><unknown>
  103. 27.82 s gammaloop-nextest-core> at <unknown source file>:<unknown line>
  104. 27.82 s gammaloop-nextest-core> 13: <std[bcb96dfbba0ab899]::thread::lifecycle::spawn_unchecked<test[75d6903177b1d7e9]::run_test::{closure#1}, ()>::{closure#1} as core[940e698046960fd5]::ops::function::FnOnce<()>>::call_once::{shim:vtable#0}<unknown>
  105. 27.82 s gammaloop-nextest-core> at <unknown source file>:<unknown line>
  106. 27.82 s gammaloop-nextest-core> 14: <std[bcb96dfbba0ab899]::sys::thread::unix::Thread>::new::thread_start<unknown>
  107. 27.82 s gammaloop-nextest-core> at <unknown source file>:<unknown line>
  108. 27.82 s gammaloop-nextest-core> 15: start_thread<unknown>
  109. 27.82 s gammaloop-nextest-core> at <unknown source file>:<unknown line>
  110. 27.82 s gammaloop-nextest-core> 16: __clone3<unknown>
  111. 27.82 s gammaloop-nextest-core> at <unknown source file>:<unknown line>
  112. 27.82 s gammaloop-nextest-core>
  113. 27.82 s gammaloop-nextest-core> Run with COLORBT_SHOW_HIDDEN=1 environment variable to disable frame filtering.
  114. 27.82 s gammaloop-nextest-core> Run with RUST_BACKTRACE=full to include source snippets.
  115. 27.82 s gammaloop-nextest-core>
  116. 32.21 s gammaloop-nextest-core> ------------
  117. 32.21 s gammaloop-nextest-core> Summary [ 10.712s] 702 tests run: 701 passed, 1 failed, 60 skipped
  118. 32.21 s gammaloop-nextest-core> FAIL [ 3.124s] (697/702) gammalooprs::test_renormalization finite_part_ghost_2loop
  119. 32.21 s gammaloop-nextest-core> stdout ---
  120. 32.21 s gammaloop-nextest-core>
  121. 32.21 s gammaloop-nextest-core> running 1 test
  122. 32.21 s gammaloop-nextest-core> test finite_part_ghost_2loop ... FAILED
  123. 32.21 s gammaloop-nextest-core>
  124. 32.21 s gammaloop-nextest-core> failures:
  125. 32.21 s gammaloop-nextest-core>
  126. 32.21 s gammaloop-nextest-core> failures:
  127. 32.21 s gammaloop-nextest-core> finite_part_ghost_2loop
  128. 32.21 s gammaloop-nextest-core>
  129. 32.21 s gammaloop-nextest-core> test result: FAILED. 0 passed; 1 failed; 0 ignored; 0 measured; 6 filtered out; finished in 3.12s
  130. 32.21 s gammaloop-nextest-core>
  131. 32.21 s gammaloop-nextest-core> stderr ---
  132. 32.21 s gammaloop-nextest-core> The application panicked (crashed).
  133. 32.21 s gammaloop-nextest-core> Message: assertion failed: (align_to_rqft(&a, &model) - expected).expand().is_zero()
  134. 32.21 s gammaloop-nextest-core> Location: crates/gammalooprs/tests/test_renormalization.rs:583
  135. 32.21 s gammaloop-nextest-core>
  136. 32.21 s gammaloop-nextest-core> ━━━━━━━━━━━━━━━━━━━━━━━━━━━━━━━━━━ BACKTRACE ━━━━━━━━━━━━━━━━━━━━━━━━━━━━━━━━━━━
  137. 32.21 s gammaloop-nextest-core> 1: <color_eyre[51793ea62743adbd]::config::PanicHook>::panic_report<unknown>
  138. 32.21 s gammaloop-nextest-core> at <unknown source file>:<unknown line>
  139. 32.21 s gammaloop-nextest-core> 2: <color_eyre[51793ea62743adbd]::config::PanicHook>::into_panic_hook::{closure#0}<unknown>
  140. 32.21 s gammaloop-nextest-core> at <unknown source file>:<unknown line>
  141. 32.21 s gammaloop-nextest-core> 3: std[bcb96dfbba0ab899]::panicking::panic_with_hook<unknown>
  142. 32.21 s gammaloop-nextest-core> at <unknown source file>:<unknown line>
  143. 32.21 s gammaloop-nextest-core> 4: std[bcb96dfbba0ab899]::panicking::panic_handler::{closure#0}<unknown>
  144. 32.21 s gammaloop-nextest-core> at <unknown source file>:<unknown line>
  145. 32.21 s gammaloop-nextest-core> 5: std[bcb96dfbba0ab899]::sys::backtrace::__rust_end_short_backtrace::<std[bcb96dfbba0ab899]::panicking::panic_handler::{closure#0}, !><unknown>
  146. 32.21 s gammaloop-nextest-core> at <unknown source file>:<unknown line>
  147. 32.21 s gammaloop-nextest-core> 6: __rustc[6c289b9f9c454d21]::rust_begin_unwind<unknown>
  148. 32.21 s gammaloop-nextest-core> at <unknown source file>:<unknown line>
  149. 32.21 s gammaloop-nextest-core> 7: core[940e698046960fd5]::panicking::panic_fmt<unknown>
  150. 32.21 s gammaloop-nextest-core> at <unknown source file>:<unknown line>
  151. 32.21 s gammaloop-nextest-core> 8: core[940e698046960fd5]::panicking::panic<unknown>
  152. 32.21 s gammaloop-nextest-core> at <unknown source file>:<unknown line>
  153. 32.21 s gammaloop-nextest-core> 9: <test_renormalization[5812939ef1a04d89]::finite_part_ghost_2loop::{closure#0} as core[940e698046960fd5]::ops::function::FnOnce<()>>::call_once<unknown>
  154. 32.21 s gammaloop-nextest-core> at <unknown source file>:<unknown line>
  155. 32.21 s gammaloop-nextest-core> 10: test[75d6903177b1d7e9]::__rust_begin_short_backtrace::<core[940e698046960fd5]::result::Result<(), alloc[2ea6bcb46fca0c42]::string::String>, fn() -> core[940e698046960fd5]::result::Result<(), alloc[2ea6bcb46fca0c42]::string::String>><unknown>
  156. 32.21 s gammaloop-nextest-core> at <unknown source file>:<unknown line>
  157. 32.21 s gammaloop-nextest-core> 11: test[75d6903177b1d7e9]::run_test::{closure#0}<unknown>
  158. 32.21 s gammaloop-nextest-core> at <unknown source file>:<unknown line>
  159. 32.21 s gammaloop-nextest-core> 12: std[bcb96dfbba0ab899]::sys::backtrace::__rust_begin_short_backtrace::<test[75d6903177b1d7e9]::run_test::{closure#1}, ()><unknown>
  160. 32.21 s gammaloop-nextest-core> at <unknown source file>:<unknown line>
  161. 32.21 s gammaloop-nextest-core> 13: <std[bcb96dfbba0ab899]::thread::lifecycle::spawn_unchecked<test[75d6903177b1d7e9]::run_test::{closure#1}, ()>::{closure#1} as core[940e698046960fd5]::ops::function::FnOnce<()>>::call_once::{shim:vtable#0}<unknown>
  162. 32.21 s gammaloop-nextest-core> at <unknown source file>:<unknown line>
  163. 32.21 s gammaloop-nextest-core> 14: <std[bcb96dfbba0ab899]::sys::thread::unix::Thread>::new::thread_start<unknown>
  164. 32.21 s gammaloop-nextest-core> at <unknown source file>:<unknown line>
  165. 32.21 s gammaloop-nextest-core> 15: start_thread<unknown>
  166. 32.21 s gammaloop-nextest-core> at <unknown source file>:<unknown line>
  167. 32.21 s gammaloop-nextest-core> 16: __clone3<unknown>
  168. 32.21 s gammaloop-nextest-core> at <unknown source file>:<unknown line>
  169. 32.21 s gammaloop-nextest-core>
  170. 32.21 s gammaloop-nextest-core> Run with COLORBT_SHOW_HIDDEN=1 environment variable to disable frame filtering.
  171. 32.21 s gammaloop-nextest-core> Run with RUST_BACKTRACE=full to include source snippets.
  172. 32.21 s gammaloop-nextest-core>
  173. 32.28 s gammaloop-nextest-core> error: test run failed
  174. 32.31 s gammaloop-nextest-core>
  175. 32.31 s gammaloop-nextest-core> ========== nextest test summary ==========
  176. 32.31 s gammaloop-nextest-core> report: target/nextest/ci_gammaloop/junit.xml
  177. 32.31 s gammaloop-nextest-core> tests: 702, failures: 1, errors: 0
  178. 32.31 s gammaloop-nextest-core>
  179. 32.31 s gammaloop-nextest-core> 1. gammalooprs::test_renormalization::finite_part_ghost_2loop
  180. 32.31 s gammaloop-nextest-core> failure: test failure with exit code 101
  181. 32.31 s gammaloop-nextest-core> system-out
  182. 32.31 s gammaloop-nextest-core> running 1 test
  183. 32.31 s gammaloop-nextest-core> test finite_part_ghost_2loop ... FAILED
  184. 32.31 s gammaloop-nextest-core>
  185. 32.31 s gammaloop-nextest-core> failures:
  186. 32.31 s gammaloop-nextest-core>
  187. 32.31 s gammaloop-nextest-core> failures:
  188. 32.31 s gammaloop-nextest-core> finite_part_ghost_2loop
  189. 32.31 s gammaloop-nextest-core>
  190. 32.31 s gammaloop-nextest-core> test result: FAILED. 0 passed; 1 failed; 0 ignored; 0 measured; 6 filtered out; finished in 3.12s
  191. 32.31 s gammaloop-nextest-core> system-err
  192. 32.31 s gammaloop-nextest-core> The application panicked (crashed).
  193. 32.31 s gammaloop-nextest-core> Message: assertion failed: (align_to_rqft(&a, &model) - expected).expand().is_zero()
  194. 32.31 s gammaloop-nextest-core> Location: crates/gammalooprs/tests/test_renormalization.rs:583
  195. 32.31 s gammaloop-nextest-core>
  196. 32.31 s gammaloop-nextest-core> ━━━━━━━━━━━━━━━━━━━━━━━━━━━━━━━━━━ BACKTRACE ━━━━━━━━━━━━━━━━━━━━━━━━━━━━━━━━━━━
  197. 32.31 s gammaloop-nextest-core> 1: <color_eyre[51793ea62743adbd]::config::PanicHook>::panic_report<unknown>
  198. 32.31 s gammaloop-nextest-core> at <unknown source file>:<unknown line>
  199. 32.31 s gammaloop-nextest-core> 2: <color_eyre[51793ea62743adbd]::config::PanicHook>::into_panic_hook::{closure#0}<unknown>
  200. 32.31 s gammaloop-nextest-core> at <unknown source file>:<unknown line>
  201. 32.31 s gammaloop-nextest-core> 3: std[bcb96dfbba0ab899]::panicking::panic_with_hook<unknown>
  202. 32.31 s gammaloop-nextest-core> at <unknown source file>:<unknown line>
  203. 32.31 s gammaloop-nextest-core> 4: std[bcb96dfbba0ab899]::panicking::panic_handler::{closure#0}<unknown>
  204. 32.31 s gammaloop-nextest-core> at <unknown source file>:<unknown line>
  205. 32.31 s gammaloop-nextest-core> 5: std[bcb96dfbba0ab899]::sys::backtrace::__rust_end_short_backtrace::<std[bcb96dfbba0ab899]::panicking::panic_handler::{closure#0}, !><unknown>
  206. 32.31 s gammaloop-nextest-core> at <unknown source file>:<unknown line>
  207. 32.31 s gammaloop-nextest-core> 6: __rustc[6c289b9f9c454d21]::rust_begin_unwind<unknown>
  208. 32.31 s gammaloop-nextest-core> at <unknown source file>:<unknown line>
  209. 32.31 s gammaloop-nextest-core> 7: core[940e698046960fd5]::panicking::panic_fmt<unknown>
  210. 32.31 s gammaloop-nextest-core> at <unknown source file>:<unknown line>
  211. 32.31 s gammaloop-nextest-core> 8: core[940e698046960fd5]::panicking::panic<unknown>
  212. 32.31 s gammaloop-nextest-core> at <unknown source file>:<unknown line>
  213. 32.31 s gammaloop-nextest-core> 9: <test_renormalization[5812939ef1a04d89]::finite_part_ghost_2loop::{closure#0} as core[940e698046960fd5]::ops::function::FnOnce<()>>::call_once<unknown>
  214. 32.31 s gammaloop-nextest-core> at <unknown source file>:<unknown line>
  215. 32.31 s gammaloop-nextest-core> 10: test[75d6903177b1d7e9]::__rust_begin_short_backtrace::<core[940e698046960fd5]::result::Result<(), alloc[2ea6bcb46fca0c42]::string::String>, fn() -> core[940e698046960fd5]::result::Result<(), alloc[2ea6bcb46fca0c42]::string::String>><unknown>
  216. 32.31 s gammaloop-nextest-core> at <unknown source file>:<unknown line>
  217. 32.31 s gammaloop-nextest-core> 11: test[75d6903177b1d7e9]::run_test::{closure#0}<unknown>
  218. 32.31 s gammaloop-nextest-core> at <unknown source file>:<unknown line>
  219. 32.31 s gammaloop-nextest-core> 12: std[bcb96dfbba0ab899]::sys::backtrace::__rust_begin_short_backtrace::<test[75d6903177b1d7e9]::run_test::{closure#1}, ()><unknown>
  220. 32.31 s gammaloop-nextest-core> at <unknown source file>:<unknown line>
  221. 32.31 s gammaloop-nextest-core> 13: <std[bcb96dfbba0ab899]::thread::lifecycle::spawn_unchecked<test[75d6903177b1d7e9]::run_test::{closure#1}, ()>::{closure#1} as core[940e698046960fd5]::ops::function::FnOnce<()>>::call_once::{shim:vtable#0}<unknown>
  222. 32.31 s gammaloop-nextest-core> at <unknown source file>:<unknown line>
  223. 32.31 s gammaloop-nextest-core> 14: <std[bcb96dfbba0ab899]::sys::thread::unix::Thread>::new::thread_start<unknown>
  224. 32.31 s gammaloop-nextest-core> at <unknown source file>:<unknown line>
  225. 32.31 s gammaloop-nextest-core> 15: start_thread<unknown>
  226. 32.31 s gammaloop-nextest-core> at <unknown source file>:<unknown line>
  227. 32.31 s gammaloop-nextest-core> 16: __clone3<unknown>
  228. 32.31 s gammaloop-nextest-core> at <unknown source file>:<unknown line>
  229. 32.31 s gammaloop-nextest-core>
  230. 32.31 s gammaloop-nextest-core> Run with COLORBT_SHOW_HIDDEN=1 environment variable to disable frame filtering.
  231. 32.31 s gammaloop-nextest-core> Run with RUST_BACKTRACE=full to include source snippets.
  232. 32.31 s gammaloop-nextest-core> =========================================
  233. 32.33 s gammaloop-nextest-core> Extracting 1 binary, 1 build script output directory, and 1 linked path to /build/nextest-archive-TOEtaZ
  234. 32.40 s gammaloop-nextest-core> Extracted 7 files to /build/nextest-archive-TOEtaZ in 0.08s
  235. 32.41 s gammaloop-nextest-core> ------------
  236. 32.41 s gammaloop-nextest-core> Nextest run ID 6ba7302e-07a6-4cc2-8463-d23496e474af with nextest profile: ci_gammaloop
  237. 32.41 s gammaloop-nextest-core> Starting 105 tests across 1 binary