0.00 s
$ /nix/store/9ypz3flqsrl5xl495mm8h645gadjsxi1-coreutils-9.11/bin/timeout --kill-after=15s 7200s /nix/store/23zk8sgzamrbmj1fday15szf7f2279s8-nix-2.34.7/bin/nix --extra-experimental-features nix-command --extra-experimental-features flakes flake clone git+https://github.com/alphal00p/gammaloop --dest /tmp/nix-ci-worker/stable-pwd/repo/
0.08 s
Cloning into '/tmp/nix-ci-worker/stable-pwd/repo'...
0.78 s
remote: Enumerating objects: 86068, done.
1.00 s
remote: Counting objects: 0% (1/8550)
remote: Counting objects: 1% (86/8550)
remote: Counting objects: 2% (171/8550)
remote: Counting objects: 3% (257/8550)
remote: Counting objects: 4% (342/8550)
remote: Counting objects: 5% (428/8550)
remote: Counting objects: 6% (513/8550)
remote: Counting objects: 7% (599/8550)
remote: Counting objects: 8% (684/8550)
remote: Counting objects: 9% (770/8550)
remote: Counting objects: 10% (855/8550)
remote: Counting objects: 11% (941/8550)
remote: Counting objects: 12% (1026/8550)
remote: Counting objects: 13% (1112/8550)
remote: Counting objects: 14% (1197/8550)
remote: Counting objects: 15% (1283/8550)
remote: Counting objects: 16% (1368/8550)
remote: Counting objects: 17% (1454/8550)
remote: Counting objects: 18% (1539/8550)
remote: Counting objects: 19% (1625/8550)
remote: Counting objects: 20% (1710/8550)
remote: Counting objects: 21% (1796/8550)
remote: Counting objects: 22% (1881/8550)
remote: Counting objects: 23% (1967/8550)
remote: Counting objects: 24% (2052/8550)
remote: Counting objects: 25% (2138/8550)
remote: Counting objects: 26% (2223/8550)
remote: Counting objects: 27% (2309/8550)
remote: Counting objects: 28% (2394/8550)
remote: Counting objects: 29% (2480/8550)
remote: Counting objects: 30% (2565/8550)
remote: Counting objects: 31% (2651/8550)
remote: Counting objects: 32% (2736/8550)
remote: Counting objects: 33% (2822/8550)
remote: Counting objects: 34% (2907/8550)
remote: Counting objects: 35% (2993/8550)
remote: Counting objects: 36% (3078/8550)
remote: Counting objects: 37% (3164/8550)
remote: Counting objects: 38% (3249/8550)
remote: Counting objects: 39% (3335/8550)
remote: Counting objects: 40% (3420/8550)
remote: Counting objects: 41% (3506/8550)
remote: Counting objects: 42% (3591/8550)
remote: Counting objects: 43% (3677/8550)
remote: Counting objects: 44% (3762/8550)
remote: Counting objects: 45% (3848/8550)
remote: Counting objects: 46% (3933/8550)
remote: Counting objects: 47% (4019/8550)
remote: Counting objects: 48% (4104/8550)
remote: Counting objects: 49% (4190/8550)
remote: Counting objects: 50% (4275/8550)
remote: Counting objects: 51% (4361/8550)
remote: Counting objects: 52% (4446/8550)
remote: Counting objects: 53% (4532/8550)
remote: Counting objects: 54% (4617/8550)
remote: Counting objects: 55% (4703/8550)
remote: Counting objects: 56% (4788/8550)
remote: Counting objects: 57% (4874/8550)
remote: Counting objects: 58% (4959/8550)
remote: Counting objects: 59% (5045/8550)
remote: Counting objects: 60% (5130/8550)
remote: Counting objects: 61% (5216/8550)
remote: Counting objects: 62% (5301/8550)
remote: Counting objects: 63% (5387/8550)
remote: Counting objects: 64% (5472/8550)
remote: Counting objects: 65% (5558/8550)
remote: Counting objects: 66% (5643/8550)
remote: Counting objects: 67% (5729/8550)
remote: Counting objects: 68% (5814/8550)
remote: Counting objects: 69% (5900/8550)
remote: Counting objects: 70% (5985/8550)
remote: Counting objects: 71% (6071/8550)
remote: Counting objects: 72% (6156/8550)
remote: Counting objects: 73% (6242/8550)
remote: Counting objects: 74% (6327/8550)
remote: Counting objects: 75% (6413/8550)
remote: Counting objects: 76% (6498/8550)
remote: Counting objects: 77% (6584/8550)
remote: Counting objects: 78% (6669/8550)
remote: Counting objects: 79% (6755/8550)
remote: Counting objects: 80% (6840/8550)
remote: Counting objects: 81% (6926/8550)
remote: Counting objects: 82% (7011/8550)
remote: Counting objects: 83% (7097/8550)
remote: Counting objects: 84% (7182/8550)
remote: Counting objects: 85% (7268/8550)
remote: Counting objects: 86% (7353/8550)
remote: Counting objects: 87% (7439/8550)
remote: Counting objects: 88% (7524/8550)
remote: Counting objects: 89% (7610/8550)
remote: Counting objects: 90% (7695/8550)
remote: Counting objects: 91% (7781/8550)
remote: Counting objects: 92% (7866/8550)
remote: Counting objects: 93% (7952/8550)
remote: Counting objects: 94% (8037/8550)
remote: Counting objects: 95% (8123/8550)
remote: Counting objects: 96% (8208/8550)
remote: Counting objects: 97% (8294/8550)
remote: Counting objects: 98% (8379/8550)
remote: Counting objects: 99% (8465/8550)
remote: Counting objects: 100% (8550/8550)
remote: Counting objects: 100% (8550/8550), done.
2.69 s
remote: Compressing objects: 0% (1/1698)
remote: Compressing objects: 1% (17/1698)
remote: Compressing objects: 2% (34/1698)
remote: Compressing objects: 3% (51/1698)
remote: Compressing objects: 4% (68/1698)
remote: Compressing objects: 5% (85/1698)
remote: Compressing objects: 6% (102/1698)
remote: Compressing objects: 7% (119/1698)
remote: Compressing objects: 8% (136/1698)
remote: Compressing objects: 9% (153/1698)
remote: Compressing objects: 9% (161/1698)
remote: Compressing objects: 10% (170/1698)
remote: Compressing objects: 11% (187/1698)
remote: Compressing objects: 12% (204/1698)
remote: Compressing objects: 13% (221/1698)
remote: Compressing objects: 14% (238/1698)
remote: Compressing objects: 15% (255/1698)
remote: Compressing objects: 16% (272/1698)
remote: Compressing objects: 17% (289/1698)
remote: Compressing objects: 18% (306/1698)
remote: Compressing objects: 19% (323/1698)
remote: Compressing objects: 20% (340/1698)
remote: Compressing objects: 21% (357/1698)
remote: Compressing objects: 22% (374/1698)
remote: Compressing objects: 23% (391/1698)
remote: Compressing objects: 24% (408/1698)
remote: Compressing objects: 25% (425/1698)
remote: Compressing objects: 26% (442/1698)
remote: Compressing objects: 27% (459/1698)
remote: Compressing objects: 28% (476/1698)
remote: Compressing objects: 29% (493/1698)
remote: Compressing objects: 30% (510/1698)
remote: Compressing objects: 31% (527/1698)
remote: Compressing objects: 32% (544/1698)
remote: Compressing objects: 33% (561/1698)
remote: Compressing objects: 34% (578/1698)
remote: Compressing objects: 35% (595/1698)
remote: Compressing objects: 36% (612/1698)
remote: Compressing objects: 37% (629/1698)
remote: Compressing objects: 38% (646/1698)
remote: Compressing objects: 39% (663/1698)
remote: Compressing objects: 40% (680/1698)
remote: Compressing objects: 41% (697/1698)
remote: Compressing objects: 42% (714/1698)
remote: Compressing objects: 43% (731/1698)
remote: Compressing objects: 44% (748/1698)
remote: Compressing objects: 45% (765/1698)
remote: Compressing objects: 46% (782/1698)
remote: Compressing objects: 47% (799/1698)
remote: Compressing objects: 48% (816/1698)
remote: Compressing objects: 49% (833/1698)
remote: Compressing objects: 50% (849/1698)
remote: Compressing objects: 51% (866/1698)
remote: Compressing objects: 52% (883/1698)
remote: Compressing objects: 53% (900/1698)
remote: Compressing objects: 54% (917/1698)
remote: Compressing objects: 55% (934/1698)
remote: Compressing objects: 56% (951/1698)
remote: Compressing objects: 57% (968/1698)
remote: Compressing objects: 58% (985/1698)
remote: Compressing objects: 59% (1002/1698)
remote: Compressing objects: 60% (1019/1698)
remote: Compressing objects: 61% (1036/1698)
remote: Compressing objects: 62% (1053/1698)
remote: Compressing objects: 63% (1070/1698)
remote: Compressing objects: 64% (1087/1698)
remote: Compressing objects: 65% (1104/1698)
remote: Compressing objects: 66% (1121/1698)
remote: Compressing objects: 67% (1138/1698)
remote: Compressing objects: 68% (1155/1698)
remote: Compressing objects: 69% (1172/1698)
remote: Compressing objects: 70% (1189/1698)
remote: Compressing objects: 71% (1206/1698)
remote: Compressing objects: 72% (1223/1698)
remote: Compressing objects: 73% (1240/1698)
remote: Compressing objects: 74% (1257/1698)
remote: Compressing objects: 75% (1274/1698)
remote: Compressing objects: 76% (1291/1698)
remote: Compressing objects: 77% (1308/1698)
remote: Compressing objects: 78% (1325/1698)
remote: Compressing objects: 79% (1342/1698)
remote: Compressing objects: 80% (1359/1698)
remote: Compressing objects: 81% (1376/1698)
remote: Compressing objects: 82% (1393/1698)
remote: Compressing objects: 83% (1410/1698)
remote: Compressing objects: 84% (1427/1698)
remote: Compressing objects: 85% (1444/1698)
remote: Compressing objects: 86% (1461/1698)
remote: Compressing objects: 87% (1478/1698)
remote: Compressing objects: 88% (1495/1698)
remote: Compressing objects: 89% (1512/1698)
remote: Compressing objects: 90% (1529/1698)
remote: Compressing objects: 91% (1546/1698)
remote: Compressing objects: 92% (1563/1698)
remote: Compressing objects: 93% (1580/1698)
remote: Compressing objects: 94% (1597/1698)
remote: Compressing objects: 95% (1614/1698)
remote: Compressing objects: 96% (1631/1698)
remote: Compressing objects: 97% (1648/1698)
remote: Compressing objects: 98% (1665/1698)
remote: Compressing objects: 99% (1682/1698)
remote: Compressing objects: 100% (1698/1698)
remote: Compressing objects: 100% (1698/1698), done.
7.17 s
Receiving objects: 0% (1/86068)
Receiving objects: 1% (861/86068)
Receiving objects: 2% (1722/86068)
Receiving objects: 3% (2583/86068)
Receiving objects: 4% (3443/86068)
Receiving objects: 5% (4304/86068)
Receiving objects: 6% (5165/86068)
Receiving objects: 7% (6025/86068)
Receiving objects: 8% (6886/86068)
Receiving objects: 9% (7747/86068), 12.12 MiB | 24.22 MiB/s
Receiving objects: 10% (8607/86068), 12.12 MiB | 24.22 MiB/s
Receiving objects: 11% (9468/86068), 12.12 MiB | 24.22 MiB/s
Receiving objects: 12% (10329/86068), 12.12 MiB | 24.22 MiB/s
Receiving objects: 13% (11189/86068), 12.12 MiB | 24.22 MiB/s
Receiving objects: 14% (12050/86068), 12.12 MiB | 24.22 MiB/s
Receiving objects: 15% (12911/86068), 12.12 MiB | 24.22 MiB/s
Receiving objects: 16% (13771/86068), 12.12 MiB | 24.22 MiB/s
Receiving objects: 17% (14632/86068), 12.12 MiB | 24.22 MiB/s
Receiving objects: 18% (15493/86068), 12.12 MiB | 24.22 MiB/s
Receiving objects: 19% (16353/86068), 12.12 MiB | 24.22 MiB/s
Receiving objects: 20% (17214/86068), 12.12 MiB | 24.22 MiB/s
Receiving objects: 21% (18075/86068), 12.12 MiB | 24.22 MiB/s
Receiving objects: 22% (18935/86068), 12.12 MiB | 24.22 MiB/s
Receiving objects: 23% (19796/86068), 12.12 MiB | 24.22 MiB/s
Receiving objects: 24% (20657/86068), 12.12 MiB | 24.22 MiB/s
Receiving objects: 25% (21517/86068), 12.12 MiB | 24.22 MiB/s
Receiving objects: 26% (22378/86068), 12.12 MiB | 24.22 MiB/s
Receiving objects: 27% (23239/86068), 12.12 MiB | 24.22 MiB/s
Receiving objects: 28% (24100/86068), 12.12 MiB | 24.22 MiB/s
Receiving objects: 29% (24960/86068), 12.12 MiB | 24.22 MiB/s
Receiving objects: 30% (25821/86068), 12.12 MiB | 24.22 MiB/s
Receiving objects: 31% (26682/86068), 12.12 MiB | 24.22 MiB/s
Receiving objects: 32% (27542/86068), 12.12 MiB | 24.22 MiB/s
Receiving objects: 33% (28403/86068), 12.12 MiB | 24.22 MiB/s
Receiving objects: 34% (29264/86068), 12.12 MiB | 24.22 MiB/s
Receiving objects: 35% (30124/86068), 12.12 MiB | 24.22 MiB/s
Receiving objects: 36% (30985/86068), 12.12 MiB | 24.22 MiB/s
Receiving objects: 37% (31846/86068), 12.12 MiB | 24.22 MiB/s
Receiving objects: 38% (32706/86068), 12.12 MiB | 24.22 MiB/s
Receiving objects: 38% (33076/86068), 30.96 MiB | 30.96 MiB/s
Receiving objects: 39% (33567/86068), 30.96 MiB | 30.96 MiB/s
Receiving objects: 40% (34428/86068), 30.96 MiB | 30.96 MiB/s
Receiving objects: 41% (35288/86068), 30.96 MiB | 30.96 MiB/s
Receiving objects: 42% (36149/86068), 30.96 MiB | 30.96 MiB/s
Receiving objects: 43% (37010/86068), 30.96 MiB | 30.96 MiB/s
Receiving objects: 44% (37870/86068), 30.96 MiB | 30.96 MiB/s
Receiving objects: 45% (38731/86068), 30.96 MiB | 30.96 MiB/s
Receiving objects: 46% (39592/86068), 30.96 MiB | 30.96 MiB/s
Receiving objects: 47% (40452/86068), 30.96 MiB | 30.96 MiB/s
Receiving objects: 48% (41313/86068), 30.96 MiB | 30.96 MiB/s
Receiving objects: 49% (42174/86068), 30.96 MiB | 30.96 MiB/s
Receiving objects: 50% (43034/86068), 30.96 MiB | 30.96 MiB/s
Receiving objects: 51% (43895/86068), 30.96 MiB | 30.96 MiB/s
Receiving objects: 52% (44756/86068), 52.08 MiB | 34.69 MiB/s
Receiving objects: 53% (45617/86068), 52.08 MiB | 34.69 MiB/s
Receiving objects: 54% (46477/86068), 52.08 MiB | 34.69 MiB/s
Receiving objects: 55% (47338/86068), 52.08 MiB | 34.69 MiB/s
Receiving objects: 56% (48199/86068), 52.08 MiB | 34.69 MiB/s
Receiving objects: 57% (49059/86068), 52.08 MiB | 34.69 MiB/s
Receiving objects: 57% (49646/86068), 68.81 MiB | 34.38 MiB/s
Receiving objects: 58% (49920/86068), 68.81 MiB | 34.38 MiB/s
Receiving objects: 59% (50781/86068), 68.81 MiB | 34.38 MiB/s
Receiving objects: 60% (51641/86068), 68.81 MiB | 34.38 MiB/s
Receiving objects: 61% (52502/86068), 68.81 MiB | 34.38 MiB/s
Receiving objects: 62% (53363/86068), 68.81 MiB | 34.38 MiB/s
Receiving objects: 63% (54223/86068), 68.81 MiB | 34.38 MiB/s
Receiving objects: 64% (55084/86068), 68.81 MiB | 34.38 MiB/s
Receiving objects: 65% (55945/86068), 68.81 MiB | 34.38 MiB/s
Receiving objects: 66% (56805/86068), 68.81 MiB | 34.38 MiB/s
Receiving objects: 66% (57342/86068), 103.20 MiB | 34.22 MiB/s
Receiving objects: 67% (57666/86068), 103.20 MiB | 34.22 MiB/s
Receiving objects: 68% (58527/86068), 103.20 MiB | 34.22 MiB/s
Receiving objects: 69% (59387/86068), 103.20 MiB | 34.22 MiB/s
Receiving objects: 70% (60248/86068), 103.20 MiB | 34.22 MiB/s
Receiving objects: 71% (61109/86068), 103.20 MiB | 34.22 MiB/s
Receiving objects: 72% (61969/86068), 103.20 MiB | 34.22 MiB/s
Receiving objects: 73% (62830/86068), 103.20 MiB | 34.22 MiB/s
Receiving objects: 74% (63691/86068), 121.64 MiB | 34.60 MiB/s
Receiving objects: 75% (64551/86068), 121.64 MiB | 34.60 MiB/s
Receiving objects: 76% (65412/86068), 121.64 MiB | 34.60 MiB/s
Receiving objects: 77% (66273/86068), 121.64 MiB | 34.60 MiB/s
Receiving objects: 78% (67134/86068), 121.64 MiB | 34.60 MiB/s
Receiving objects: 79% (67994/86068), 121.64 MiB | 34.60 MiB/s
Receiving objects: 80% (68855/86068), 121.64 MiB | 34.60 MiB/s
Receiving objects: 81% (69716/86068), 121.64 MiB | 34.60 MiB/s
Receiving objects: 82% (70576/86068), 121.64 MiB | 34.60 MiB/s
Receiving objects: 83% (71437/86068), 121.64 MiB | 34.60 MiB/s
Receiving objects: 84% (72298/86068), 121.64 MiB | 34.60 MiB/s
Receiving objects: 85% (73158/86068), 121.64 MiB | 34.60 MiB/s
Receiving objects: 85% (73304/86068), 121.64 MiB | 34.60 MiB/s
Receiving objects: 86% (74019/86068), 139.87 MiB | 34.77 MiB/s
Receiving objects: 87% (74880/86068), 139.87 MiB | 34.77 MiB/s
Receiving objects: 88% (75740/86068), 139.87 MiB | 34.77 MiB/s
Receiving objects: 89% (76601/86068), 139.87 MiB | 34.77 MiB/s
Receiving objects: 90% (77462/86068), 139.87 MiB | 34.77 MiB/s
Receiving objects: 91% (78322/86068), 139.87 MiB | 34.77 MiB/s
Receiving objects: 92% (79183/86068), 139.87 MiB | 34.77 MiB/s
Receiving objects: 93% (80044/86068), 139.87 MiB | 34.77 MiB/s
Receiving objects: 94% (80904/86068), 139.87 MiB | 34.77 MiB/s
Receiving objects: 95% (81765/86068), 139.87 MiB | 34.77 MiB/s
Receiving objects: 96% (82626/86068), 139.87 MiB | 34.77 MiB/s
Receiving objects: 97% (83486/86068), 139.87 MiB | 34.77 MiB/s
Receiving objects: 98% (84347/86068), 139.87 MiB | 34.77 MiB/s
Receiving objects: 99% (85208/86068), 139.87 MiB | 34.77 MiB/s
remote: Total 86068 (delta 7467), reused 6861 (delta 6851), pack-reused 77518 (from 3)
7.17 s
Receiving objects: 100% (86068/86068), 139.87 MiB | 34.77 MiB/s
Receiving objects: 100% (86068/86068), 155.78 MiB | 34.78 MiB/s, done.
8.71 s
Resolving deltas: 0% (0/58424)
Resolving deltas: 1% (585/58424)
Resolving deltas: 2% (1169/58424)
Resolving deltas: 3% (1755/58424)
Resolving deltas: 4% (2337/58424)
Resolving deltas: 5% (2922/58424)
Resolving deltas: 6% (3506/58424)
Resolving deltas: 7% (4090/58424)
Resolving deltas: 8% (4674/58424)
Resolving deltas: 9% (5259/58424)
Resolving deltas: 10% (5843/58424)
Resolving deltas: 11% (6427/58424)
Resolving deltas: 12% (7011/58424)
Resolving deltas: 13% (7596/58424)
Resolving deltas: 14% (8180/58424)
Resolving deltas: 15% (8764/58424)
Resolving deltas: 16% (9348/58424)
Resolving deltas: 17% (9933/58424)
Resolving deltas: 18% (10517/58424)
Resolving deltas: 19% (11101/58424)
Resolving deltas: 20% (11685/58424)
Resolving deltas: 21% (12270/58424)
Resolving deltas: 22% (12854/58424)
Resolving deltas: 23% (13438/58424)
Resolving deltas: 24% (14022/58424)
Resolving deltas: 25% (14606/58424)
Resolving deltas: 26% (15191/58424)
Resolving deltas: 27% (15775/58424)
Resolving deltas: 28% (16359/58424)
Resolving deltas: 29% (16943/58424)
Resolving deltas: 30% (17529/58424)
Resolving deltas: 31% (18112/58424)
Resolving deltas: 32% (18696/58424)
Resolving deltas: 33% (19280/58424)
Resolving deltas: 34% (19865/58424)
Resolving deltas: 35% (20449/58424)
Resolving deltas: 36% (21033/58424)
Resolving deltas: 37% (21619/58424)
Resolving deltas: 38% (22204/58424)
Resolving deltas: 39% (22787/58424)
Resolving deltas: 40% (23370/58424)
Resolving deltas: 41% (23954/58424)
Resolving deltas: 42% (24539/58424)
Resolving deltas: 43% (25123/58424)
Resolving deltas: 44% (25707/58424)
Resolving deltas: 45% (26291/58424)
Resolving deltas: 46% (26876/58424)
Resolving deltas: 47% (27460/58424)
Resolving deltas: 48% (28046/58424)
Resolving deltas: 49% (28632/58424)
Resolving deltas: 50% (29212/58424)
Resolving deltas: 51% (29797/58424)
Resolving deltas: 52% (30381/58424)
Resolving deltas: 53% (30965/58424)
Resolving deltas: 54% (31549/58424)
Resolving deltas: 55% (32135/58424)
Resolving deltas: 56% (32718/58424)
Resolving deltas: 57% (33302/58424)
Resolving deltas: 58% (33886/58424)
Resolving deltas: 59% (34471/58424)
Resolving deltas: 60% (35055/58424)
Resolving deltas: 61% (35639/58424)
Resolving deltas: 62% (36223/58424)
Resolving deltas: 63% (36808/58424)
Resolving deltas: 64% (37394/58424)
Resolving deltas: 65% (37976/58424)
Resolving deltas: 66% (38560/58424)
Resolving deltas: 67% (39146/58424)
Resolving deltas: 67% (39177/58424)
Resolving deltas: 68% (39729/58424)
Resolving deltas: 69% (40313/58424)
Resolving deltas: 70% (40897/58424)
Resolving deltas: 71% (41482/58424)
Resolving deltas: 72% (42066/58424)
Resolving deltas: 73% (42652/58424)
Resolving deltas: 74% (43234/58424)
Resolving deltas: 75% (43818/58424)
Resolving deltas: 76% (44403/58424)
Resolving deltas: 77% (44987/58424)
Resolving deltas: 78% (45571/58424)
Resolving deltas: 79% (46155/58424)
Resolving deltas: 80% (46740/58424)
Resolving deltas: 81% (47324/58424)
Resolving deltas: 82% (47909/58424)
Resolving deltas: 83% (48492/58424)
Resolving deltas: 84% (49077/58424)
Resolving deltas: 85% (49661/58424)
Resolving deltas: 86% (50245/58424)
Resolving deltas: 87% (50829/58424)
Resolving deltas: 88% (51414/58424)
Resolving deltas: 89% (51998/58424)
Resolving deltas: 90% (52582/58424)
Resolving deltas: 91% (53166/58424)
Resolving deltas: 92% (53751/58424)
Resolving deltas: 93% (54335/58424)
Resolving deltas: 94% (54919/58424)
Resolving deltas: 95% (55503/58424)
Resolving deltas: 96% (56088/58424)
Resolving deltas: 97% (56672/58424)
Resolving deltas: 98% (57256/58424)
Resolving deltas: 99% (57840/58424)
Resolving deltas: 100% (58424/58424)
Resolving deltas: 100% (58424/58424), done.
9.38 s
Fetching commit f938f9c1386eb2670a0a7f603f5eb0878086352a for faster_uv_from_4d ...
9.38 s
$ /nix/store/bcnisk3ydfgv26v2gw3zlky24g00yww2-git-2.54.0/bin/git fetch origin f938f9c1386eb2670a0a7f603f5eb0878086352a
9.82 s
From https://github.com/alphal00p/gammaloop
9.82 s
* branch f938f9c1386eb2670a0a7f603f5eb0878086352a -> FETCH_HEAD
9.84 s
$ /nix/store/9ypz3flqsrl5xl495mm8h645gadjsxi1-coreutils-9.11/bin/timeout --kill-after=15s 7200s /nix/store/bcnisk3ydfgv26v2gw3zlky24g00yww2-git-2.54.0/bin/git -c advice.detachedHead=false checkout f938f9c1386eb2670a0a7f603f5eb0878086352a
10.32 s
HEAD is now at f938f9c13 borrow sparse contraction-estimate coordinates
10.33 s
$ /nix/store/9ypz3flqsrl5xl495mm8h645gadjsxi1-coreutils-9.11/bin/timeout --kill-after=15s 7200s /nix/store/23zk8sgzamrbmj1fday15szf7f2279s8-nix-2.34.7/bin/nix --extra-experimental-features nix-command --extra-experimental-features flakes --log-format internal-json run .#packages.x86_64-linux.nix-ci-check-gammaloop-nextest-core --print-build-logs
17.29 s
25.80 s
evaluating derivation 'g
copying '/nix/store/7yd7
evaluating derivation 'g
copying '/nix/store/7yd7
evaluating derivation 'g
copying '/nix/store/7yd7
evaluating derivation 'g
copying '/nix/store/7yd7
evaluating derivation 'g
copying '/nix/store/7yd7
evaluating derivation 'g
copying '/nix/store/7yd7
evaluating derivation 'g
copying '/nix/store/7yd7
evaluating derivation 'g
copying '/nix/store/7yd7
evaluating derivation 'g
copying '/nix/store/7yd7
evaluating derivation 'g
copying '/nix/store/7yd7
evaluating derivation 'g
querying gammaloop-nexte
[0 /1 built, 0.0 KiB DL]
[1 /0 /1 built, 0.0 KiB DLgammaloop-nextest-core> Extracting 4 binaries (including 1 non-test binary), 1 build script output directory, and 2 linked paths to /build/nextest-archive-jBxkFj
26.91 s
gammaloop-nextest-core> Extracted 20 files to /build/nextest-archive-jBxkFj in 1.11s
26.93 s
gammaloop-nextest-core> ------------
26.93 s
gammaloop-nextest-core> Nextest run ID 3925007b-2532-4919-9628-9ed79b3c38b0 with nextest profile: ci_gammaloop
26.93 s
gammaloop-nextest-core> Starting 379 tests across 3 binaries
29.03 s
gammaloop-nextest-core> ------------
29.03 s
gammaloop-nextest-core> Summary [ 2.097s] 379 tests run: 379 passed , 0 skipped
29.30 s
gammaloop-nextest-core>
29.30 s
gammaloop-nextest-core> ========== nextest test summary ==========
29.30 s
gammaloop-nextest-core> report: target/nextest/ci_gammaloop/junit.xml
29.30 s
gammaloop-nextest-core> tests: 379, failures: 0, errors: 0
29.30 s
gammaloop-nextest-core> No failing testcases found.
29.30 s
gammaloop-nextest-core> =========================================
29.33 s
gammaloop-nextest-core> Extracting 1 binary and 1 linked path to /build/nextest-archive-lcE2S4
29.44 s
gammaloop-nextest-core> Extracted 7 files to /build/nextest-archive-lcE2S4 in 0.12s
29.46 s
gammaloop-nextest-core> ------------
29.46 s
gammaloop-nextest-core> Nextest run ID 62eab051-744d-4f1a-86d9-32e787057672 with nextest profile: ci_gammaloop
29.46 s
gammaloop-nextest-core> Starting 19 tests across 1 binary
29.49 s
gammaloop-nextest-core> ------------
29.49 s
gammaloop-nextest-core> Summary [ 0.026s] 19 tests run: 19 passed , 0 skipped
29.56 s
gammaloop-nextest-core>
29.56 s
gammaloop-nextest-core> ========== nextest test summary ==========
29.56 s
gammaloop-nextest-core> report: target/nextest/ci_gammaloop/junit.xml
29.56 s
gammaloop-nextest-core> tests: 19, failures: 0, errors: 0
29.56 s
gammaloop-nextest-core> No failing testcases found.
29.56 s
gammaloop-nextest-core> =========================================
29.60 s
gammaloop-nextest-core> Extracting 1 binary to /build/nextest-archive-F7K6dw
29.66 s
gammaloop-nextest-core> Extracted 4 files to /build/nextest-archive-F7K6dw in 0.07s
29.69 s
gammaloop-nextest-core> ------------
29.69 s
gammaloop-nextest-core> Nextest run ID 307e317d-ddb6-439f-b37d-de34ad769f08 with nextest profile: ci_gammaloop
29.69 s
gammaloop-nextest-core> Starting 0 tests across 1 binary
29.69 s
gammaloop-nextest-core> ------------
29.69 s
gammaloop-nextest-core> Summary [ 0.000s] 0 tests run: 0 passed , 0 skipped
29.75 s
gammaloop-nextest-core>
29.75 s
gammaloop-nextest-core> ========== nextest test summary ==========
29.75 s
gammaloop-nextest-core> report: target/nextest/ci_gammaloop/junit.xml
29.75 s
gammaloop-nextest-core> tests: 0, failures: 0, errors: 0
29.75 s
gammaloop-nextest-core> No failing testcases found.
29.75 s
gammaloop-nextest-core> =========================================
29.78 s
gammaloop-nextest-core> Extracting 4 binaries, 1 build script output directory, and 2 linked paths to /build/nextest-archive-3JPOjo
30.50 s
gammaloop-nextest-core> Extracted 18 files to /build/nextest-archive-3JPOjo in 0.72s
30.52 s
gammaloop-nextest-core> ------------
30.52 s
gammaloop-nextest-core> Nextest run ID 42b498fb-00bc-44a5-9dca-526944105c79 with nextest profile: ci_gammaloop
30.52 s
gammaloop-nextest-core> Starting 706 tests across 4 binaries (60 tests skipped , including 59 tests via profile.ci_gammaloop.default-filter )
41.65 s
gammaloop-nextest-core> FAIL [ 5.281s] (701/706) gammalooprs::test_renormalization finite_part_ghost_2loop
41.65 s
gammaloop-nextest-core> stdout ---
41.65 s
gammaloop-nextest-core>
41.65 s
gammaloop-nextest-core> running 1 test
41.65 s
gammaloop-nextest-core> test finite_part_ghost_2loop ... FAILED
41.65 s
gammaloop-nextest-core>
41.65 s
gammaloop-nextest-core> failures:
41.65 s
gammaloop-nextest-core>
41.65 s
gammaloop-nextest-core> failures:
41.65 s
gammaloop-nextest-core> finite_part_ghost_2loop
41.65 s
gammaloop-nextest-core>
41.65 s
gammaloop-nextest-core> test result: FAILED. 0 passed; 1 failed; 0 ignored; 0 measured; 6 filtered out; finished in 5.27s
41.65 s
gammaloop-nextest-core>
41.65 s
gammaloop-nextest-core> stderr ---
41.65 s
gammaloop-nextest-core> The application panicked (crashed).
41.65 s
gammaloop-nextest-core> Message: assertion failed: (align_to_rqft(&a, &model) - expected).expand().is_zero()
41.65 s
gammaloop-nextest-core> Location: crates/gammalooprs/tests/test_renormalization.rs :583
41.65 s
gammaloop-nextest-core>
41.65 s
gammaloop-nextest-core> ━━━━━━━━━━━━━━━━━━━━━━━━━━━━━━━━━━ BACKTRACE ━━━━━━━━━━━━━━━━━━━━━━━━━━━━━━━━━━━
41.65 s
gammaloop-nextest-core> 1: <color_eyre[51793ea62743adbd]::config::PanicHook>::panic_report <unknown>
41.65 s
gammaloop-nextest-core> at <unknown source file> :<unknown line>
41.65 s
gammaloop-nextest-core> 2: <color_eyre[51793ea62743adbd]::config::PanicHook>::into_panic_hook::{closure#0} <unknown>
41.65 s
gammaloop-nextest-core> at <unknown source file> :<unknown line>
41.65 s
gammaloop-nextest-core> 3: std[bcb96dfbba0ab899]::panicking::panic_with_hook <unknown>
41.65 s
gammaloop-nextest-core> at <unknown source file> :<unknown line>
41.65 s
gammaloop-nextest-core> 4: std[bcb96dfbba0ab899]::panicking::panic_handler::{closure#0} <unknown>
41.65 s
gammaloop-nextest-core> at <unknown source file> :<unknown line>
41.65 s
gammaloop-nextest-core> 5: std[bcb96dfbba0ab899]::sys::backtrace::__rust_end_short_backtrace::<std[bcb96dfbba0ab899]::panicking::panic_handler::{closure#0}, !> <unknown>
41.65 s
gammaloop-nextest-core> at <unknown source file> :<unknown line>
41.65 s
gammaloop-nextest-core> 6: __rustc[6c289b9f9c454d21]::rust_begin_unwind <unknown>
41.65 s
gammaloop-nextest-core> at <unknown source file> :<unknown line>
41.65 s
gammaloop-nextest-core> 7: core[940e698046960fd5]::panicking::panic_fmt <unknown>
41.65 s
gammaloop-nextest-core> at <unknown source file> :<unknown line>
41.65 s
gammaloop-nextest-core> 8: core[940e698046960fd5]::panicking::panic <unknown>
41.65 s
gammaloop-nextest-core> at <unknown source file> :<unknown line>
41.65 s
gammaloop-nextest-core> 9: <test_renormalization[5812939ef1a04d89]::finite_part_ghost_2loop::{closure#0} as core[940e698046960fd5]::ops::function::FnOnce<()>>::call_once <unknown>
41.65 s
gammaloop-nextest-core> at <unknown source file> :<unknown line>
41.65 s
gammaloop-nextest-core> 10: test[75d6903177b1d7e9]::__rust_begin_short_backtrace::<core[940e698046960fd5]::result::Result<(), alloc[2ea6bcb46fca0c42]::string::String>, fn() -> core[940e698046960fd5]::result::Result<(), alloc[2ea6bcb46fca0c42]::string::String>> <unknown>
41.65 s
gammaloop-nextest-core> at <unknown source file> :<unknown line>
41.65 s
gammaloop-nextest-core> 11: test[75d6903177b1d7e9]::run_test::{closure#0} <unknown>
41.65 s
gammaloop-nextest-core> at <unknown source file> :<unknown line>
41.65 s
gammaloop-nextest-core> 12: std[bcb96dfbba0ab899]::sys::backtrace::__rust_begin_short_backtrace::<test[75d6903177b1d7e9]::run_test::{closure#1}, ()> <unknown>
41.65 s
gammaloop-nextest-core> at <unknown source file> :<unknown line>
41.65 s
gammaloop-nextest-core> 13: <std[bcb96dfbba0ab899]::thread::lifecycle::spawn_unchecked<test[75d6903177b1d7e9]::run_test::{closure#1}, ()>::{closure#1} as core[940e698046960fd5]::ops::function::FnOnce<()>>::call_once::{shim:vtable#0} <unknown>
41.65 s
gammaloop-nextest-core> at <unknown source file> :<unknown line>
41.65 s
gammaloop-nextest-core> 14: <std[bcb96dfbba0ab899]::sys::thread::unix::Thread>::new::thread_start <unknown>
41.65 s
gammaloop-nextest-core> at <unknown source file> :<unknown line>
41.65 s
gammaloop-nextest-core> 15: start_thread <unknown>
41.65 s
gammaloop-nextest-core> at <unknown source file> :<unknown line>
41.65 s
gammaloop-nextest-core> 16: __clone3 <unknown>
41.65 s
gammaloop-nextest-core> at <unknown source file> :<unknown line>
41.65 s
gammaloop-nextest-core>
41.65 s
gammaloop-nextest-core> Run with COLORBT_SHOW_HIDDEN=1 environment variable to disable frame filtering.
41.65 s
gammaloop-nextest-core> Run with RUST_BACKTRACE=full to include source snippets.
41.65 s
gammaloop-nextest-core>
48.60 s
gammaloop-nextest-core> ------------
48.60 s
gammaloop-nextest-core> Summary [ 18.072s] 706 tests run: 705 passed , 1 failed , 60 skipped
48.60 s
gammaloop-nextest-core> FAIL [ 5.281s] (701/706) gammalooprs::test_renormalization finite_part_ghost_2loop
48.60 s
gammaloop-nextest-core> stdout ---
48.60 s
gammaloop-nextest-core>
48.60 s
gammaloop-nextest-core> running 1 test
48.60 s
gammaloop-nextest-core> test finite_part_ghost_2loop ... FAILED
48.60 s
gammaloop-nextest-core>
48.60 s
gammaloop-nextest-core> failures:
48.60 s
gammaloop-nextest-core>
48.60 s
gammaloop-nextest-core> failures:
48.60 s
gammaloop-nextest-core> finite_part_ghost_2loop
48.60 s
gammaloop-nextest-core>
48.60 s
gammaloop-nextest-core> test result: FAILED. 0 passed; 1 failed; 0 ignored; 0 measured; 6 filtered out; finished in 5.27s
48.60 s
gammaloop-nextest-core>
48.60 s
gammaloop-nextest-core> stderr ---
48.60 s
gammaloop-nextest-core> The application panicked (crashed).
48.60 s
gammaloop-nextest-core> Message: assertion failed: (align_to_rqft(&a, &model) - expected).expand().is_zero()
48.60 s
gammaloop-nextest-core> Location: crates/gammalooprs/tests/test_renormalization.rs :583
48.60 s
gammaloop-nextest-core>
48.60 s
gammaloop-nextest-core> ━━━━━━━━━━━━━━━━━━━━━━━━━━━━━━━━━━ BACKTRACE ━━━━━━━━━━━━━━━━━━━━━━━━━━━━━━━━━━━
48.60 s
gammaloop-nextest-core> 1: <color_eyre[51793ea62743adbd]::config::PanicHook>::panic_report <unknown>
48.60 s
gammaloop-nextest-core> at <unknown source file> :<unknown line>
48.60 s
gammaloop-nextest-core> 2: <color_eyre[51793ea62743adbd]::config::PanicHook>::into_panic_hook::{closure#0} <unknown>
48.60 s
gammaloop-nextest-core> at <unknown source file> :<unknown line>
48.60 s
gammaloop-nextest-core> 3: std[bcb96dfbba0ab899]::panicking::panic_with_hook <unknown>
48.60 s
gammaloop-nextest-core> at <unknown source file> :<unknown line>
48.60 s
gammaloop-nextest-core> 4: std[bcb96dfbba0ab899]::panicking::panic_handler::{closure#0} <unknown>
48.60 s
gammaloop-nextest-core> at <unknown source file> :<unknown line>
48.60 s
gammaloop-nextest-core> 5: std[bcb96dfbba0ab899]::sys::backtrace::__rust_end_short_backtrace::<std[bcb96dfbba0ab899]::panicking::panic_handler::{closure#0}, !> <unknown>
48.60 s
gammaloop-nextest-core> at <unknown source file> :<unknown line>
48.60 s
gammaloop-nextest-core> 6: __rustc[6c289b9f9c454d21]::rust_begin_unwind <unknown>
48.60 s
gammaloop-nextest-core> at <unknown source file> :<unknown line>
48.60 s
gammaloop-nextest-core> 7: core[940e698046960fd5]::panicking::panic_fmt <unknown>
48.60 s
gammaloop-nextest-core> at <unknown source file> :<unknown line>
48.60 s
gammaloop-nextest-core> 8: core[940e698046960fd5]::panicking::panic <unknown>
48.60 s
gammaloop-nextest-core> at <unknown source file> :<unknown line>
48.60 s
gammaloop-nextest-core> 9: <test_renormalization[5812939ef1a04d89]::finite_part_ghost_2loop::{closure#0} as core[940e698046960fd5]::ops::function::FnOnce<()>>::call_once <unknown>
48.60 s
gammaloop-nextest-core> at <unknown source file> :<unknown line>
48.60 s
gammaloop-nextest-core> 10: test[75d6903177b1d7e9]::__rust_begin_short_backtrace::<core[940e698046960fd5]::result::Result<(), alloc[2ea6bcb46fca0c42]::string::String>, fn() -> core[940e698046960fd5]::result::Result<(), alloc[2ea6bcb46fca0c42]::string::String>> <unknown>
48.60 s
gammaloop-nextest-core> at <unknown source file> :<unknown line>
48.60 s
gammaloop-nextest-core> 11: test[75d6903177b1d7e9]::run_test::{closure#0} <unknown>
48.60 s
gammaloop-nextest-core> at <unknown source file> :<unknown line>
48.60 s
gammaloop-nextest-core> 12: std[bcb96dfbba0ab899]::sys::backtrace::__rust_begin_short_backtrace::<test[75d6903177b1d7e9]::run_test::{closure#1}, ()> <unknown>
48.60 s
gammaloop-nextest-core> at <unknown source file> :<unknown line>
48.60 s
gammaloop-nextest-core> 13: <std[bcb96dfbba0ab899]::thread::lifecycle::spawn_unchecked<test[75d6903177b1d7e9]::run_test::{closure#1}, ()>::{closure#1} as core[940e698046960fd5]::ops::function::FnOnce<()>>::call_once::{shim:vtable#0} <unknown>
48.60 s
gammaloop-nextest-core> at <unknown source file> :<unknown line>
48.60 s
gammaloop-nextest-core> 14: <std[bcb96dfbba0ab899]::sys::thread::unix::Thread>::new::thread_start <unknown>
48.60 s
gammaloop-nextest-core> at <unknown source file> :<unknown line>
48.60 s
gammaloop-nextest-core> 15: start_thread <unknown>
48.60 s
gammaloop-nextest-core> at <unknown source file> :<unknown line>
48.60 s
gammaloop-nextest-core> 16: __clone3 <unknown>
48.60 s
gammaloop-nextest-core> at <unknown source file> :<unknown line>
48.60 s
gammaloop-nextest-core>
48.60 s
gammaloop-nextest-core> Run with COLORBT_SHOW_HIDDEN=1 environment variable to disable frame filtering.
48.60 s
gammaloop-nextest-core> Run with RUST_BACKTRACE=full to include source snippets.
48.60 s
gammaloop-nextest-core>
48.69 s
gammaloop-nextest-core> error : test run failed
48.74 s
gammaloop-nextest-core>
48.74 s
gammaloop-nextest-core> ========== nextest test summary ==========
48.74 s
gammaloop-nextest-core> report: target/nextest/ci_gammaloop/junit.xml
48.74 s
gammaloop-nextest-core> tests: 706, failures: 1, errors: 0
48.74 s
gammaloop-nextest-core>
48.74 s
gammaloop-nextest-core> 1. gammalooprs::test_renormalization::finite_part_ghost_2loop
48.74 s
gammaloop-nextest-core> failure: test failure with exit code 101
48.74 s
gammaloop-nextest-core> system-out
48.74 s
gammaloop-nextest-core> running 1 test
48.74 s
gammaloop-nextest-core> test finite_part_ghost_2loop ... FAILED
48.74 s
gammaloop-nextest-core>
48.74 s
gammaloop-nextest-core> failures:
48.74 s
gammaloop-nextest-core>
48.74 s
gammaloop-nextest-core> failures:
48.74 s
gammaloop-nextest-core> finite_part_ghost_2loop
48.74 s
gammaloop-nextest-core>
48.74 s
gammaloop-nextest-core> test result: FAILED. 0 passed; 1 failed; 0 ignored; 0 measured; 6 filtered out; finished in 5.27s
48.74 s
gammaloop-nextest-core> system-err
48.74 s
gammaloop-nextest-core> The application panicked (crashed).
48.74 s
gammaloop-nextest-core> Message: assertion failed: (align_to_rqft(&a, &model) - expected).expand().is_zero()
48.74 s
gammaloop-nextest-core> Location: crates/gammalooprs/tests/test_renormalization.rs:583
48.74 s
gammaloop-nextest-core>
48.74 s
gammaloop-nextest-core> ━━━━━━━━━━━━━━━━━━━━━━━━━━━━━━━━━━ BACKTRACE ━━━━━━━━━━━━━━━━━━━━━━━━━━━━━━━━━━━
48.74 s
gammaloop-nextest-core> 1: <color_eyre[51793ea62743adbd]::config::PanicHook>::panic_report<unknown>
48.74 s
gammaloop-nextest-core> at <unknown source file>:<unknown line>
48.74 s
gammaloop-nextest-core> 2: <color_eyre[51793ea62743adbd]::config::PanicHook>::into_panic_hook::{closure#0}<unknown>
48.74 s
gammaloop-nextest-core> at <unknown source file>:<unknown line>
48.74 s
gammaloop-nextest-core> 3: std[bcb96dfbba0ab899]::panicking::panic_with_hook<unknown>
48.74 s
gammaloop-nextest-core> at <unknown source file>:<unknown line>
48.74 s
gammaloop-nextest-core> 4: std[bcb96dfbba0ab899]::panicking::panic_handler::{closure#0}<unknown>
48.74 s
gammaloop-nextest-core> at <unknown source file>:<unknown line>
48.74 s
gammaloop-nextest-core> 5: std[bcb96dfbba0ab899]::sys::backtrace::__rust_end_short_backtrace::<std[bcb96dfbba0ab899]::panicking::panic_handler::{closure#0}, !><unknown>
48.74 s
gammaloop-nextest-core> at <unknown source file>:<unknown line>
48.74 s
gammaloop-nextest-core> 6: __rustc[6c289b9f9c454d21]::rust_begin_unwind<unknown>
48.74 s
gammaloop-nextest-core> at <unknown source file>:<unknown line>
48.74 s
gammaloop-nextest-core> 7: core[940e698046960fd5]::panicking::panic_fmt<unknown>
48.74 s
gammaloop-nextest-core> at <unknown source file>:<unknown line>
48.74 s
gammaloop-nextest-core> 8: core[940e698046960fd5]::panicking::panic<unknown>
48.74 s
gammaloop-nextest-core> at <unknown source file>:<unknown line>
48.74 s
gammaloop-nextest-core> 9: <test_renormalization[5812939ef1a04d89]::finite_part_ghost_2loop::{closure#0} as core[940e698046960fd5]::ops::function::FnOnce<()>>::call_once<unknown>
48.74 s
gammaloop-nextest-core> at <unknown source file>:<unknown line>
48.74 s
gammaloop-nextest-core> 10: test[75d6903177b1d7e9]::__rust_begin_short_backtrace::<core[940e698046960fd5]::result::Result<(), alloc[2ea6bcb46fca0c42]::string::String>, fn() -> core[940e698046960fd5]::result::Result<(), alloc[2ea6bcb46fca0c42]::string::String>><unknown>
48.74 s
gammaloop-nextest-core> at <unknown source file>:<unknown line>
48.74 s
gammaloop-nextest-core> 11: test[75d6903177b1d7e9]::run_test::{closure#0}<unknown>
48.74 s
gammaloop-nextest-core> at <unknown source file>:<unknown line>
48.74 s
gammaloop-nextest-core> 12: std[bcb96dfbba0ab899]::sys::backtrace::__rust_begin_short_backtrace::<test[75d6903177b1d7e9]::run_test::{closure#1}, ()><unknown>
48.74 s
gammaloop-nextest-core> at <unknown source file>:<unknown line>
48.74 s
gammaloop-nextest-core> 13: <std[bcb96dfbba0ab899]::thread::lifecycle::spawn_unchecked<test[75d6903177b1d7e9]::run_test::{closure#1}, ()>::{closure#1} as core[940e698046960fd5]::ops::function::FnOnce<()>>::call_once::{shim:vtable#0}<unknown>
48.74 s
gammaloop-nextest-core> at <unknown source file>:<unknown line>
48.74 s
gammaloop-nextest-core> 14: <std[bcb96dfbba0ab899]::sys::thread::unix::Thread>::new::thread_start<unknown>
48.74 s
gammaloop-nextest-core> at <unknown source file>:<unknown line>
48.74 s
gammaloop-nextest-core> 15: start_thread<unknown>
48.74 s
gammaloop-nextest-core> at <unknown source file>:<unknown line>
48.74 s
gammaloop-nextest-core> 16: __clone3<unknown>
48.74 s
gammaloop-nextest-core> at <unknown source file>:<unknown line>
48.74 s
gammaloop-nextest-core>
48.74 s
gammaloop-nextest-core> Run with COLORBT_SHOW_HIDDEN=1 environment variable to disable frame filtering.
48.74 s
gammaloop-nextest-core> Run with RUST_BACKTRACE=full to include source snippets.
48.74 s
gammaloop-nextest-core> =========================================
48.77 s
gammaloop-nextest-core> Extracting 1 binary, 1 build script output directory, and 1 linked path to /build/nextest-archive-XlVLz4
48.89 s
gammaloop-nextest-core> Extracted 7 files to /build/nextest-archive-XlVLz4 in 0.13s
48.91 s
gammaloop-nextest-core> ------------
48.91 s
gammaloop-nextest-core> Nextest run ID b1717bd2-9ca7-4c6c-b7b5-5287dd45cfd0 with nextest profile: ci_gammaloop
48.91 s
gammaloop-nextest-core> Starting 105 tests across 1 binary
72.93 s
gammaloop-nextest-core> ------------
72.93 s
gammaloop-nextest-core> Summary [ 24.022s] 105 tests run: 105 passed , 0 skipped
72.99 s
gammaloop-nextest-core>
72.99 s
gammaloop-nextest-core> ========== nextest test summary ==========
72.99 s
gammaloop-nextest-core> report: target/nextest/ci_gammaloop/junit.xml
72.99 s
gammaloop-nextest-core> tests: 105, failures: 0, errors: 0
72.99 s
gammaloop-nextest-core> No failing testcases found.
72.99 s
gammaloop-nextest-core> =========================================
73.06 s
error: Cannot build '/nix/store/gfw8irsajvc73r64ijh06rb30gc2744x-gammaloop-nextest-core.drv '.
73.06 s
Reason: builder failed with exit code 100 .
73.06 s
Output paths:
73.06 s
/nix/store/p3ayrsjin2c2zsszczl860szaj7271z8-gammaloop-nextest-core
73.06 s
Last 229 log lines:
73.06 s
> Extracting 4 binaries (including 1 non-test binary), 1 build script output directory, and 2 linked paths to /build/nextest-archive-jBxkFj
73.06 s
> Extracted 20 files to /build/nextest-archive-jBxkFj in 1.11s
73.06 s
> ------------
73.06 s
> Nextest run ID 3925007b-2532-4919-9628-9ed79b3c38b0 with nextest profile: ci_gammaloop
73.06 s
> Starting 379 tests across 3 binaries
73.06 s
> ------------
73.06 s
> Summary [ 2.097s] 379 tests run: 379 passed , 0 skipped
73.06 s
>
73.06 s
> ========== nextest test summary ==========
73.06 s
> report: target/nextest/ci_gammaloop/junit.xml
73.06 s
> tests: 379, failures: 0, errors: 0
73.06 s
> No failing testcases found.
73.06 s
> =========================================
73.06 s
> Extracting 1 binary and 1 linked path to /build/nextest-archive-lcE2S4
73.06 s
> Extracted 7 files to /build/nextest-archive-lcE2S4 in 0.12s
73.06 s
> ------------
73.06 s
> Nextest run ID 62eab051-744d-4f1a-86d9-32e787057672 with nextest profile: ci_gammaloop
73.06 s
> Starting 19 tests across 1 binary
73.06 s
> ------------
73.06 s
> Summary [ 0.026s] 19 tests run: 19 passed , 0 skipped
73.06 s
>
73.06 s
> ========== nextest test summary ==========
73.06 s
> report: target/nextest/ci_gammaloop/junit.xml
73.06 s
> tests: 19, failures: 0, errors: 0
73.06 s
> No failing testcases found.
73.06 s
> =========================================
73.06 s
> Extracting 1 binary to /build/nextest-archive-F7K6dw
73.06 s
> Extracted 4 files to /build/nextest-archive-F7K6dw in 0.07s
73.06 s
> ------------
73.06 s
> Nextest run ID 307e317d-ddb6-439f-b37d-de34ad769f08 with nextest profile: ci_gammaloop
73.06 s
> Starting 0 tests across 1 binary
73.06 s
> ------------
73.06 s
> Summary [ 0.000s] 0 tests run: 0 passed , 0 skipped
73.06 s
>
73.06 s
> ========== nextest test summary ==========
73.06 s
> report: target/nextest/ci_gammaloop/junit.xml
73.06 s
> tests: 0, failures: 0, errors: 0
73.06 s
> No failing testcases found.
73.06 s
> =========================================
73.06 s
> Extracting 4 binaries, 1 build script output directory, and 2 linked paths to /build/nextest-archive-3JPOjo
73.06 s
> Extracted 18 files to /build/nextest-archive-3JPOjo in 0.72s
73.06 s
> ------------
73.06 s
> Nextest run ID 42b498fb-00bc-44a5-9dca-526944105c79 with nextest profile: ci_gammaloop
73.06 s
> Starting 706 tests across 4 binaries (60 tests skipped , including 59 tests via profile.ci_gammaloop.default-filter )
73.06 s
> FAIL [ 5.281s] (701/706) gammalooprs::test_renormalization finite_part_ghost_2loop
73.06 s
> stdout ---
73.06 s
>
73.06 s
> running 1 test
73.06 s
> test finite_part_ghost_2loop ... FAILED
73.06 s
>
73.06 s
> failures:
73.06 s
>
73.06 s
> failures:
73.06 s
> finite_part_ghost_2loop
73.06 s
>
73.06 s
> test result: FAILED. 0 passed; 1 failed; 0 ignored; 0 measured; 6 filtered out; finished in 5.27s
73.06 s
>
73.06 s
> stderr ---
73.06 s
> The application panicked (crashed).
73.06 s
> Message: assertion failed: (align_to_rqft(&a, &model) - expected).expand().is_zero()
73.06 s
> Location: crates/gammalooprs/tests/test_renormalization.rs :583
73.06 s
>
73.06 s
> ━━━━━━━━━━━━━━━━━━━━━━━━━━━━━━━━━━ BACKTRACE ━━━━━━━━━━━━━━━━━━━━━━━━━━━━━━━━━━━
73.06 s
> 1: <color_eyre[51793ea62743adbd]::config::PanicHook>::panic_report <unknown>
73.06 s
> at <unknown source file> :<unknown line>
73.06 s
> 2: <color_eyre[51793ea62743adbd]::config::PanicHook>::into_panic_hook::{closure#0} <unknown>
73.06 s
> at <unknown source file> :<unknown line>
73.06 s
> 3: std[bcb96dfbba0ab899]::panicking::panic_with_hook <unknown>
73.06 s
> at <unknown source file> :<unknown line>
73.06 s
> 4: std[bcb96dfbba0ab899]::panicking::panic_handler::{closure#0} <unknown>
73.06 s
> at <unknown source file> :<unknown line>
73.06 s
> 5: std[bcb96dfbba0ab899]::sys::backtrace::__rust_end_short_backtrace::<std[bcb96dfbba0ab899]::panicking::panic_handler::{closure#0}, !> <unknown>
73.06 s
> at <unknown source file> :<unknown line>
73.06 s
> 6: __rustc[6c289b9f9c454d21]::rust_begin_unwind <unknown>
73.06 s
> at <unknown source file> :<unknown line>
73.06 s
> 7: core[940e698046960fd5]::panicking::panic_fmt <unknown>
73.06 s
> at <unknown source file> :<unknown line>
73.06 s
> 8: core[940e698046960fd5]::panicking::panic <unknown>
73.06 s
> at <unknown source file> :<unknown line>
73.06 s
> 9: <test_renormalization[5812939ef1a04d89]::finite_part_ghost_2loop::{closure#0} as core[940e698046960fd5]::ops::function::FnOnce<()>>::call_once <unknown>
73.06 s
> at <unknown source file> :<unknown line>
73.06 s
> 10: test[75d6903177b1d7e9]::__rust_begin_short_backtrace::<core[940e698046960fd5]::result::Result<(), alloc[2ea6bcb46fca0c42]::string::String>, fn() -> core[940e698046960fd5]::result::Result<(), alloc[2ea6bcb46fca0c42]::string::String>> <unknown>
73.06 s
> at <unknown source file> :<unknown line>
73.06 s
> 11: test[75d6903177b1d7e9]::run_test::{closure#0} <unknown>
73.06 s
> at <unknown source file> :<unknown line>
73.06 s
> 12: std[bcb96dfbba0ab899]::sys::backtrace::__rust_begin_short_backtrace::<test[75d6903177b1d7e9]::run_test::{closure#1}, ()> <unknown>
73.06 s
> at <unknown source file> :<unknown line>
73.06 s
> 13: <std[bcb96dfbba0ab899]::thread::lifecycle::spawn_unchecked<test[75d6903177b1d7e9]::run_test::{closure#1}, ()>::{closure#1} as core[940e698046960fd5]::ops::function::FnOnce<()>>::call_once::{shim:vtable#0} <unknown>
73.06 s
> at <unknown source file> :<unknown line>
73.06 s
> 14: <std[bcb96dfbba0ab899]::sys::thread::unix::Thread>::new::thread_start <unknown>
73.06 s
> at <unknown source file> :<unknown line>
73.06 s
> 15: start_thread <unknown>
73.06 s
> at <unknown source file> :<unknown line>
73.06 s
> 16: __clone3 <unknown>
73.06 s
> at <unknown source file> :<unknown line>
73.06 s
>
73.06 s
> Run with COLORBT_SHOW_HIDDEN=1 environment variable to disable frame filtering.
73.06 s
> Run with RUST_BACKTRACE=full to include source snippets.
73.06 s
>
73.06 s
> ------------
73.06 s
> Summary [ 18.072s] 706 tests run: 705 passed , 1 failed , 60 skipped
73.06 s
> FAIL [ 5.281s] (701/706) gammalooprs::test_renormalization finite_part_ghost_2loop
73.06 s
> stdout ---
73.06 s
>
73.06 s
> running 1 test
73.06 s
> test finite_part_ghost_2loop ... FAILED
73.06 s
>
73.06 s
> failures:
73.06 s
>
73.06 s
> failures:
73.06 s
> finite_part_ghost_2loop
73.06 s
>
73.06 s
> test result: FAILED. 0 passed; 1 failed; 0 ignored; 0 measured; 6 filtered out; finished in 5.27s
73.06 s
>
73.06 s
> stderr ---
73.06 s
> The application panicked (crashed).
73.06 s
> Message: assertion failed: (align_to_rqft(&a, &model) - expected).expand().is_zero()
73.06 s
> Location: crates/gammalooprs/tests/test_renormalization.rs :583
73.06 s
>
73.06 s
> ━━━━━━━━━━━━━━━━━━━━━━━━━━━━━━━━━━ BACKTRACE ━━━━━━━━━━━━━━━━━━━━━━━━━━━━━━━━━━━
73.06 s
> 1: <color_eyre[51793ea62743adbd]::config::PanicHook>::panic_report <unknown>
73.06 s
> at <unknown source file> :<unknown line>
73.06 s
> 2: <color_eyre[51793ea62743adbd]::config::PanicHook>::into_panic_hook::{closure#0} <unknown>
73.06 s
> at <unknown source file> :<unknown line>
73.06 s
> 3: std[bcb96dfbba0ab899]::panicking::panic_with_hook <unknown>
73.06 s
> at <unknown source file> :<unknown line>
73.06 s
> 4: std[bcb96dfbba0ab899]::panicking::panic_handler::{closure#0} <unknown>
73.06 s
> at <unknown source file> :<unknown line>
73.06 s
> 5: std[bcb96dfbba0ab899]::sys::backtrace::__rust_end_short_backtrace::<std[bcb96dfbba0ab899]::panicking::panic_handler::{closure#0}, !> <unknown>
73.06 s
> at <unknown source file> :<unknown line>
73.06 s
> 6: __rustc[6c289b9f9c454d21]::rust_begin_unwind <unknown>
73.06 s
> at <unknown source file> :<unknown line>
73.06 s
> 7: core[940e698046960fd5]::panicking::panic_fmt <unknown>
73.06 s
> at <unknown source file> :<unknown line>
73.06 s
> 8: core[940e698046960fd5]::panicking::panic <unknown>
73.06 s
> at <unknown source file> :<unknown line>
73.06 s
> 9: <test_renormalization[5812939ef1a04d89]::finite_part_ghost_2loop::{closure#0} as core[940e698046960fd5]::ops::function::FnOnce<()>>::call_once <unknown>
73.06 s
> at <unknown source file> :<unknown line>
73.06 s
> 10: test[75d6903177b1d7e9]::__rust_begin_short_backtrace::<core[940e698046960fd5]::result::Result<(), alloc[2ea6bcb46fca0c42]::string::String>, fn() -> core[940e698046960fd5]::result::Result<(), alloc[2ea6bcb46fca0c42]::string::String>> <unknown>
73.06 s
> at <unknown source file> :<unknown line>
73.06 s
> 11: test[75d6903177b1d7e9]::run_test::{closure#0} <unknown>
73.06 s
> at <unknown source file> :<unknown line>
73.06 s
> 12: std[bcb96dfbba0ab899]::sys::backtrace::__rust_begin_short_backtrace::<test[75d6903177b1d7e9]::run_test::{closure#1}, ()> <unknown>
73.06 s
> at <unknown source file> :<unknown line>
73.06 s
> 13: <std[bcb96dfbba0ab899]::thread::lifecycle::spawn_unchecked<test[75d6903177b1d7e9]::run_test::{closure#1}, ()>::{closure#1} as core[940e698046960fd5]::ops::function::FnOnce<()>>::call_once::{shim:vtable#0} <unknown>
73.06 s
> at <unknown source file> :<unknown line>
73.06 s
> 14: <std[bcb96dfbba0ab899]::sys::thread::unix::Thread>::new::thread_start <unknown>
73.06 s
> at <unknown source file> :<unknown line>
73.06 s
> 15: start_thread <unknown>
73.06 s
> at <unknown source file> :<unknown line>
73.06 s
> 16: __clone3 <unknown>
73.06 s
> at <unknown source file> :<unknown line>
73.06 s
>
73.06 s
> Run with COLORBT_SHOW_HIDDEN=1 environment variable to disable frame filtering.
73.06 s
> Run with RUST_BACKTRACE=full to include source snippets.
73.06 s
>
73.06 s
> error : test run failed
73.06 s
>
73.06 s
> ========== nextest test summary ==========
73.06 s
> report: target/nextest/ci_gammaloop/junit.xml
73.06 s
> tests: 706, failures: 1, errors: 0
73.06 s
>
73.06 s
> 1. gammalooprs::test_renormalization::finite_part_ghost_2loop
73.06 s
> failure: test failure with exit code 101
73.06 s
> system-out
73.06 s
> running 1 test
73.06 s
> test finite_part_ghost_2loop ... FAILED
73.06 s
>
73.06 s
> failures:
73.06 s
>
73.06 s
> failures:
73.06 s
> finite_part_ghost_2loop
73.06 s
>
73.06 s
> test result: FAILED. 0 passed; 1 failed; 0 ignored; 0 measured; 6 filtered out; finished in 5.27s
73.06 s
> system-err
73.06 s
> The application panicked (crashed).
73.06 s
> Message: assertion failed: (align_to_rqft(&a, &model) - expected).expand().is_zero()
73.06 s
> Location: crates/gammalooprs/tests/test_renormalization.rs:583
73.06 s
>
73.06 s
> ━━━━━━━━━━━━━━━━━━━━━━━━━━━━━━━━━━ BACKTRACE ━━━━━━━━━━━━━━━━━━━━━━━━━━━━━━━━━━━
73.06 s
> 1: <color_eyre[51793ea62743adbd]::config::PanicHook>::panic_report<unknown>
73.06 s
> at <unknown source file>:<unknown line>
73.06 s
> 2: <color_eyre[51793ea62743adbd]::config::PanicHook>::into_panic_hook::{closure#0}<unknown>
73.06 s
> at <unknown source file>:<unknown line>
73.06 s
> 3: std[bcb96dfbba0ab899]::panicking::panic_with_hook<unknown>
73.06 s
> at <unknown source file>:<unknown line>
73.06 s
> 4: std[bcb96dfbba0ab899]::panicking::panic_handler::{closure#0}<unknown>
73.06 s
> at <unknown source file>:<unknown line>
73.06 s
> 5: std[bcb96dfbba0ab899]::sys::backtrace::__rust_end_short_backtrace::<std[bcb96dfbba0ab899]::panicking::panic_handler::{closure#0}, !><unknown>
73.06 s
> at <unknown source file>:<unknown line>
73.06 s
> 6: __rustc[6c289b9f9c454d21]::rust_begin_unwind<unknown>
73.06 s
> at <unknown source file>:<unknown line>
73.06 s
> 7: core[940e698046960fd5]::panicking::panic_fmt<unknown>
73.06 s
> at <unknown source file>:<unknown line>
73.06 s
> 8: core[940e698046960fd5]::panicking::panic<unknown>
73.06 s
> at <unknown source file>:<unknown line>
73.06 s
> 9: <test_renormalization[5812939ef1a04d89]::finite_part_ghost_2loop::{closure#0} as core[940e698046960fd5]::ops::function::FnOnce<()>>::call_once<unknown>
73.06 s
> at <unknown source file>:<unknown line>
73.06 s
> 10: test[75d6903177b1d7e9]::__rust_begin_short_backtrace::<core[940e698046960fd5]::result::Result<(), alloc[2ea6bcb46fca0c42]::string::String>, fn() -> core[940e698046960fd5]::result::Result<(), alloc[2ea6bcb46fca0c42]::string::String>><unknown>
73.06 s
> at <unknown source file>:<unknown line>
73.06 s
> 11: test[75d6903177b1d7e9]::run_test::{closure#0}<unknown>
73.06 s
> at <unknown source file>:<unknown line>
73.06 s
> 12: std[bcb96dfbba0ab899]::sys::backtrace::__rust_begin_short_backtrace::<test[75d6903177b1d7e9]::run_test::{closure#1}, ()><unknown>
73.06 s
> at <unknown source file>:<unknown line>
73.06 s
> 13: <std[bcb96dfbba0ab899]::thread::lifecycle::spawn_unchecked<test[75d6903177b1d7e9]::run_test::{closure#1}, ()>::{closure#1} as core[940e698046960fd5]::ops::function::FnOnce<()>>::call_once::{shim:vtable#0}<unknown>
73.06 s
> at <unknown source file>:<unknown line>
73.06 s
> 14: <std[bcb96dfbba0ab899]::sys::thread::unix::Thread>::new::thread_start<unknown>
73.06 s
> at <unknown source file>:<unknown line>
73.06 s
> 15: start_thread<unknown>
73.06 s
> at <unknown source file>:<unknown line>
73.06 s
> 16: __clone3<unknown>
73.06 s
> at <unknown source file>:<unknown line>
73.06 s
>
73.06 s
> Run with COLORBT_SHOW_HIDDEN=1 environment variable to disable frame filtering.
73.06 s
> Run with RUST_BACKTRACE=full to include source snippets.
73.06 s
> =========================================
73.06 s
> Extracting 1 binary, 1 build script output directory, and 1 linked path to /build/nextest-archive-XlVLz4
73.06 s
> Extracted 7 files to /build/nextest-archive-XlVLz4 in 0.13s
73.06 s
> ------------
73.06 s
> Nextest run ID b1717bd2-9ca7-4c6c-b7b5-5287dd45cfd0 with nextest profile: ci_gammaloop
73.06 s
> Starting 105 tests across 1 binary
73.06 s
> ------------
73.06 s
> Summary [ 24.022s] 105 tests run: 105 passed , 0 skipped
73.06 s
>
73.06 s
> ========== nextest test summary ==========
73.06 s
> report: target/nextest/ci_gammaloop/junit.xml
73.06 s
> tests: 105, failures: 0, errors: 0
73.06 s
> No failing testcases found.
73.06 s
> =========================================
73.06 s
For full logs, run:
73.06 s
nix log /nix/store/gfw8irsajvc73r64ijh06rb30gc2744x-gammaloop-nextest-core.drv
73.27 s
[0 built (1 failed ), 0.0 Run failed.