test packages.x86_64-linux.nix-ci-check-gammaloop-nextest-core
0.00 s
$ /nix/store/61685rbaxmpigwi3z23i33sv3jyfl70q-coreutils-9.11/bin/timeout --kill-after=15s 7200s /nix/store/wknkybkzrc16r11vk5vrykh4wmw7a353-nix-2.34.8/bin/nix --extra-experimental-features nix-command --extra-experimental-features flakes flake clone git+https://github.com/alphal00p/gammaloop --dest /tmp/nix-ci-worker/stable-pwd/repo/
0.07 s
Cloning into '/tmp/nix-ci-worker/stable-pwd/repo'...
1.82 s
remote: Enumerating objects: 93286
remote: Enumerating objects: 103390, done.
2.06 s
remote: Counting objects: 0% (1/10104)
remote: Counting objects: 1% (102/10104)
remote: Counting objects: 2% (203/10104)
remote: Counting objects: 3% (304/10104)
remote: Counting objects: 4% (405/10104)
remote: Counting objects: 5% (506/10104)
remote: Counting objects: 6% (607/10104)
remote: Counting objects: 7% (708/10104)
remote: Counting objects: 8% (809/10104)
remote: Counting objects: 9% (910/10104)
remote: Counting objects: 10% (1011/10104)
remote: Counting objects: 11% (1112/10104)
remote: Counting objects: 12% (1213/10104)
remote: Counting objects: 13% (1314/10104)
remote: Counting objects: 14% (1415/10104)
remote: Counting objects: 15% (1516/10104)
remote: Counting objects: 16% (1617/10104)
remote: Counting objects: 17% (1718/10104)
remote: Counting objects: 18% (1819/10104)
remote: Counting objects: 19% (1920/10104)
remote: Counting objects: 20% (2021/10104)
remote: Counting objects: 21% (2122/10104)
remote: Counting objects: 22% (2223/10104)
remote: Counting objects: 23% (2324/10104)
remote: Counting objects: 24% (2425/10104)
remote: Counting objects: 25% (2526/10104)
remote: Counting objects: 26% (2628/10104)
remote: Counting objects: 27% (2729/10104)
remote: Counting objects: 28% (2830/10104)
remote: Counting objects: 29% (2931/10104)
remote: Counting objects: 30% (3032/10104)
remote: Counting objects: 31% (3133/10104)
remote: Counting objects: 32% (3234/10104)
remote: Counting objects: 33% (3335/10104)
remote: Counting objects: 34% (3436/10104)
remote: Counting objects: 35% (3537/10104)
remote: Counting objects: 36% (3638/10104)
remote: Counting objects: 37% (3739/10104)
remote: Counting objects: 38% (3840/10104)
remote: Counting objects: 39% (3941/10104)
remote: Counting objects: 40% (4042/10104)
remote: Counting objects: 41% (4143/10104)
remote: Counting objects: 42% (4244/10104)
remote: Counting objects: 43% (4345/10104)
remote: Counting objects: 44% (4446/10104)
remote: Counting objects: 45% (4547/10104)
remote: Counting objects: 46% (4648/10104)
remote: Counting objects: 47% (4749/10104)
remote: Counting objects: 48% (4850/10104)
remote: Counting objects: 49% (4951/10104)
remote: Counting objects: 50% (5052/10104)
remote: Counting objects: 51% (5154/10104)
remote: Counting objects: 52% (5255/10104)
remote: Counting objects: 53% (5356/10104)
remote: Counting objects: 54% (5457/10104)
remote: Counting objects: 55% (5558/10104)
remote: Counting objects: 56% (5659/10104)
remote: Counting objects: 57% (5760/10104)
remote: Counting objects: 58% (5861/10104)
remote: Counting objects: 59% (5962/10104)
remote: Counting objects: 60% (6063/10104)
remote: Counting objects: 61% (6164/10104)
remote: Counting objects: 62% (6265/10104)
remote: Counting objects: 63% (6366/10104)
remote: Counting objects: 64% (6467/10104)
remote: Counting objects: 65% (6568/10104)
remote: Counting objects: 66% (6669/10104)
remote: Counting objects: 67% (6770/10104)
remote: Counting objects: 68% (6871/10104)
remote: Counting objects: 69% (6972/10104)
remote: Counting objects: 70% (7073/10104)
remote: Counting objects: 71% (7174/10104)
remote: Counting objects: 72% (7275/10104)
remote: Counting objects: 73% (7376/10104)
remote: Counting objects: 74% (7477/10104)
remote: Counting objects: 75% (7578/10104)
remote: Counting objects: 76% (7680/10104)
remote: Counting objects: 77% (7781/10104)
remote: Counting objects: 78% (7882/10104)
remote: Counting objects: 79% (7983/10104)
remote: Counting objects: 80% (8084/10104)
remote: Counting objects: 81% (8185/10104)
remote: Counting objects: 82% (8286/10104)
remote: Counting objects: 83% (8387/10104)
remote: Counting objects: 84% (8488/10104)
remote: Counting objects: 85% (8589/10104)
remote: Counting objects: 86% (8690/10104)
remote: Counting objects: 87% (8791/10104)
remote: Counting objects: 88% (8892/10104)
remote: Counting objects: 89% (8993/10104)
remote: Counting objects: 90% (9094/10104)
remote: Counting objects: 91% (9195/10104)
remote: Counting objects: 92% (9296/10104)
remote: Counting objects: 93% (9397/10104)
remote: Counting objects: 94% (9498/10104)
remote: Counting objects: 95% (9599/10104)
remote: Counting objects: 96% (9700/10104)
remote: Counting objects: 97% (9801/10104)
remote: Counting objects: 98% (9902/10104)
remote: Counting objects: 99% (10003/10104)
remote: Counting objects: 100% (10104/10104)
remote: Counting objects: 100% (10104/10104), done.
4.12 s
remote: Compressing objects: 0% (1/2250)
remote: Compressing objects: 1% (23/2250)
remote: Compressing objects: 2% (45/2250)
remote: Compressing objects: 3% (68/2250)
remote: Compressing objects: 4% (90/2250)
remote: Compressing objects: 5% (113/2250)
remote: Compressing objects: 6% (135/2250)
remote: Compressing objects: 7% (158/2250)
remote: Compressing objects: 8% (180/2250)
remote: Compressing objects: 9% (203/2250)
remote: Compressing objects: 9% (215/2250)
remote: Compressing objects: 10% (225/2250)
remote: Compressing objects: 11% (248/2250)
remote: Compressing objects: 12% (270/2250)
remote: Compressing objects: 13% (293/2250)
remote: Compressing objects: 14% (315/2250)
remote: Compressing objects: 15% (338/2250)
remote: Compressing objects: 16% (360/2250)
remote: Compressing objects: 17% (383/2250)
remote: Compressing objects: 18% (405/2250)
remote: Compressing objects: 19% (428/2250)
remote: Compressing objects: 20% (450/2250)
remote: Compressing objects: 21% (473/2250)
remote: Compressing objects: 22% (495/2250)
remote: Compressing objects: 22% (506/2250)
remote: Compressing objects: 23% (518/2250)
remote: Compressing objects: 24% (540/2250)
remote: Compressing objects: 25% (563/2250)
remote: Compressing objects: 26% (585/2250)
remote: Compressing objects: 27% (608/2250)
remote: Compressing objects: 28% (630/2250)
remote: Compressing objects: 29% (653/2250)
remote: Compressing objects: 30% (675/2250)
remote: Compressing objects: 31% (698/2250)
remote: Compressing objects: 32% (720/2250)
remote: Compressing objects: 33% (743/2250)
remote: Compressing objects: 34% (765/2250)
remote: Compressing objects: 35% (788/2250)
remote: Compressing objects: 36% (810/2250)
remote: Compressing objects: 37% (833/2250)
remote: Compressing objects: 38% (855/2250)
remote: Compressing objects: 39% (878/2250)
remote: Compressing objects: 40% (900/2250)
remote: Compressing objects: 41% (923/2250)
remote: Compressing objects: 42% (945/2250)
remote: Compressing objects: 43% (968/2250)
remote: Compressing objects: 44% (990/2250)
remote: Compressing objects: 45% (1013/2250)
remote: Compressing objects: 46% (1035/2250)
remote: Compressing objects: 47% (1058/2250)
remote: Compressing objects: 48% (1080/2250)
remote: Compressing objects: 49% (1103/2250)
remote: Compressing objects: 50% (1125/2250)
remote: Compressing objects: 51% (1148/2250)
remote: Compressing objects: 52% (1170/2250)
remote: Compressing objects: 53% (1193/2250)
remote: Compressing objects: 54% (1215/2250)
remote: Compressing objects: 55% (1238/2250)
remote: Compressing objects: 56% (1260/2250)
remote: Compressing objects: 57% (1283/2250)
remote: Compressing objects: 58% (1305/2250)
remote: Compressing objects: 59% (1328/2250)
remote: Compressing objects: 60% (1350/2250)
remote: Compressing objects: 61% (1373/2250)
remote: Compressing objects: 62% (1395/2250)
remote: Compressing objects: 63% (1418/2250)
remote: Compressing objects: 64% (1440/2250)
remote: Compressing objects: 65% (1463/2250)
remote: Compressing objects: 66% (1485/2250)
remote: Compressing objects: 67% (1508/2250)
remote: Compressing objects: 68% (1530/2250)
remote: Compressing objects: 69% (1553/2250)
remote: Compressing objects: 70% (1575/2250)
remote: Compressing objects: 71% (1598/2250)
remote: Compressing objects: 72% (1620/2250)
remote: Compressing objects: 73% (1643/2250)
remote: Compressing objects: 74% (1665/2250)
remote: Compressing objects: 75% (1688/2250)
remote: Compressing objects: 76% (1710/2250)
remote: Compressing objects: 77% (1733/2250)
remote: Compressing objects: 78% (1755/2250)
remote: Compressing objects: 79% (1778/2250)
remote: Compressing objects: 80% (1800/2250)
remote: Compressing objects: 81% (1823/2250)
remote: Compressing objects: 82% (1845/2250)
remote: Compressing objects: 83% (1868/2250)
remote: Compressing objects: 84% (1890/2250)
remote: Compressing objects: 85% (1913/2250)
remote: Compressing objects: 86% (1935/2250)
remote: Compressing objects: 87% (1958/2250)
remote: Compressing objects: 88% (1980/2250)
remote: Compressing objects: 89% (2003/2250)
remote: Compressing objects: 90% (2025/2250)
remote: Compressing objects: 91% (2048/2250)
remote: Compressing objects: 92% (2070/2250)
remote: Compressing objects: 93% (2093/2250)
remote: Compressing objects: 94% (2115/2250)
remote: Compressing objects: 95% (2138/2250)
remote: Compressing objects: 96% (2160/2250)
remote: Compressing objects: 97% (2183/2250)
remote: Compressing objects: 98% (2205/2250)
remote: Compressing objects: 99% (2228/2250)
remote: Compressing objects: 100% (2250/2250)
remote: Compressing objects: 100% (2250/2250), done.
17.40 s
Receiving objects: 0% (1/103390)
Receiving objects: 1% (1034/103390)
Receiving objects: 2% (2068/103390)
Receiving objects: 3% (3102/103390)
Receiving objects: 4% (4136/103390)
Receiving objects: 5% (5170/103390)
Receiving objects: 6% (6204/103390)
Receiving objects: 7% (7238/103390), 11.62 MiB | 23.22 MiB/s
Receiving objects: 8% (8272/103390), 11.62 MiB | 23.22 MiB/s
Receiving objects: 9% (9306/103390), 11.62 MiB | 23.22 MiB/s
Receiving objects: 10% (10339/103390), 11.62 MiB | 23.22 MiB/s
Receiving objects: 11% (11373/103390), 11.62 MiB | 23.22 MiB/s
Receiving objects: 12% (12407/103390), 11.62 MiB | 23.22 MiB/s
Receiving objects: 13% (13441/103390), 11.62 MiB | 23.22 MiB/s
Receiving objects: 14% (14475/103390), 11.62 MiB | 23.22 MiB/s
Receiving objects: 15% (15509/103390), 11.62 MiB | 23.22 MiB/s
Receiving objects: 16% (16543/103390), 11.62 MiB | 23.22 MiB/s
Receiving objects: 17% (17577/103390), 11.62 MiB | 23.22 MiB/s
Receiving objects: 18% (18611/103390), 11.62 MiB | 23.22 MiB/s
Receiving objects: 19% (19645/103390), 11.62 MiB | 23.22 MiB/s
Receiving objects: 20% (20678/103390), 11.62 MiB | 23.22 MiB/s
Receiving objects: 21% (21712/103390), 11.62 MiB | 23.22 MiB/s
Receiving objects: 22% (22746/103390), 11.62 MiB | 23.22 MiB/s
Receiving objects: 23% (23780/103390), 11.62 MiB | 23.22 MiB/s
Receiving objects: 24% (24814/103390), 11.62 MiB | 23.22 MiB/s
Receiving objects: 24% (25511/103390), 26.26 MiB | 26.25 MiB/s
Receiving objects: 25% (25848/103390), 26.26 MiB | 26.25 MiB/s
Receiving objects: 26% (26882/103390), 26.26 MiB | 26.25 MiB/s
Receiving objects: 27% (27916/103390), 26.26 MiB | 26.25 MiB/s
Receiving objects: 28% (28950/103390), 26.26 MiB | 26.25 MiB/s
Receiving objects: 29% (29984/103390), 26.26 MiB | 26.25 MiB/s
Receiving objects: 30% (31017/103390), 26.26 MiB | 26.25 MiB/s
Receiving objects: 31% (32051/103390), 26.26 MiB | 26.25 MiB/s
Receiving objects: 32% (33085/103390), 26.26 MiB | 26.25 MiB/s
Receiving objects: 33% (34119/103390), 26.26 MiB | 26.25 MiB/s
Receiving objects: 34% (35153/103390), 26.26 MiB | 26.25 MiB/s
Receiving objects: 35% (36187/103390), 26.26 MiB | 26.25 MiB/s
Receiving objects: 36% (37221/103390), 26.26 MiB | 26.25 MiB/s
Receiving objects: 37% (38255/103390), 41.60 MiB | 27.73 MiB/s
Receiving objects: 38% (39289/103390), 41.60 MiB | 27.73 MiB/s
Receiving objects: 39% (40323/103390), 41.60 MiB | 27.73 MiB/s
Receiving objects: 40% (41356/103390), 41.60 MiB | 27.73 MiB/s
Receiving objects: 41% (42390/103390), 41.60 MiB | 27.73 MiB/s
Receiving objects: 42% (43424/103390), 41.60 MiB | 27.73 MiB/s
Receiving objects: 43% (44458/103390), 41.60 MiB | 27.73 MiB/s
Receiving objects: 44% (45492/103390), 41.60 MiB | 27.73 MiB/s
Receiving objects: 44% (46306/103390), 56.25 MiB | 27.99 MiB/s
Receiving objects: 45% (46526/103390), 56.25 MiB | 27.99 MiB/s
Receiving objects: 46% (47560/103390), 56.25 MiB | 27.99 MiB/s
Receiving objects: 47% (48594/103390), 56.25 MiB | 27.99 MiB/s
Receiving objects: 48% (49628/103390), 56.25 MiB | 27.99 MiB/s
Receiving objects: 49% (50662/103390), 56.25 MiB | 27.99 MiB/s
Receiving objects: 50% (51695/103390), 71.54 MiB | 28.29 MiB/s
Receiving objects: 51% (52729/103390), 71.54 MiB | 28.29 MiB/s
Receiving objects: 52% (53763/103390), 71.54 MiB | 28.29 MiB/s
Receiving objects: 53% (54797/103390), 71.54 MiB | 28.29 MiB/s
Receiving objects: 54% (55831/103390), 71.54 MiB | 28.29 MiB/s
Receiving objects: 55% (56865/103390), 71.54 MiB | 28.29 MiB/s
Receiving objects: 55% (57510/103390), 86.71 MiB | 28.58 MiB/s
Receiving objects: 56% (57899/103390), 86.71 MiB | 28.58 MiB/s
Receiving objects: 57% (58933/103390), 86.71 MiB | 28.58 MiB/s
Receiving objects: 58% (59967/103390), 95.90 MiB | 27.06 MiB/s
Receiving objects: 59% (61001/103390), 95.90 MiB | 27.06 MiB/s
Receiving objects: 59% (61841/103390), 95.90 MiB | 27.06 MiB/s
Receiving objects: 60% (62034/103390), 95.90 MiB | 27.06 MiB/s
Receiving objects: 61% (63068/103390), 111.53 MiB | 27.58 MiB/s
Receiving objects: 62% (64102/103390), 127.61 MiB | 28.06 MiB/s
Receiving objects: 62% (64127/103390), 127.61 MiB | 28.06 MiB/s
Receiving objects: 63% (65136/103390), 143.54 MiB | 29.01 MiB/s
Receiving objects: 63% (66032/103390), 176.14 MiB | 29.60 MiB/s
Receiving objects: 63% (66060/103390), 208.43 MiB | 30.27 MiB/s
Receiving objects: 64% (66170/103390), 225.03 MiB | 30.62 MiB/s
Receiving objects: 64% (66172/103390), 225.03 MiB | 30.62 MiB/s
Receiving objects: 64% (66303/103390), 257.82 MiB | 32.43 MiB/s
Receiving objects: 65% (67204/103390), 290.77 MiB | 32.63 MiB/s
Receiving objects: 66% (68238/103390), 290.77 MiB | 32.63 MiB/s
Receiving objects: 67% (69272/103390), 290.77 MiB | 32.63 MiB/s
Receiving objects: 68% (70306/103390), 290.77 MiB | 32.63 MiB/s
Receiving objects: 69% (71340/103390), 290.77 MiB | 32.63 MiB/s
Receiving objects: 70% (72373/103390), 290.77 MiB | 32.63 MiB/s
Receiving objects: 70% (72607/103390), 290.77 MiB | 32.63 MiB/s
Receiving objects: 71% (73407/103390), 307.48 MiB | 32.70 MiB/s
Receiving objects: 72% (74441/103390), 318.85 MiB | 31.25 MiB/s
Receiving objects: 73% (75475/103390), 318.85 MiB | 31.25 MiB/s
Receiving objects: 74% (76509/103390), 318.85 MiB | 31.25 MiB/s
Receiving objects: 75% (77543/103390), 318.85 MiB | 31.25 MiB/s
Receiving objects: 76% (78577/103390), 318.85 MiB | 31.25 MiB/s
Receiving objects: 77% (79611/103390), 318.85 MiB | 31.25 MiB/s
Receiving objects: 78% (80645/103390), 318.85 MiB | 31.25 MiB/s
Receiving objects: 79% (81679/103390), 318.85 MiB | 31.25 MiB/s
Receiving objects: 80% (82712/103390), 318.85 MiB | 31.25 MiB/s
Receiving objects: 80% (83234/103390), 318.85 MiB | 31.25 MiB/s
Receiving objects: 81% (83746/103390), 318.85 MiB | 31.25 MiB/s
Receiving objects: 82% (84780/103390), 333.36 MiB | 30.91 MiB/s
Receiving objects: 83% (85814/103390), 346.01 MiB | 30.16 MiB/s
Receiving objects: 83% (86096/103390), 346.01 MiB | 30.16 MiB/s
Receiving objects: 84% (86848/103390), 359.54 MiB | 29.25 MiB/s
Receiving objects: 85% (87882/103390), 359.54 MiB | 29.25 MiB/s
Receiving objects: 86% (88916/103390), 359.54 MiB | 29.25 MiB/s
Receiving objects: 87% (89950/103390), 359.54 MiB | 29.25 MiB/s
Receiving objects: 88% (90984/103390), 374.26 MiB | 28.86 MiB/s
Receiving objects: 89% (92018/103390), 374.26 MiB | 28.86 MiB/s
Receiving objects: 89% (93048/103390), 374.26 MiB | 28.86 MiB/s
Receiving objects: 90% (93051/103390), 374.26 MiB | 28.86 MiB/s
Receiving objects: 91% (94085/103390), 374.26 MiB | 28.86 MiB/s
Receiving objects: 92% (95119/103390), 374.26 MiB | 28.86 MiB/s
Receiving objects: 93% (96153/103390), 374.26 MiB | 28.86 MiB/s
Receiving objects: 94% (97187/103390), 374.26 MiB | 28.86 MiB/s
Receiving objects: 95% (98221/103390), 374.26 MiB | 28.86 MiB/s
Receiving objects: 96% (99255/103390), 374.26 MiB | 28.86 MiB/s
Receiving objects: 97% (100289/103390), 374.26 MiB | 28.86 MiB/s
Receiving objects: 98% (101323/103390), 374.26 MiB | 28.86 MiB/s
Receiving objects: 99% (102357/103390), 388.73 MiB | 28.49 MiB/s
remote: Total 103390 (delta 8622), reused 8039 (delta 7829), pack-reused 93286 (from 4)
17.40 s
Receiving objects: 100% (103390/103390), 388.73 MiB | 28.49 MiB/s
Receiving objects: 100% (103390/103390), 391.81 MiB | 29.52 MiB/s, done.
18.48 s
Resolving deltas: 0% (0/67724)
Resolving deltas: 1% (678/67724)
Resolving deltas: 2% (1355/67724)
Resolving deltas: 3% (2032/67724)
Resolving deltas: 4% (2709/67724)
Resolving deltas: 5% (3387/67724)
Resolving deltas: 6% (4064/67724)
Resolving deltas: 7% (4742/67724)
Resolving deltas: 8% (5419/67724)
Resolving deltas: 9% (6096/67724)
Resolving deltas: 10% (6773/67724)
Resolving deltas: 11% (7450/67724)
Resolving deltas: 12% (8127/67724)
Resolving deltas: 13% (8805/67724)
Resolving deltas: 14% (9482/67724)
Resolving deltas: 15% (10159/67724)
Resolving deltas: 16% (10838/67724)
Resolving deltas: 17% (11514/67724)
Resolving deltas: 18% (12191/67724)
Resolving deltas: 19% (12868/67724)
Resolving deltas: 20% (13545/67724)
Resolving deltas: 21% (14223/67724)
Resolving deltas: 22% (14900/67724)
Resolving deltas: 23% (15577/67724)
Resolving deltas: 24% (16254/67724)
Resolving deltas: 25% (16931/67724)
Resolving deltas: 26% (17609/67724)
Resolving deltas: 27% (18286/67724)
Resolving deltas: 28% (18963/67724)
Resolving deltas: 29% (19640/67724)
Resolving deltas: 30% (20318/67724)
Resolving deltas: 31% (20996/67724)
Resolving deltas: 32% (21672/67724)
Resolving deltas: 33% (22350/67724)
Resolving deltas: 34% (23029/67724)
Resolving deltas: 35% (23707/67724)
Resolving deltas: 36% (24382/67724)
Resolving deltas: 37% (25058/67724)
Resolving deltas: 38% (25736/67724)
Resolving deltas: 39% (26413/67724)
Resolving deltas: 40% (27090/67724)
Resolving deltas: 41% (27768/67724)
Resolving deltas: 42% (28447/67724)
Resolving deltas: 43% (29124/67724)
Resolving deltas: 44% (29799/67724)
Resolving deltas: 45% (30476/67724)
Resolving deltas: 46% (31154/67724)
Resolving deltas: 47% (31831/67724)
Resolving deltas: 48% (32508/67724)
Resolving deltas: 49% (33185/67724)
Resolving deltas: 50% (33862/67724)
Resolving deltas: 51% (34540/67724)
Resolving deltas: 52% (35217/67724)
Resolving deltas: 53% (35897/67724)
Resolving deltas: 54% (36572/67724)
Resolving deltas: 55% (37249/67724)
Resolving deltas: 56% (37926/67724)
Resolving deltas: 57% (38603/67724)
Resolving deltas: 58% (39280/67724)
Resolving deltas: 59% (39958/67724)
Resolving deltas: 60% (40635/67724)
Resolving deltas: 61% (41312/67724)
Resolving deltas: 62% (41989/67724)
Resolving deltas: 63% (42668/67724)
Resolving deltas: 64% (43344/67724)
Resolving deltas: 65% (44021/67724)
Resolving deltas: 66% (44699/67724)
Resolving deltas: 67% (45376/67724)
Resolving deltas: 68% (46054/67724)
Resolving deltas: 69% (46730/67724)
Resolving deltas: 70% (47407/67724)
Resolving deltas: 71% (48085/67724)
Resolving deltas: 72% (48762/67724)
Resolving deltas: 73% (49441/67724)
Resolving deltas: 74% (50119/67724)
Resolving deltas: 75% (50793/67724)
Resolving deltas: 76% (51471/67724)
Resolving deltas: 77% (52148/67724)
Resolving deltas: 78% (52825/67724)
Resolving deltas: 79% (53502/67724)
Resolving deltas: 80% (54180/67724)
Resolving deltas: 81% (54858/67724)
Resolving deltas: 82% (55534/67724)
Resolving deltas: 83% (56211/67724)
Resolving deltas: 84% (56892/67724)
Resolving deltas: 85% (57566/67724)
Resolving deltas: 86% (58243/67724)
Resolving deltas: 87% (58920/67724)
Resolving deltas: 88% (59598/67724)
Resolving deltas: 89% (60275/67724)
Resolving deltas: 90% (60953/67724)
Resolving deltas: 91% (61629/67724)
Resolving deltas: 91% (61886/67724)
Resolving deltas: 92% (62307/67724)
Resolving deltas: 93% (62984/67724)
Resolving deltas: 94% (63662/67724)
Resolving deltas: 95% (64338/67724)
Resolving deltas: 96% (65016/67724)
Resolving deltas: 97% (65693/67724)
Resolving deltas: 98% (66371/67724)
Resolving deltas: 99% (67047/67724)
Resolving deltas: 100% (67724/67724)
Resolving deltas: 100% (67724/67724), done.
18.95 s
Fetching commit 0afa8ad228d762fc4c781c8dbec2e17f2eb2f1c6 for feynkit ...
18.95 s
$ /nix/store/5vpcfsdx1lcnlb2y4k7xyc74shp5qwbh-git-2.54.0/bin/git fetch origin 0afa8ad228d762fc4c781c8dbec2e17f2eb2f1c6
19.42 s
From https://github.com/alphal00p/gammaloop
19.42 s
* branch 0afa8ad228d762fc4c781c8dbec2e17f2eb2f1c6 -> FETCH_HEAD
19.43 s
$ /nix/store/61685rbaxmpigwi3z23i33sv3jyfl70q-coreutils-9.11/bin/timeout --kill-after=15s 7200s /nix/store/5vpcfsdx1lcnlb2y4k7xyc74shp5qwbh-git-2.54.0/bin/git -c advice.detachedHead=false checkout 0afa8ad228d762fc4c781c8dbec2e17f2eb2f1c6
19.64 s
HEAD is now at 0afa8ad22 align generation defaults and avoid repeated numerator expansion
19.65 s
$ /nix/store/61685rbaxmpigwi3z23i33sv3jyfl70q-coreutils-9.11/bin/timeout --kill-after=15s 7200s /nix/store/wknkybkzrc16r11vk5vrykh4wmw7a353-nix-2.34.8/bin/nix --extra-experimental-features nix-command --extra-experimental-features flakes --log-format internal-json run .#packages.x86_64-linux.nix-ci-check-gammaloop-nextest-core --print-build-logs
19.76 s
warning: ignoring untrusted flake configuration setting 'extra-substituters'.
19.76 s
Pass '--accept-flake-config' to trust it
19.76 s
warning: ignoring untrusted flake configuration setting 'extra-trusted-public-keys'.
19.76 s
Pass '--accept-flake-config' to trust it
23.74 s
23.94 s
do you want to allow configuration setting 'extra-substituters' to be set to 'https://cache.nix-ci.com ' (y/N)? do you want to permanently mark this value as untrusted (y/N)? warning: ignoring untrusted flake configuration setting 'extra-substituters'.
23.94 s
Pass '--accept-flake-config' to trust it
23.94 s
evaluating derivation 'gdo you want to allow configuration setting 'extra-trusted-public-keys' to be set to 'nix-ci:g3xV5BDTLtIBZr/A00IU1x0EtKKlb7YLgBN2SgYgM6A= ' (y/N)? do you want to permanently mark this value as untrusted (y/N)? warning: ignoring untrusted flake configuration setting 'extra-trusted-public-keys'.
23.94 s
Pass '--accept-flake-config' to trust it
28.85 s
copying '/nix/store/s70x
evaluating derivation 'g
copying '/nix/store/s70x
evaluating derivation 'g
copying '/nix/store/s70x
evaluating derivation 'g
copying '/nix/store/s70x
evaluating derivation 'g
copying '/nix/store/s70x
evaluating derivation 'g
copying '/nix/store/s70x
evaluating derivation 'g
copying '/nix/store/s70x
evaluating derivation 'g
querying gammaloop-nexte
[0.0 KiB DL] querying ne
[0 /2 built, 1 /0 /1 copied
[0 /1 built, 1 copied (4.
[1 /0 /1 built, 1 copied (gammaloop-nextest-core> Extracting 4 binaries (including 2 non-test binaries), 1 build script output directory, and 2 linked paths to /build/source
29.29 s
gammaloop-nextest-core> Extracted 20 files to /build/source in 0.44s
29.30 s
gammaloop-nextest-core> ------------
29.30 s
gammaloop-nextest-core> Nextest run ID b1b1be79-3923-4f44-a4c4-70d767e2350c with nextest profile: ci_gammaloop
29.30 s
gammaloop-nextest-core> Starting 341 tests across 2 binaries (1 test skipped )
29.67 s
gammaloop-nextest-core> ------------
29.67 s
gammaloop-nextest-core> Summary [ 0.372s] 341 tests run: 341 passed , 1 skipped
29.70 s
gammaloop-nextest-core>
29.70 s
gammaloop-nextest-core> ========== nextest test summary ==========
29.70 s
gammaloop-nextest-core> report: target/nextest/ci_gammaloop/junit.xml
29.70 s
gammaloop-nextest-core> tests: 341, failures: 0, errors: 0
29.70 s
gammaloop-nextest-core> No failing testcases found.
29.70 s
gammaloop-nextest-core> =========================================
29.71 s
gammaloop-nextest-core> Extracting 1 binary and 1 linked path to /build/source
29.78 s
gammaloop-nextest-core> Extracted 7 files to /build/source in 0.07s
29.79 s
gammaloop-nextest-core> ------------
29.79 s
gammaloop-nextest-core> Nextest run ID 1a809ff1-f139-414e-b5e0-c752ca738dcb with nextest profile: ci_gammaloop
29.79 s
gammaloop-nextest-core> Starting 19 tests across 1 binary
29.80 s
gammaloop-nextest-core> ------------
29.80 s
gammaloop-nextest-core> Summary [ 0.010s] 19 tests run: 19 passed , 0 skipped
29.83 s
gammaloop-nextest-core>
29.83 s
gammaloop-nextest-core> ========== nextest test summary ==========
29.83 s
gammaloop-nextest-core> report: target/nextest/ci_gammaloop/junit.xml
29.83 s
gammaloop-nextest-core> tests: 19, failures: 0, errors: 0
29.83 s
gammaloop-nextest-core> No failing testcases found.
29.83 s
gammaloop-nextest-core> =========================================
29.84 s
gammaloop-nextest-core> Extracting 1 binary to /build/source
29.87 s
gammaloop-nextest-core> Extracted 4 files to /build/source in 0.03s
29.87 s
gammaloop-nextest-core> ------------
29.87 s
gammaloop-nextest-core> Nextest run ID 63cfbf99-c447-4a53-b79f-ca9d5b7e0e60 with nextest profile: ci_gammaloop
29.87 s
gammaloop-nextest-core> Starting 0 tests across 1 binary
29.87 s
gammaloop-nextest-core> ------------
29.87 s
gammaloop-nextest-core> Summary [ 0.000s] 0 tests run: 0 passed , 0 skipped
29.90 s
gammaloop-nextest-core>
29.90 s
gammaloop-nextest-core> ========== nextest test summary ==========
29.90 s
gammaloop-nextest-core> report: target/nextest/ci_gammaloop/junit.xml
29.90 s
gammaloop-nextest-core> tests: 0, failures: 0, errors: 0
29.90 s
gammaloop-nextest-core> No failing testcases found.
29.90 s
gammaloop-nextest-core> =========================================
29.91 s
gammaloop-nextest-core> Extracting 4 binaries (including 1 non-test binary), 1 build script output directory, and 2 linked paths to /build/source
30.35 s
gammaloop-nextest-core> Extracted 19 files to /build/source in 0.44s
30.36 s
gammaloop-nextest-core> ------------
30.36 s
gammaloop-nextest-core> Nextest run ID 96603c6a-ae66-4344-a17f-b07cb349f0ec with nextest profile: ci_gammaloop
30.36 s
gammaloop-nextest-core> Starting 421 tests across 3 binaries (31 tests skipped , including 30 tests via profile.ci_gammaloop.default-filter )
30.83 s
gammaloop-nextest-core> FAIL [ 0.043s] (364/421) gammalooprs utils::test_utils :: normalization
30.83 s
gammaloop-nextest-core> stdout ---
30.83 s
gammaloop-nextest-core>
30.83 s
gammaloop-nextest-core> running 1 test
30.83 s
gammaloop-nextest-core> ━━━━━━━━━━━━━━━━━━━━━━━━━━━━━━━ Snapshot Summary ━━━━━━━━━━━━━━━━━━━━━━━━━━━━━━━
30.83 s
gammaloop-nextest-core> Snapshot: normalization-2
30.83 s
gammaloop-nextest-core> Source: crates/gammalooprs/src/utils/test_utils.rs:44
30.83 s
gammaloop-nextest-core> ────────────────────────────────────────────────────────────────────────────────
30.83 s
gammaloop-nextest-core> Expression: b.to_canonical_string()
30.83 s
gammaloop-nextest-core> ────────────────────────────────────────────────────────────────────────────────
30.83 s
gammaloop-nextest-core> -old snapshot
30.83 s
gammaloop-nextest-core> +new results
30.83 s
gammaloop-nextest-core> ────────────┬───────────────────────────────────────────────────────────────────
30.83 s
gammaloop-nextest-core> 1 │-gammalooprs::{spenso::rank1,spenso::tensor}::Q(1,spenso::{}::cind(1))
30.83 s
gammaloop-nextest-core> 1 │+gammalooprs::{spenso::rank1,spenso::tensor,spenso::tensor-label:q}::Q(1,spenso::{}::cind(1))
30.83 s
gammaloop-nextest-core> ────────────┴───────────────────────────────────────────────────────────────────
30.83 s
gammaloop-nextest-core> To update snapshots run `cargo insta review`
30.83 s
gammaloop-nextest-core> Stopped on the first failure. Run `cargo insta test` to run all snapshots.
30.83 s
gammaloop-nextest-core> test utils::test_utils::normalization ... FAILED
30.83 s
gammaloop-nextest-core>
30.83 s
gammaloop-nextest-core> failures:
30.83 s
gammaloop-nextest-core>
30.83 s
gammaloop-nextest-core> failures:
30.83 s
gammaloop-nextest-core> utils::test_utils::normalization
30.83 s
gammaloop-nextest-core>
30.83 s
gammaloop-nextest-core> test result: FAILED. 0 passed; 1 failed; 0 ignored; 0 measured; 445 filtered out; finished in 0.04s
30.83 s
gammaloop-nextest-core>
30.83 s
gammaloop-nextest-core> stderr ---
30.83 s
gammaloop-nextest-core>
30.83 s
gammaloop-nextest-core> thread 'utils::test_utils::normalization' (2240) panicked at /nix/store/c7lwckzlfrfsdw1ay0aqz4dpc2j7ry8d-vendor-cargo-deps/c19b7c6f923b580ac259164a89f2577984ad5ab09ee9d583b888f934adbbe8d0/insta-1.47.2/src/runtime.rs:719:13:
30.83 s
gammaloop-nextest-core> snapshot assertion for 'normalization-2' failed in line 44
30.83 s
gammaloop-nextest-core> stack backtrace:
30.83 s
gammaloop-nextest-core> 0: __rustc::rust_begin_unwind
30.83 s
gammaloop-nextest-core> 1: core::panicking::panic_fmt
30.83 s
gammaloop-nextest-core> 2: insta::runtime::assert_snapshot
30.83 s
gammaloop-nextest-core> 3: gammalooprs::utils::test_utils::normalization
30.83 s
gammaloop-nextest-core> 4: <gammalooprs::utils::test_utils::normalization::{closure#0} as core::ops::function::FnOnce<()>>::call_once
30.83 s
gammaloop-nextest-core> note: Some details are omitted, run with `RUST_BACKTRACE=full` for a verbose backtrace.
30.83 s
gammaloop-nextest-core>
36.20 s
gammaloop-nextest-core> ------------
36.20 s
gammaloop-nextest-core> Summary [ 5.841s] 421 tests run: 420 passed , 1 failed , 31 skipped
36.20 s
gammaloop-nextest-core> FAIL [ 0.043s] (364/421) gammalooprs utils::test_utils :: normalization
36.20 s
gammaloop-nextest-core> stdout ---
36.20 s
gammaloop-nextest-core>
36.20 s
gammaloop-nextest-core> running 1 test
36.20 s
gammaloop-nextest-core> ━━━━━━━━━━━━━━━━━━━━━━━━━━━━━━━ Snapshot Summary ━━━━━━━━━━━━━━━━━━━━━━━━━━━━━━━
36.20 s
gammaloop-nextest-core> Snapshot: normalization-2
36.20 s
gammaloop-nextest-core> Source: crates/gammalooprs/src/utils/test_utils.rs:44
36.20 s
gammaloop-nextest-core> ────────────────────────────────────────────────────────────────────────────────
36.20 s
gammaloop-nextest-core> Expression: b.to_canonical_string()
36.20 s
gammaloop-nextest-core> ────────────────────────────────────────────────────────────────────────────────
36.20 s
gammaloop-nextest-core> -old snapshot
36.20 s
gammaloop-nextest-core> +new results
36.20 s
gammaloop-nextest-core> ────────────┬───────────────────────────────────────────────────────────────────
36.20 s
gammaloop-nextest-core> 1 │-gammalooprs::{spenso::rank1,spenso::tensor}::Q(1,spenso::{}::cind(1))
36.20 s
gammaloop-nextest-core> 1 │+gammalooprs::{spenso::rank1,spenso::tensor,spenso::tensor-label:q}::Q(1,spenso::{}::cind(1))
36.20 s
gammaloop-nextest-core> ────────────┴───────────────────────────────────────────────────────────────────
36.20 s
gammaloop-nextest-core> To update snapshots run `cargo insta review`
36.20 s
gammaloop-nextest-core> Stopped on the first failure. Run `cargo insta test` to run all snapshots.
36.20 s
gammaloop-nextest-core> test utils::test_utils::normalization ... FAILED
36.20 s
gammaloop-nextest-core>
36.20 s
gammaloop-nextest-core> failures:
36.20 s
gammaloop-nextest-core>
36.20 s
gammaloop-nextest-core> failures:
36.20 s
gammaloop-nextest-core> utils::test_utils::normalization
36.20 s
gammaloop-nextest-core>
36.20 s
gammaloop-nextest-core> test result: FAILED. 0 passed; 1 failed; 0 ignored; 0 measured; 445 filtered out; finished in 0.04s
36.20 s
gammaloop-nextest-core>
36.20 s
gammaloop-nextest-core> stderr ---
36.20 s
gammaloop-nextest-core>
36.20 s
gammaloop-nextest-core> thread 'utils::test_utils::normalization' (2240) panicked at /nix/store/c7lwckzlfrfsdw1ay0aqz4dpc2j7ry8d-vendor-cargo-deps/c19b7c6f923b580ac259164a89f2577984ad5ab09ee9d583b888f934adbbe8d0/insta-1.47.2/src/runtime.rs:719:13:
36.20 s
gammaloop-nextest-core> snapshot assertion for 'normalization-2' failed in line 44
36.20 s
gammaloop-nextest-core> stack backtrace:
36.20 s
gammaloop-nextest-core> 0: __rustc::rust_begin_unwind
36.20 s
gammaloop-nextest-core> 1: core::panicking::panic_fmt
36.20 s
gammaloop-nextest-core> 2: insta::runtime::assert_snapshot
36.20 s
gammaloop-nextest-core> 3: gammalooprs::utils::test_utils::normalization
36.20 s
gammaloop-nextest-core> 4: <gammalooprs::utils::test_utils::normalization::{closure#0} as core::ops::function::FnOnce<()>>::call_once
36.20 s
gammaloop-nextest-core> note: Some details are omitted, run with `RUST_BACKTRACE=full` for a verbose backtrace.
36.20 s
gammaloop-nextest-core>
36.21 s
gammaloop-nextest-core> error : test run failed
36.23 s
gammaloop-nextest-core>
36.23 s
gammaloop-nextest-core> ========== nextest test summary ==========
36.23 s
gammaloop-nextest-core> report: target/nextest/ci_gammaloop/junit.xml
36.23 s
gammaloop-nextest-core> tests: 421, failures: 1, errors: 0
36.23 s
gammaloop-nextest-core>
36.23 s
gammaloop-nextest-core> 1. gammalooprs::utils::test_utils::normalization
36.23 s
gammaloop-nextest-core> failure: test failure with exit code 101
36.23 s
gammaloop-nextest-core> thread 'utils::test_utils::normalization' (2240) panicked at /nix/store/c7lwckzlfrfsdw1ay0aqz4dpc2j7ry8d-vendor-cargo-deps/c19b7c6f923b580ac259164a89f2577984ad5ab09ee9d583b888f934adbbe8d0/insta-1.47.2/src/runtime.rs:719:13:
36.23 s
gammaloop-nextest-core> snapshot assertion for 'normalization-2' failed in line 44
36.23 s
gammaloop-nextest-core> stack backtrace:
36.23 s
gammaloop-nextest-core> 0: __rustc::rust_begin_unwind
36.23 s
gammaloop-nextest-core> 1: core::panicking::panic_fmt
36.23 s
gammaloop-nextest-core> 2: insta::runtime::assert_snapshot
36.23 s
gammaloop-nextest-core> 3: gammalooprs::utils::test_utils::normalization
36.23 s
gammaloop-nextest-core> 4: <gammalooprs::utils::test_utils::normalization::{closure#0} as core::ops::function::FnOnce<()>>::call_once
36.23 s
gammaloop-nextest-core> note: Some details are omitted, run with `RUST_BACKTRACE=full` for a verbose backtrace.
36.23 s
gammaloop-nextest-core> system-out
36.23 s
gammaloop-nextest-core> running 1 test
36.23 s
gammaloop-nextest-core> ━━━━━━━━━━━━━━━━━━━━━━━━━━━━━━━ Snapshot Summary ━━━━━━━━━━━━━━━━━━━━━━━━━━━━━━━
36.23 s
gammaloop-nextest-core> Snapshot: normalization-2
36.23 s
gammaloop-nextest-core> Source: crates/gammalooprs/src/utils/test_utils.rs:44
36.23 s
gammaloop-nextest-core> ────────────────────────────────────────────────────────────────────────────────
36.23 s
gammaloop-nextest-core> Expression: b.to_canonical_string()
36.23 s
gammaloop-nextest-core> ────────────────────────────────────────────────────────────────────────────────
36.23 s
gammaloop-nextest-core> -old snapshot
36.23 s
gammaloop-nextest-core> +new results
36.23 s
gammaloop-nextest-core> ────────────┬───────────────────────────────────────────────────────────────────
36.23 s
gammaloop-nextest-core> 1 │-gammalooprs::{spenso::rank1,spenso::tensor}::Q(1,spenso::{}::cind(1))
36.23 s
gammaloop-nextest-core> 1 │+gammalooprs::{spenso::rank1,spenso::tensor,spenso::tensor-label:q}::Q(1,spenso::{}::cind(1))
36.23 s
gammaloop-nextest-core> ────────────┴───────────────────────────────────────────────────────────────────
36.23 s
gammaloop-nextest-core> To update snapshots run `cargo insta review`
36.23 s
gammaloop-nextest-core> Stopped on the first failure. Run `cargo insta test` to run all snapshots.
36.23 s
gammaloop-nextest-core> test utils::test_utils::normalization ... FAILED
36.23 s
gammaloop-nextest-core>
36.23 s
gammaloop-nextest-core> failures:
36.23 s
gammaloop-nextest-core>
36.23 s
gammaloop-nextest-core> failures:
36.23 s
gammaloop-nextest-core> utils::test_utils::normalization
36.23 s
gammaloop-nextest-core>
36.23 s
gammaloop-nextest-core> test result: FAILED. 0 passed; 1 failed; 0 ignored; 0 measured; 445 filtered out; finished in 0.04s
36.23 s
gammaloop-nextest-core> system-err
36.23 s
gammaloop-nextest-core> thread 'utils::test_utils::normalization' (2240) panicked at /nix/store/c7lwckzlfrfsdw1ay0aqz4dpc2j7ry8d-vendor-cargo-deps/c19b7c6f923b580ac259164a89f2577984ad5ab09ee9d583b888f934adbbe8d0/insta-1.47.2/src/runtime.rs:719:13:
36.23 s
gammaloop-nextest-core> snapshot assertion for 'normalization-2' failed in line 44
36.23 s
gammaloop-nextest-core> stack backtrace:
36.23 s
gammaloop-nextest-core> 0: __rustc::rust_begin_unwind
36.23 s
gammaloop-nextest-core> 1: core::panicking::panic_fmt
36.23 s
gammaloop-nextest-core> 2: insta::runtime::assert_snapshot
36.23 s
gammaloop-nextest-core> 3: gammalooprs::utils::test_utils::normalization
36.23 s
gammaloop-nextest-core> 4: <gammalooprs::utils::test_utils::normalization::{closure#0} as core::ops::function::FnOnce<()>>::call_once
36.23 s
gammaloop-nextest-core> note: Some details are omitted, run with `RUST_BACKTRACE=full` for a verbose backtrace.
36.23 s
gammaloop-nextest-core> =========================================
36.37 s
error: Cannot build '/nix/store/0rndpqvn1mhrhym0h67djwsb96dh29hx-gammaloop-nextest-core.drv '.
36.37 s
Reason: builder failed with exit code 100 .
36.37 s
Output paths:
36.37 s
/nix/store/rczb80lc4sz8skn6psc0kmwyvxg6gk58-gammaloop-nextest-core
36.37 s
Last 176 log lines:
36.37 s
> Extracting 4 binaries (including 2 non-test binaries), 1 build script output directory, and 2 linked paths to /build/source
36.37 s
> Extracted 20 files to /build/source in 0.44s
36.37 s
> ------------
36.37 s
> Nextest run ID b1b1be79-3923-4f44-a4c4-70d767e2350c with nextest profile: ci_gammaloop
36.37 s
> Starting 341 tests across 2 binaries (1 test skipped )
36.37 s
> ------------
36.37 s
> Summary [ 0.372s] 341 tests run: 341 passed , 1 skipped
36.37 s
>
36.37 s
> ========== nextest test summary ==========
36.37 s
> report: target/nextest/ci_gammaloop/junit.xml
36.37 s
> tests: 341, failures: 0, errors: 0
36.37 s
> No failing testcases found.
36.37 s
> =========================================
36.37 s
> Extracting 1 binary and 1 linked path to /build/source
36.37 s
> Extracted 7 files to /build/source in 0.07s
36.37 s
> ------------
36.37 s
> Nextest run ID 1a809ff1-f139-414e-b5e0-c752ca738dcb with nextest profile: ci_gammaloop
36.37 s
> Starting 19 tests across 1 binary
36.37 s
> ------------
36.37 s
> Summary [ 0.010s] 19 tests run: 19 passed , 0 skipped
36.37 s
>
36.37 s
> ========== nextest test summary ==========
36.37 s
> report: target/nextest/ci_gammaloop/junit.xml
36.37 s
> tests: 19, failures: 0, errors: 0
36.37 s
> No failing testcases found.
36.37 s
> =========================================
36.37 s
> Extracting 1 binary to /build/source
36.37 s
> Extracted 4 files to /build/source in 0.03s
36.37 s
> ------------
36.37 s
> Nextest run ID 63cfbf99-c447-4a53-b79f-ca9d5b7e0e60 with nextest profile: ci_gammaloop
36.37 s
> Starting 0 tests across 1 binary
36.37 s
> ------------
36.37 s
> Summary [ 0.000s] 0 tests run: 0 passed , 0 skipped
36.37 s
>
36.37 s
> ========== nextest test summary ==========
36.37 s
> report: target/nextest/ci_gammaloop/junit.xml
36.37 s
> tests: 0, failures: 0, errors: 0
36.37 s
> No failing testcases found.
36.37 s
> =========================================
36.37 s
> Extracting 4 binaries (including 1 non-test binary), 1 build script output directory, and 2 linked paths to /build/source
36.37 s
> Extracted 19 files to /build/source in 0.44s
36.37 s
> ------------
36.37 s
> Nextest run ID 96603c6a-ae66-4344-a17f-b07cb349f0ec with nextest profile: ci_gammaloop
36.37 s
> Starting 421 tests across 3 binaries (31 tests skipped , including 30 tests via profile.ci_gammaloop.default-filter )
36.37 s
> FAIL [ 0.043s] (364/421) gammalooprs utils::test_utils :: normalization
36.37 s
> stdout ---
36.37 s
>
36.37 s
> running 1 test
36.37 s
> ━━━━━━━━━━━━━━━━━━━━━━━━━━━━━━━ Snapshot Summary ━━━━━━━━━━━━━━━━━━━━━━━━━━━━━━━
36.37 s
> Snapshot: normalization-2
36.37 s
> Source: crates/gammalooprs/src/utils/test_utils.rs:44
36.37 s
> ────────────────────────────────────────────────────────────────────────────────
36.37 s
> Expression: b.to_canonical_string()
36.37 s
> ────────────────────────────────────────────────────────────────────────────────
36.37 s
> -old snapshot
36.37 s
> +new results
36.37 s
> ────────────┬───────────────────────────────────────────────────────────────────
36.37 s
> 1 │-gammalooprs::{spenso::rank1,spenso::tensor}::Q(1,spenso::{}::cind(1))
36.37 s
> 1 │+gammalooprs::{spenso::rank1,spenso::tensor,spenso::tensor-label:q}::Q(1,spenso::{}::cind(1))
36.37 s
> ────────────┴───────────────────────────────────────────────────────────────────
36.37 s
> To update snapshots run `cargo insta review`
36.37 s
> Stopped on the first failure. Run `cargo insta test` to run all snapshots.
36.37 s
> test utils::test_utils::normalization ... FAILED
36.37 s
>
36.37 s
> failures:
36.37 s
>
36.37 s
> failures:
36.37 s
> utils::test_utils::normalization
36.37 s
>
36.37 s
> test result: FAILED. 0 passed; 1 failed; 0 ignored; 0 measured; 445 filtered out; finished in 0.04s
36.37 s
>
36.37 s
> stderr ---
36.37 s
>
36.37 s
> thread 'utils::test_utils::normalization' (2240) panicked at /nix/store/c7lwckzlfrfsdw1ay0aqz4dpc2j7ry8d-vendor-cargo-deps/c19b7c6f923b580ac259164a89f2577984ad5ab09ee9d583b888f934adbbe8d0/insta-1.47.2/src/runtime.rs:719:13:
36.37 s
> snapshot assertion for 'normalization-2' failed in line 44
36.37 s
> stack backtrace:
36.37 s
> 0: __rustc::rust_begin_unwind
36.37 s
> 1: core::panicking::panic_fmt
36.37 s
> 2: insta::runtime::assert_snapshot
36.37 s
> 3: gammalooprs::utils::test_utils::normalization
36.37 s
> 4: <gammalooprs::utils::test_utils::normalization::{closure#0} as core::ops::function::FnOnce<()>>::call_once
36.37 s
> note: Some details are omitted, run with `RUST_BACKTRACE=full` for a verbose backtrace.
36.37 s
>
36.37 s
> ------------
36.37 s
> Summary [ 5.841s] 421 tests run: 420 passed , 1 failed , 31 skipped
36.37 s
> FAIL [ 0.043s] (364/421) gammalooprs utils::test_utils :: normalization
36.37 s
> stdout ---
36.37 s
>
36.37 s
> running 1 test
36.37 s
> ━━━━━━━━━━━━━━━━━━━━━━━━━━━━━━━ Snapshot Summary ━━━━━━━━━━━━━━━━━━━━━━━━━━━━━━━
36.37 s
> Snapshot: normalization-2
36.37 s
> Source: crates/gammalooprs/src/utils/test_utils.rs:44
36.37 s
> ────────────────────────────────────────────────────────────────────────────────
36.37 s
> Expression: b.to_canonical_string()
36.37 s
> ────────────────────────────────────────────────────────────────────────────────
36.37 s
> -old snapshot
36.37 s
> +new results
36.37 s
> ────────────┬───────────────────────────────────────────────────────────────────
36.37 s
> 1 │-gammalooprs::{spenso::rank1,spenso::tensor}::Q(1,spenso::{}::cind(1))
36.37 s
> 1 │+gammalooprs::{spenso::rank1,spenso::tensor,spenso::tensor-label:q}::Q(1,spenso::{}::cind(1))
36.37 s
> ────────────┴───────────────────────────────────────────────────────────────────
36.37 s
> To update snapshots run `cargo insta review`
36.37 s
> Stopped on the first failure. Run `cargo insta test` to run all snapshots.
36.37 s
> test utils::test_utils::normalization ... FAILED
36.37 s
>
36.37 s
> failures:
36.37 s
>
36.37 s
> failures:
36.37 s
> utils::test_utils::normalization
36.37 s
>
36.37 s
> test result: FAILED. 0 passed; 1 failed; 0 ignored; 0 measured; 445 filtered out; finished in 0.04s
36.37 s
>
36.37 s
> stderr ---
36.37 s
>
36.37 s
> thread 'utils::test_utils::normalization' (2240) panicked at /nix/store/c7lwckzlfrfsdw1ay0aqz4dpc2j7ry8d-vendor-cargo-deps/c19b7c6f923b580ac259164a89f2577984ad5ab09ee9d583b888f934adbbe8d0/insta-1.47.2/src/runtime.rs:719:13:
36.37 s
> snapshot assertion for 'normalization-2' failed in line 44
36.37 s
> stack backtrace:
36.37 s
> 0: __rustc::rust_begin_unwind
36.37 s
> 1: core::panicking::panic_fmt
36.37 s
> 2: insta::runtime::assert_snapshot
36.37 s
> 3: gammalooprs::utils::test_utils::normalization
36.37 s
> 4: <gammalooprs::utils::test_utils::normalization::{closure#0} as core::ops::function::FnOnce<()>>::call_once
36.37 s
> note: Some details are omitted, run with `RUST_BACKTRACE=full` for a verbose backtrace.
36.37 s
>
36.37 s
> error : test run failed
36.37 s
>
36.37 s
> ========== nextest test summary ==========
36.37 s
> report: target/nextest/ci_gammaloop/junit.xml
36.37 s
> tests: 421, failures: 1, errors: 0
36.37 s
>
36.37 s
> 1. gammalooprs::utils::test_utils::normalization
36.37 s
> failure: test failure with exit code 101
36.37 s
> thread 'utils::test_utils::normalization' (2240) panicked at /nix/store/c7lwckzlfrfsdw1ay0aqz4dpc2j7ry8d-vendor-cargo-deps/c19b7c6f923b580ac259164a89f2577984ad5ab09ee9d583b888f934adbbe8d0/insta-1.47.2/src/runtime.rs:719:13:
36.37 s
> snapshot assertion for 'normalization-2' failed in line 44
36.37 s
> stack backtrace:
36.37 s
> 0: __rustc::rust_begin_unwind
36.37 s
> 1: core::panicking::panic_fmt
36.37 s
> 2: insta::runtime::assert_snapshot
36.37 s
> 3: gammalooprs::utils::test_utils::normalization
36.37 s
> 4: <gammalooprs::utils::test_utils::normalization::{closure#0} as core::ops::function::FnOnce<()>>::call_once
36.37 s
> note: Some details are omitted, run with `RUST_BACKTRACE=full` for a verbose backtrace.
36.37 s
> system-out
36.37 s
> running 1 test
36.37 s
> ━━━━━━━━━━━━━━━━━━━━━━━━━━━━━━━ Snapshot Summary ━━━━━━━━━━━━━━━━━━━━━━━━━━━━━━━
36.37 s
> Snapshot: normalization-2
36.37 s
> Source: crates/gammalooprs/src/utils/test_utils.rs:44
36.37 s
> ────────────────────────────────────────────────────────────────────────────────
36.37 s
> Expression: b.to_canonical_string()
36.37 s
> ────────────────────────────────────────────────────────────────────────────────
36.37 s
> -old snapshot
36.37 s
> +new results
36.37 s
> ────────────┬───────────────────────────────────────────────────────────────────
36.37 s
> 1 │-gammalooprs::{spenso::rank1,spenso::tensor}::Q(1,spenso::{}::cind(1))
36.37 s
> 1 │+gammalooprs::{spenso::rank1,spenso::tensor,spenso::tensor-label:q}::Q(1,spenso::{}::cind(1))
36.37 s
> ────────────┴───────────────────────────────────────────────────────────────────
36.37 s
> To update snapshots run `cargo insta review`
36.37 s
> Stopped on the first failure. Run `cargo insta test` to run all snapshots.
36.37 s
> test utils::test_utils::normalization ... FAILED
36.37 s
>
36.37 s
> failures:
36.37 s
>
36.37 s
> failures:
36.37 s
> utils::test_utils::normalization
36.37 s
>
36.37 s
> test result: FAILED. 0 passed; 1 failed; 0 ignored; 0 measured; 445 filtered out; finished in 0.04s
36.37 s
> system-err
36.37 s
> thread 'utils::test_utils::normalization' (2240) panicked at /nix/store/c7lwckzlfrfsdw1ay0aqz4dpc2j7ry8d-vendor-cargo-deps/c19b7c6f923b580ac259164a89f2577984ad5ab09ee9d583b888f934adbbe8d0/insta-1.47.2/src/runtime.rs:719:13:
36.37 s
> snapshot assertion for 'normalization-2' failed in line 44
36.37 s
> stack backtrace:
36.37 s
> 0: __rustc::rust_begin_unwind
36.37 s
> 1: core::panicking::panic_fmt
36.37 s
> 2: insta::runtime::assert_snapshot
36.37 s
> 3: gammalooprs::utils::test_utils::normalization
36.37 s
> 4: <gammalooprs::utils::test_utils::normalization::{closure#0} as core::ops::function::FnOnce<()>>::call_once
36.37 s
> note: Some details are omitted, run with `RUST_BACKTRACE=full` for a verbose backtrace.
36.37 s
> =========================================
36.37 s
For full logs, run:
36.37 s
nix log /nix/store/0rndpqvn1mhrhym0h67djwsb96dh29hx-gammaloop-nextest-core.drv
36.51 s
[0 built (1 failed ), 1 cRun failed.