test packages.x86_64-linux.nix-ci-check-gammaloop-nextest-feynkit

Reproduce this run
Retry Run
  1. 0.00 s $ /nix/store/61685rbaxmpigwi3z23i33sv3jyfl70q-coreutils-9.11/bin/timeout --kill-after=15s 7200s /nix/store/wknkybkzrc16r11vk5vrykh4wmw7a353-nix-2.34.8/bin/nix --extra-experimental-features nix-command --extra-experimental-features flakes flake clone git+https://github.com/alphal00p/gammaloop --dest /tmp/nix-ci-worker/stable-pwd/repo/
  2. 0.27 s Cloning into '/tmp/nix-ci-worker/stable-pwd/repo'...
  3. 0.99 s remote: Enumerating objects: 103390, done.
  4. 1.10 s remote: Counting objects: 0% (1/10104) remote: Counting objects: 1% (102/10104) remote: Counting objects: 2% (203/10104) remote: Counting objects: 3% (304/10104) remote: Counting objects: 4% (405/10104) remote: Counting objects: 5% (506/10104) remote: Counting objects: 6% (607/10104) remote: Counting objects: 7% (708/10104) remote: Counting objects: 8% (809/10104) remote: Counting objects: 9% (910/10104) remote: Counting objects: 10% (1011/10104) remote: Counting objects: 11% (1112/10104) remote: Counting objects: 12% (1213/10104) remote: Counting objects: 13% (1314/10104) remote: Counting objects: 14% (1415/10104) remote: Counting objects: 15% (1516/10104) remote: Counting objects: 16% (1617/10104) remote: Counting objects: 17% (1718/10104) remote: Counting objects: 18% (1819/10104) remote: Counting objects: 19% (1920/10104) remote: Counting objects: 20% (2021/10104) remote: Counting objects: 21% (2122/10104) remote: Counting objects: 22% (2223/10104) remote: Counting objects: 23% (2324/10104) remote: Counting objects: 24% (2425/10104) remote: Counting objects: 25% (2526/10104) remote: Counting objects: 26% (2628/10104) remote: Counting objects: 27% (2729/10104) remote: Counting objects: 28% (2830/10104) remote: Counting objects: 29% (2931/10104) remote: Counting objects: 30% (3032/10104) remote: Counting objects: 31% (3133/10104) remote: Counting objects: 32% (3234/10104) remote: Counting objects: 33% (3335/10104) remote: Counting objects: 34% (3436/10104) remote: Counting objects: 35% (3537/10104) remote: Counting objects: 36% (3638/10104) remote: Counting objects: 37% (3739/10104) remote: Counting objects: 38% (3840/10104) remote: Counting objects: 39% (3941/10104) remote: Counting objects: 40% (4042/10104) remote: Counting objects: 41% (4143/10104) remote: Counting objects: 42% (4244/10104) remote: Counting objects: 43% (4345/10104) remote: Counting objects: 44% (4446/10104) remote: Counting objects: 45% (4547/10104) remote: Counting objects: 46% (4648/10104) remote: Counting objects: 47% (4749/10104) remote: Counting objects: 48% (4850/10104) remote: Counting objects: 49% (4951/10104) remote: Counting objects: 50% (5052/10104) remote: Counting objects: 51% (5154/10104) remote: Counting objects: 52% (5255/10104) remote: Counting objects: 53% (5356/10104) remote: Counting objects: 54% (5457/10104) remote: Counting objects: 55% (5558/10104) remote: Counting objects: 56% (5659/10104) remote: Counting objects: 57% (5760/10104) remote: Counting objects: 58% (5861/10104) remote: Counting objects: 59% (5962/10104) remote: Counting objects: 60% (6063/10104) remote: Counting objects: 61% (6164/10104) remote: Counting objects: 62% (6265/10104) remote: Counting objects: 63% (6366/10104) remote: Counting objects: 64% (6467/10104) remote: Counting objects: 65% (6568/10104) remote: Counting objects: 66% (6669/10104) remote: Counting objects: 67% (6770/10104) remote: Counting objects: 68% (6871/10104) remote: Counting objects: 69% (6972/10104) remote: Counting objects: 70% (7073/10104) remote: Counting objects: 71% (7174/10104) remote: Counting objects: 72% (7275/10104) remote: Counting objects: 73% (7376/10104) remote: Counting objects: 74% (7477/10104) remote: Counting objects: 75% (7578/10104) remote: Counting objects: 76% (7680/10104) remote: Counting objects: 77% (7781/10104) remote: Counting objects: 78% (7882/10104) remote: Counting objects: 79% (7983/10104) remote: Counting objects: 80% (8084/10104) remote: Counting objects: 81% (8185/10104) remote: Counting objects: 82% (8286/10104) remote: Counting objects: 83% (8387/10104) remote: Counting objects: 84% (8488/10104) remote: Counting objects: 85% (8589/10104) remote: Counting objects: 86% (8690/10104) remote: Counting objects: 87% (8791/10104) remote: Counting objects: 88% (8892/10104) remote: Counting objects: 89% (8993/10104) remote: Counting objects: 90% (9094/10104) remote: Counting objects: 91% (9195/10104) remote: Counting objects: 92% (9296/10104) remote: Counting objects: 93% (9397/10104) remote: Counting objects: 94% (9498/10104) remote: Counting objects: 95% (9599/10104) remote: Counting objects: 96% (9700/10104) remote: Counting objects: 97% (9801/10104) remote: Counting objects: 98% (9902/10104) remote: Counting objects: 99% (10003/10104) remote: Counting objects: 100% (10104/10104) remote: Counting objects: 100% (10104/10104), done.
  5. 3.26 s remote: Compressing objects: 0% (1/2250) remote: Compressing objects: 1% (23/2250) remote: Compressing objects: 2% (45/2250) remote: Compressing objects: 3% (68/2250) remote: Compressing objects: 4% (90/2250) remote: Compressing objects: 5% (113/2250) remote: Compressing objects: 6% (135/2250) remote: Compressing objects: 7% (158/2250) remote: Compressing objects: 8% (180/2250) remote: Compressing objects: 9% (203/2250) remote: Compressing objects: 9% (217/2250) remote: Compressing objects: 10% (225/2250) remote: Compressing objects: 11% (248/2250) remote: Compressing objects: 12% (270/2250) remote: Compressing objects: 13% (293/2250) remote: Compressing objects: 14% (315/2250) remote: Compressing objects: 15% (338/2250) remote: Compressing objects: 16% (360/2250) remote: Compressing objects: 17% (383/2250) remote: Compressing objects: 18% (405/2250) remote: Compressing objects: 19% (428/2250) remote: Compressing objects: 20% (450/2250) remote: Compressing objects: 21% (473/2250) remote: Compressing objects: 22% (495/2250) remote: Compressing objects: 23% (518/2250) remote: Compressing objects: 23% (523/2250) remote: Compressing objects: 24% (540/2250) remote: Compressing objects: 25% (563/2250) remote: Compressing objects: 26% (585/2250) remote: Compressing objects: 27% (608/2250) remote: Compressing objects: 28% (630/2250) remote: Compressing objects: 29% (653/2250) remote: Compressing objects: 30% (675/2250) remote: Compressing objects: 31% (698/2250) remote: Compressing objects: 32% (720/2250) remote: Compressing objects: 33% (743/2250) remote: Compressing objects: 34% (765/2250) remote: Compressing objects: 35% (788/2250) remote: Compressing objects: 36% (810/2250) remote: Compressing objects: 37% (833/2250) remote: Compressing objects: 38% (855/2250) remote: Compressing objects: 39% (878/2250) remote: Compressing objects: 40% (900/2250) remote: Compressing objects: 41% (923/2250) remote: Compressing objects: 42% (945/2250) remote: Compressing objects: 43% (968/2250) remote: Compressing objects: 44% (990/2250) remote: Compressing objects: 45% (1013/2250) remote: Compressing objects: 46% (1035/2250) remote: Compressing objects: 47% (1058/2250) remote: Compressing objects: 48% (1080/2250) remote: Compressing objects: 49% (1103/2250) remote: Compressing objects: 50% (1125/2250) remote: Compressing objects: 51% (1148/2250) remote: Compressing objects: 52% (1170/2250) remote: Compressing objects: 53% (1193/2250) remote: Compressing objects: 54% (1215/2250) remote: Compressing objects: 55% (1238/2250) remote: Compressing objects: 56% (1260/2250) remote: Compressing objects: 57% (1283/2250) remote: Compressing objects: 58% (1305/2250) remote: Compressing objects: 59% (1328/2250) remote: Compressing objects: 60% (1350/2250) remote: Compressing objects: 61% (1373/2250) remote: Compressing objects: 62% (1395/2250) remote: Compressing objects: 63% (1418/2250) remote: Compressing objects: 64% (1440/2250) remote: Compressing objects: 65% (1463/2250) remote: Compressing objects: 66% (1485/2250) remote: Compressing objects: 67% (1508/2250) remote: Compressing objects: 68% (1530/2250) remote: Compressing objects: 69% (1553/2250) remote: Compressing objects: 70% (1575/2250) remote: Compressing objects: 71% (1598/2250) remote: Compressing objects: 72% (1620/2250) remote: Compressing objects: 73% (1643/2250) remote: Compressing objects: 74% (1665/2250) remote: Compressing objects: 75% (1688/2250) remote: Compressing objects: 76% (1710/2250) remote: Compressing objects: 77% (1733/2250) remote: Compressing objects: 78% (1755/2250) remote: Compressing objects: 79% (1778/2250) remote: Compressing objects: 80% (1800/2250) remote: Compressing objects: 81% (1823/2250) remote: Compressing objects: 82% (1845/2250) remote: Compressing objects: 83% (1868/2250) remote: Compressing objects: 84% (1890/2250) remote: Compressing objects: 85% (1913/2250) remote: Compressing objects: 86% (1935/2250) remote: Compressing objects: 87% (1958/2250) remote: Compressing objects: 88% (1980/2250) remote: Compressing objects: 89% (2003/2250) remote: Compressing objects: 90% (2025/2250) remote: Compressing objects: 91% (2048/2250) remote: Compressing objects: 92% (2070/2250) remote: Compressing objects: 93% (2093/2250) remote: Compressing objects: 94% (2115/2250) remote: Compressing objects: 95% (2138/2250) remote: Compressing objects: 96% (2160/2250) remote: Compressing objects: 97% (2183/2250) remote: Compressing objects: 98% (2205/2250) remote: Compressing objects: 99% (2228/2250) remote: Compressing objects: 100% (2250/2250) remote: Compressing objects: 100% (2250/2250), done.
  6. 15.35 s Receiving objects: 0% (1/103390) Receiving objects: 1% (1034/103390) Receiving objects: 2% (2068/103390) Receiving objects: 3% (3102/103390) Receiving objects: 4% (4136/103390) Receiving objects: 5% (5170/103390) Receiving objects: 6% (6204/103390) Receiving objects: 7% (7238/103390), 13.91 MiB | 27.80 MiB/s Receiving objects: 8% (8272/103390), 13.91 MiB | 27.80 MiB/s Receiving objects: 9% (9306/103390), 13.91 MiB | 27.80 MiB/s Receiving objects: 10% (10339/103390), 13.91 MiB | 27.80 MiB/s Receiving objects: 11% (11373/103390), 13.91 MiB | 27.80 MiB/s Receiving objects: 12% (12407/103390), 13.91 MiB | 27.80 MiB/s Receiving objects: 13% (13441/103390), 13.91 MiB | 27.80 MiB/s Receiving objects: 14% (14475/103390), 13.91 MiB | 27.80 MiB/s Receiving objects: 15% (15509/103390), 13.91 MiB | 27.80 MiB/s Receiving objects: 16% (16543/103390), 13.91 MiB | 27.80 MiB/s Receiving objects: 17% (17577/103390), 13.91 MiB | 27.80 MiB/s Receiving objects: 18% (18611/103390), 13.91 MiB | 27.80 MiB/s Receiving objects: 19% (19645/103390), 13.91 MiB | 27.80 MiB/s Receiving objects: 20% (20678/103390), 13.91 MiB | 27.80 MiB/s Receiving objects: 21% (21712/103390), 13.91 MiB | 27.80 MiB/s Receiving objects: 22% (22746/103390), 13.91 MiB | 27.80 MiB/s Receiving objects: 23% (23780/103390), 13.91 MiB | 27.80 MiB/s Receiving objects: 24% (24814/103390), 13.91 MiB | 27.80 MiB/s Receiving objects: 25% (25848/103390), 13.91 MiB | 27.80 MiB/s Receiving objects: 26% (26882/103390), 13.91 MiB | 27.80 MiB/s Receiving objects: 27% (27916/103390), 13.91 MiB | 27.80 MiB/s Receiving objects: 28% (28950/103390), 13.91 MiB | 27.80 MiB/s Receiving objects: 29% (29984/103390), 13.91 MiB | 27.80 MiB/s Receiving objects: 30% (31017/103390), 13.91 MiB | 27.80 MiB/s Receiving objects: 31% (32051/103390), 13.91 MiB | 27.80 MiB/s Receiving objects: 32% (33085/103390), 13.91 MiB | 27.80 MiB/s Receiving objects: 33% (34119/103390), 13.91 MiB | 27.80 MiB/s Receiving objects: 33% (34171/103390), 34.98 MiB | 34.98 MiB/s Receiving objects: 34% (35153/103390), 34.98 MiB | 34.98 MiB/s Receiving objects: 35% (36187/103390), 34.98 MiB | 34.98 MiB/s Receiving objects: 36% (37221/103390), 34.98 MiB | 34.98 MiB/s Receiving objects: 37% (38255/103390), 34.98 MiB | 34.98 MiB/s Receiving objects: 38% (39289/103390), 34.98 MiB | 34.98 MiB/s Receiving objects: 39% (40323/103390), 34.98 MiB | 34.98 MiB/s Receiving objects: 40% (41356/103390), 34.98 MiB | 34.98 MiB/s Receiving objects: 41% (42390/103390), 34.98 MiB | 34.98 MiB/s Receiving objects: 42% (43424/103390), 50.86 MiB | 33.90 MiB/s Receiving objects: 43% (44458/103390), 50.86 MiB | 33.90 MiB/s Receiving objects: 44% (45492/103390), 50.86 MiB | 33.90 MiB/s Receiving objects: 45% (46526/103390), 50.86 MiB | 33.90 MiB/s Receiving objects: 46% (47560/103390), 50.86 MiB | 33.90 MiB/s Receiving objects: 47% (48594/103390), 50.86 MiB | 33.90 MiB/s Receiving objects: 47% (48998/103390), 67.58 MiB | 33.78 MiB/s Receiving objects: 48% (49628/103390), 67.58 MiB | 33.78 MiB/s Receiving objects: 49% (50662/103390), 67.58 MiB | 33.78 MiB/s Receiving objects: 50% (51695/103390), 67.58 MiB | 33.78 MiB/s Receiving objects: 51% (52729/103390), 67.58 MiB | 33.78 MiB/s Receiving objects: 52% (53763/103390), 67.58 MiB | 33.78 MiB/s Receiving objects: 53% (54797/103390), 67.58 MiB | 33.78 MiB/s Receiving objects: 54% (55831/103390), 67.58 MiB | 33.78 MiB/s Receiving objects: 55% (56865/103390), 67.58 MiB | 33.78 MiB/s Receiving objects: 56% (57899/103390), 84.41 MiB | 33.59 MiB/s Receiving objects: 57% (58933/103390), 84.41 MiB | 33.59 MiB/s Receiving objects: 58% (59967/103390), 84.41 MiB | 33.59 MiB/s Receiving objects: 58% (60495/103390), 100.67 MiB | 33.42 MiB/s Receiving objects: 59% (61001/103390), 100.67 MiB | 33.42 MiB/s Receiving objects: 60% (62034/103390), 100.67 MiB | 33.42 MiB/s Receiving objects: 61% (63068/103390), 100.67 MiB | 33.42 MiB/s Receiving objects: 61% (64057/103390), 117.94 MiB | 33.58 MiB/s Receiving objects: 62% (64102/103390), 134.36 MiB | 33.49 MiB/s Receiving objects: 63% (65136/103390), 150.77 MiB | 33.42 MiB/s Receiving objects: 63% (66022/103390), 168.77 MiB | 34.32 MiB/s Receiving objects: 63% (66050/103390), 184.46 MiB | 33.13 MiB/s Receiving objects: 64% (66170/103390), 218.79 MiB | 33.52 MiB/s Receiving objects: 64% (66171/103390), 234.89 MiB | 33.45 MiB/s Receiving objects: 64% (66295/103390), 251.43 MiB | 33.50 MiB/s Receiving objects: 65% (67204/103390), 282.99 MiB | 33.03 MiB/s Receiving objects: 66% (68238/103390), 282.99 MiB | 33.03 MiB/s Receiving objects: 66% (68957/103390), 297.82 MiB | 32.31 MiB/s Receiving objects: 67% (69272/103390), 297.82 MiB | 32.31 MiB/s Receiving objects: 68% (70306/103390), 297.82 MiB | 32.31 MiB/s Receiving objects: 69% (71340/103390), 297.82 MiB | 32.31 MiB/s Receiving objects: 70% (72373/103390), 297.82 MiB | 32.31 MiB/s Receiving objects: 71% (73407/103390), 297.82 MiB | 32.31 MiB/s Receiving objects: 72% (74441/103390), 316.06 MiB | 32.36 MiB/s Receiving objects: 73% (75475/103390), 316.06 MiB | 32.36 MiB/s Receiving objects: 74% (76509/103390), 316.06 MiB | 32.36 MiB/s Receiving objects: 75% (77543/103390), 316.06 MiB | 32.36 MiB/s Receiving objects: 76% (78577/103390), 316.06 MiB | 32.36 MiB/s Receiving objects: 77% (79611/103390), 316.06 MiB | 32.36 MiB/s Receiving objects: 78% (80645/103390), 316.06 MiB | 32.36 MiB/s Receiving objects: 79% (81679/103390), 316.06 MiB | 32.36 MiB/s Receiving objects: 79% (82121/103390), 316.06 MiB | 32.36 MiB/s Receiving objects: 80% (82712/103390), 327.41 MiB | 31.41 MiB/s Receiving objects: 81% (83746/103390), 327.41 MiB | 31.41 MiB/s Receiving objects: 82% (84780/103390), 327.41 MiB | 31.41 MiB/s Receiving objects: 83% (85814/103390), 342.69 MiB | 31.13 MiB/s Receiving objects: 83% (86113/103390), 342.69 MiB | 31.13 MiB/s Receiving objects: 84% (86848/103390), 359.58 MiB | 30.93 MiB/s Receiving objects: 85% (87882/103390), 359.58 MiB | 30.93 MiB/s Receiving objects: 86% (88916/103390), 359.58 MiB | 30.93 MiB/s Receiving objects: 87% (89950/103390), 359.58 MiB | 30.93 MiB/s Receiving objects: 88% (90984/103390), 359.58 MiB | 30.93 MiB/s Receiving objects: 89% (92018/103390), 375.58 MiB | 30.66 MiB/s Receiving objects: 90% (93051/103390), 375.58 MiB | 30.66 MiB/s Receiving objects: 91% (94085/103390), 375.58 MiB | 30.66 MiB/s Receiving objects: 92% (95119/103390), 375.58 MiB | 30.66 MiB/s Receiving objects: 93% (96153/103390), 375.58 MiB | 30.66 MiB/s Receiving objects: 94% (97187/103390), 375.58 MiB | 30.66 MiB/s Receiving objects: 95% (98221/103390), 375.58 MiB | 30.66 MiB/s Receiving objects: 96% (99255/103390), 375.58 MiB | 30.66 MiB/s Receiving objects: 97% (100289/103390), 375.58 MiB | 30.66 MiB/s Receiving objects: 98% (101323/103390), 375.58 MiB | 30.66 MiB/s Receiving objects: 98% (102063/103390), 375.58 MiB | 30.66 MiB/s Receiving objects: 99% (102357/103390), 375.58 MiB | 30.66 MiB/s remote: Total 103390 (delta 8622), reused 8039 (delta 7829), pack-reused 93286 (from 4)
  7. 15.35 s Receiving objects: 100% (103390/103390), 375.58 MiB | 30.66 MiB/s Receiving objects: 100% (103390/103390), 391.81 MiB | 32.41 MiB/s, done.
  8. 16.61 s Resolving deltas: 0% (0/67724) Resolving deltas: 1% (680/67724) Resolving deltas: 2% (1355/67724) Resolving deltas: 3% (2032/67724) Resolving deltas: 4% (2709/67724) Resolving deltas: 5% (3387/67724) Resolving deltas: 6% (4064/67724) Resolving deltas: 7% (4742/67724) Resolving deltas: 8% (5418/67724) Resolving deltas: 9% (6096/67724) Resolving deltas: 10% (6773/67724) Resolving deltas: 11% (7450/67724) Resolving deltas: 12% (8127/67724) Resolving deltas: 13% (8805/67724) Resolving deltas: 14% (9482/67724) Resolving deltas: 15% (10159/67724) Resolving deltas: 16% (10836/67724) Resolving deltas: 17% (11514/67724) Resolving deltas: 18% (12192/67724) Resolving deltas: 19% (12868/67724) Resolving deltas: 20% (13546/67724) Resolving deltas: 21% (14223/67724) Resolving deltas: 22% (14900/67724) Resolving deltas: 23% (15577/67724) Resolving deltas: 24% (16256/67724) Resolving deltas: 25% (16931/67724) Resolving deltas: 26% (17609/67724) Resolving deltas: 27% (18286/67724) Resolving deltas: 28% (18963/67724) Resolving deltas: 29% (19640/67724) Resolving deltas: 30% (20318/67724) Resolving deltas: 31% (20996/67724) Resolving deltas: 32% (21672/67724) Resolving deltas: 33% (22350/67724) Resolving deltas: 34% (23027/67724) Resolving deltas: 35% (23705/67724) Resolving deltas: 36% (24381/67724) Resolving deltas: 37% (25058/67724) Resolving deltas: 38% (25736/67724) Resolving deltas: 39% (26413/67724) Resolving deltas: 40% (27090/67724) Resolving deltas: 41% (27767/67724) Resolving deltas: 42% (28445/67724) Resolving deltas: 43% (29122/67724) Resolving deltas: 44% (29799/67724) Resolving deltas: 45% (30476/67724) Resolving deltas: 46% (31154/67724) Resolving deltas: 47% (31831/67724) Resolving deltas: 48% (32508/67724) Resolving deltas: 49% (33185/67724) Resolving deltas: 50% (33862/67724) Resolving deltas: 51% (34540/67724) Resolving deltas: 52% (35217/67724) Resolving deltas: 53% (35895/67724) Resolving deltas: 54% (36571/67724) Resolving deltas: 55% (37249/67724) Resolving deltas: 56% (37926/67724) Resolving deltas: 57% (38603/67724) Resolving deltas: 58% (39280/67724) Resolving deltas: 59% (39959/67724) Resolving deltas: 60% (40635/67724) Resolving deltas: 61% (41314/67724) Resolving deltas: 62% (41989/67724) Resolving deltas: 63% (42667/67724) Resolving deltas: 64% (43344/67724) Resolving deltas: 65% (44021/67724) Resolving deltas: 66% (44698/67724) Resolving deltas: 67% (45376/67724) Resolving deltas: 68% (46053/67724) Resolving deltas: 69% (46731/67724) Resolving deltas: 70% (47410/67724) Resolving deltas: 71% (48085/67724) Resolving deltas: 72% (48762/67724) Resolving deltas: 73% (49440/67724) Resolving deltas: 74% (50116/67724) Resolving deltas: 75% (50793/67724) Resolving deltas: 76% (51471/67724) Resolving deltas: 77% (52148/67724) Resolving deltas: 78% (52825/67724) Resolving deltas: 79% (53502/67724) Resolving deltas: 79% (54176/67724) Resolving deltas: 80% (54180/67724) Resolving deltas: 81% (54857/67724) Resolving deltas: 82% (55534/67724) Resolving deltas: 83% (56211/67724) Resolving deltas: 84% (56889/67724) Resolving deltas: 85% (57566/67724) Resolving deltas: 86% (58243/67724) Resolving deltas: 87% (58921/67724) Resolving deltas: 88% (59598/67724) Resolving deltas: 89% (60275/67724) Resolving deltas: 90% (60952/67724) Resolving deltas: 91% (61629/67724) Resolving deltas: 92% (62307/67724) Resolving deltas: 93% (62986/67724) Resolving deltas: 94% (63661/67724) Resolving deltas: 95% (64338/67724) Resolving deltas: 96% (65016/67724) Resolving deltas: 97% (65693/67724) Resolving deltas: 98% (66372/67724) Resolving deltas: 99% (67047/67724) Resolving deltas: 100% (67724/67724) Resolving deltas: 100% (67724/67724), done.
  9. 17.46 s Fetching commit 0afa8ad228d762fc4c781c8dbec2e17f2eb2f1c6 for feynkit ...
  10. 17.46 s $ /nix/store/5vpcfsdx1lcnlb2y4k7xyc74shp5qwbh-git-2.54.0/bin/git fetch origin 0afa8ad228d762fc4c781c8dbec2e17f2eb2f1c6
  11. 17.99 s From https://github.com/alphal00p/gammaloop
  12. 17.99 s * branch 0afa8ad228d762fc4c781c8dbec2e17f2eb2f1c6 -> FETCH_HEAD
  13. 18.00 s $ /nix/store/61685rbaxmpigwi3z23i33sv3jyfl70q-coreutils-9.11/bin/timeout --kill-after=15s 7200s /nix/store/5vpcfsdx1lcnlb2y4k7xyc74shp5qwbh-git-2.54.0/bin/git -c advice.detachedHead=false checkout 0afa8ad228d762fc4c781c8dbec2e17f2eb2f1c6
  14. 18.26 s HEAD is now at 0afa8ad22 align generation defaults and avoid repeated numerator expansion
  15. 18.26 s $ /nix/store/61685rbaxmpigwi3z23i33sv3jyfl70q-coreutils-9.11/bin/timeout --kill-after=15s 7200s /nix/store/wknkybkzrc16r11vk5vrykh4wmw7a353-nix-2.34.8/bin/nix --extra-experimental-features nix-command --extra-experimental-features flakes --log-format internal-json run .#packages.x86_64-linux.nix-ci-check-gammaloop-nextest-feynkit --print-build-logs
  16. 18.36 s warning: ignoring untrusted flake configuration setting 'extra-substituters'.
  17. 18.36 s Pass '--accept-flake-config' to trust it
  18. 18.36 s warning: ignoring untrusted flake configuration setting 'extra-trusted-public-keys'.
  19. 18.36 s Pass '--accept-flake-config' to trust it
  20. 23.41 s
  21. 23.68 s do you want to allow configuration setting 'extra-substituters' to be set to 'https://cache.nix-ci.com' (y/N)? do you want to permanently mark this value as untrusted (y/N)? warning: ignoring untrusted flake configuration setting 'extra-substituters'.
  22. 23.68 s Pass '--accept-flake-config' to trust it
  23. 23.68 s evaluating derivation 'gdo you want to allow configuration setting 'extra-trusted-public-keys' to be set to 'nix-ci:g3xV5BDTLtIBZr/A00IU1x0EtKKlb7YLgBN2SgYgM6A=' (y/N)? do you want to permanently mark this value as untrusted (y/N)? warning: ignoring untrusted flake configuration setting 'extra-trusted-public-keys'.
  24. 23.68 s Pass '--accept-flake-config' to trust it
  25. 30.45 s copying '/nix/store/s70x evaluating derivation 'g copying '/nix/store/s70x evaluating derivation 'g copying '/nix/store/s70x evaluating derivation 'g copying '/nix/store/s70x evaluating derivation 'g copying '/nix/store/s70x evaluating derivation 'g copying '/nix/store/s70x evaluating derivation 'g copying '/nix/store/s70x evaluating derivation 'g querying gammaloop-nexte [0.0 KiB DL] querying in [0/1 built, 0.0 KiB DL] [1/0/1 built, 0.0 KiB DLgammaloop-nextest-feynkit> Extracting 1 binary and 2 linked paths to /build/source
  26. 30.53 s gammaloop-nextest-feynkit> Extracted 15 files to /build/source in 0.08s
  27. 30.57 s gammaloop-nextest-feynkit> ------------
  28. 30.57 s gammaloop-nextest-feynkit> Nextest run ID e79437d7-9bec-4635-bd82-6de0aa97d3b6 with nextest profile: ci_gammaloop
  29. 30.57 s gammaloop-nextest-feynkit> Starting 1 test across 1 binary
  30. 30.60 s gammaloop-nextest-feynkit> ------------
  31. 30.60 s gammaloop-nextest-feynkit> Summary [ 0.032s] 1 test run: 1 passed, 0 skipped
  32. 30.74 s gammaloop-nextest-feynkit>
  33. 30.74 s gammaloop-nextest-feynkit> ========== nextest test summary ==========
  34. 30.74 s gammaloop-nextest-feynkit> report: target/nextest/ci_gammaloop/junit.xml
  35. 30.74 s gammaloop-nextest-feynkit> tests: 1, failures: 0, errors: 0
  36. 30.74 s gammaloop-nextest-feynkit> No failing testcases found.
  37. 30.74 s gammaloop-nextest-feynkit> =========================================
  38. 30.76 s gammaloop-nextest-feynkit> Extracting 1 binary and 2 linked paths to /build/source
  39. 30.85 s gammaloop-nextest-feynkit> Extracted 15 files to /build/source in 0.09s
  40. 30.88 s gammaloop-nextest-feynkit> ------------
  41. 30.88 s gammaloop-nextest-feynkit> Nextest run ID a9bebbc4-5fe1-4900-b98a-45fa6f3a0c81 with nextest profile: ci_gammaloop
  42. 30.88 s gammaloop-nextest-feynkit> Starting 33 tests across 1 binary
  43. 30.99 s gammaloop-nextest-feynkit> ------------
  44. 30.99 s gammaloop-nextest-feynkit> Summary [ 0.105s] 33 tests run: 33 passed, 0 skipped
  45. 31.03 s gammaloop-nextest-feynkit>
  46. 31.03 s gammaloop-nextest-feynkit> ========== nextest test summary ==========
  47. 31.03 s gammaloop-nextest-feynkit> report: target/nextest/ci_gammaloop/junit.xml
  48. 31.03 s gammaloop-nextest-feynkit> tests: 33, failures: 0, errors: 0
  49. 31.03 s gammaloop-nextest-feynkit> No failing testcases found.
  50. 31.03 s gammaloop-nextest-feynkit> =========================================
  51. 31.05 s gammaloop-nextest-feynkit> Extracting 2 binaries and 2 linked paths to /build/source
  52. 31.20 s gammaloop-nextest-feynkit> Extracted 16 files to /build/source in 0.16s
  53. 31.25 s gammaloop-nextest-feynkit> ------------
  54. 31.25 s gammaloop-nextest-feynkit> Nextest run ID eec8202e-2c03-481b-851e-6007295f9842 with nextest profile: ci_gammaloop
  55. 31.25 s gammaloop-nextest-feynkit> Starting 60 tests across 2 binaries
  56. 31.36 s gammaloop-nextest-feynkit> ------------
  57. 31.36 s gammaloop-nextest-feynkit> Summary [ 0.109s] 60 tests run: 60 passed, 0 skipped
  58. 31.41 s gammaloop-nextest-feynkit>
  59. 31.41 s gammaloop-nextest-feynkit> ========== nextest test summary ==========
  60. 31.41 s gammaloop-nextest-feynkit> report: target/nextest/ci_gammaloop/junit.xml
  61. 31.41 s gammaloop-nextest-feynkit> tests: 60, failures: 0, errors: 0
  62. 31.41 s gammaloop-nextest-feynkit> No failing testcases found.
  63. 31.41 s gammaloop-nextest-feynkit> =========================================
  64. 31.44 s gammaloop-nextest-feynkit> Extracting 1 binary and 2 linked paths to /build/source
  65. 31.53 s gammaloop-nextest-feynkit> Extracted 15 files to /build/source in 0.09s
  66. 31.57 s gammaloop-nextest-feynkit> ------------
  67. 31.57 s gammaloop-nextest-feynkit> Nextest run ID 384ab7ec-50ee-4653-a5b0-117f7aca6bb0 with nextest profile: ci_gammaloop
  68. 31.57 s gammaloop-nextest-feynkit> Starting 28 tests across 1 binary
  69. 31.64 s gammaloop-nextest-feynkit> ------------
  70. 31.64 s gammaloop-nextest-feynkit> Summary [ 0.068s] 28 tests run: 28 passed, 0 skipped
  71. 31.69 s gammaloop-nextest-feynkit>
  72. 31.69 s gammaloop-nextest-feynkit> ========== nextest test summary ==========
  73. 31.69 s gammaloop-nextest-feynkit> report: target/nextest/ci_gammaloop/junit.xml
  74. 31.69 s gammaloop-nextest-feynkit> tests: 28, failures: 0, errors: 0
  75. 31.69 s gammaloop-nextest-feynkit> No failing testcases found.
  76. 31.69 s gammaloop-nextest-feynkit> =========================================
  77. 31.72 s gammaloop-nextest-feynkit> Extracting 1 binary and 1 linked path to /build/source
  78. 31.84 s gammaloop-nextest-feynkit> Extracted 7 files to /build/source in 0.13s
  79. 31.87 s gammaloop-nextest-feynkit> ------------
  80. 31.87 s gammaloop-nextest-feynkit> Nextest run ID 75609059-5848-4836-a457-2b15fccfad68 with nextest profile: ci_gammaloop
  81. 31.87 s gammaloop-nextest-feynkit> Starting 21 tests across 1 binary
  82. 31.93 s gammaloop-nextest-feynkit> ------------
  83. 31.93 s gammaloop-nextest-feynkit> Summary [ 0.056s] 21 tests run: 21 passed, 0 skipped
  84. 31.99 s gammaloop-nextest-feynkit>
  85. 31.99 s gammaloop-nextest-feynkit> ========== nextest test summary ==========
  86. 31.99 s gammaloop-nextest-feynkit> report: target/nextest/ci_gammaloop/junit.xml
  87. 31.99 s gammaloop-nextest-feynkit> tests: 21, failures: 0, errors: 0
  88. 31.99 s gammaloop-nextest-feynkit> No failing testcases found.
  89. 31.99 s gammaloop-nextest-feynkit> =========================================
  90. 32.03 s gammaloop-nextest-feynkit> Extracting 2 binaries and 2 linked paths to /build/source
  91. 32.21 s gammaloop-nextest-feynkit> Extracted 16 files to /build/source in 0.19s
  92. 32.23 s gammaloop-nextest-feynkit> ------------
  93. 32.24 s gammaloop-nextest-feynkit> Nextest run ID ae42f38b-0632-4c96-831c-268568e1ff86 with nextest profile: ci_gammaloop
  94. 32.24 s gammaloop-nextest-feynkit> Starting 14 tests across 2 binaries
  95. 32.28 s gammaloop-nextest-feynkit> ------------
  96. 32.28 s gammaloop-nextest-feynkit> Summary [ 0.043s] 14 tests run: 14 passed, 0 skipped
  97. 32.33 s gammaloop-nextest-feynkit>
  98. 32.33 s gammaloop-nextest-feynkit> ========== nextest test summary ==========
  99. 32.33 s gammaloop-nextest-feynkit> report: target/nextest/ci_gammaloop/junit.xml
  100. 32.33 s gammaloop-nextest-feynkit> tests: 14, failures: 0, errors: 0
  101. 32.33 s gammaloop-nextest-feynkit> No failing testcases found.
  102. 32.33 s gammaloop-nextest-feynkit> =========================================
  103. 32.36 s gammaloop-nextest-feynkit> Extracting 5 binaries (including 3 non-test binaries) and 2 linked paths to /build/source
  104. 33.05 s gammaloop-nextest-feynkit> Extracted 22 files to /build/source in 0.70s
  105. 33.10 s gammaloop-nextest-feynkit> ------------
  106. 33.10 s gammaloop-nextest-feynkit> Nextest run ID 73a9523b-6e5a-4cda-a54d-ee6959fdbc9d with nextest profile: ci_gammaloop
  107. 33.10 s gammaloop-nextest-feynkit> Starting 15 tests across 2 binaries
  108. 33.23 s gammaloop-nextest-feynkit> FAIL [ 0.120s] (11/15) feynkit-py tests::standalone_python_pipeline_covers_generation_graphs_cff_and_kinematics
  109. 33.23 s gammaloop-nextest-feynkit> stdout ---
  110. 33.23 s gammaloop-nextest-feynkit>
  111. 33.23 s gammaloop-nextest-feynkit> running 1 test
  112. 33.23 s gammaloop-nextest-feynkit> test tests::standalone_python_pipeline_covers_generation_graphs_cff_and_kinematics ... FAILED
  113. 33.23 s gammaloop-nextest-feynkit>
  114. 33.23 s gammaloop-nextest-feynkit> failures:
  115. 33.23 s gammaloop-nextest-feynkit>
  116. 33.23 s gammaloop-nextest-feynkit> failures:
  117. 33.23 s gammaloop-nextest-feynkit> tests::standalone_python_pipeline_covers_generation_graphs_cff_and_kinematics
  118. 33.23 s gammaloop-nextest-feynkit>
  119. 33.23 s gammaloop-nextest-feynkit> test result: FAILED. 0 passed; 1 failed; 0 ignored; 0 measured; 13 filtered out; finished in 0.11s
  120. 33.23 s gammaloop-nextest-feynkit>
  121. 33.23 s gammaloop-nextest-feynkit> stderr ---
  122. 33.23 s gammaloop-nextest-feynkit>
  123. 33.23 s gammaloop-nextest-feynkit> thread 'tests::standalone_python_pipeline_covers_generation_graphs_cff_and_kinematics' (914) panicked at crates/feynkit-py/src/lib.rs:453:57:
  124. 33.23 s gammaloop-nextest-feynkit> called `Result::unwrap()` on an `Err` value: PyErr { type: <class 'AssertionError'>, value: AssertionError(), traceback: Some("Traceback (most recent call last):\n File \"<string>\", line 39, in <module>\n") }
  125. 33.23 s gammaloop-nextest-feynkit> stack backtrace:
  126. 33.23 s gammaloop-nextest-feynkit> 0: __rustc::rust_begin_unwind
  127. 33.23 s gammaloop-nextest-feynkit> 1: core::panicking::panic_fmt
  128. 33.23 s gammaloop-nextest-feynkit> 2: core::result::unwrap_failed
  129. 33.23 s gammaloop-nextest-feynkit> 3: feynkit_py::tests::standalone_python_pipeline_covers_generation_graphs_cff_and_kinematics
  130. 33.23 s gammaloop-nextest-feynkit> 4: <feynkit_py::tests::standalone_python_pipeline_covers_generation_graphs_cff_and_kinematics::{closure#0} as core::ops::function::FnOnce<()>>::call_once
  131. 33.23 s gammaloop-nextest-feynkit> note: Some details are omitted, run with `RUST_BACKTRACE=full` for a verbose backtrace.
  132. 33.23 s gammaloop-nextest-feynkit>
  133. 33.90 s gammaloop-nextest-feynkit> ------------
  134. 33.90 s gammaloop-nextest-feynkit> Summary [ 0.803s] 15 tests run: 14 passed, 1 failed, 0 skipped
  135. 33.90 s gammaloop-nextest-feynkit> FAIL [ 0.120s] (11/15) feynkit-py tests::standalone_python_pipeline_covers_generation_graphs_cff_and_kinematics
  136. 33.90 s gammaloop-nextest-feynkit> stdout ---
  137. 33.90 s gammaloop-nextest-feynkit>
  138. 33.90 s gammaloop-nextest-feynkit> running 1 test
  139. 33.90 s gammaloop-nextest-feynkit> test tests::standalone_python_pipeline_covers_generation_graphs_cff_and_kinematics ... FAILED
  140. 33.90 s gammaloop-nextest-feynkit>
  141. 33.90 s gammaloop-nextest-feynkit> failures:
  142. 33.90 s gammaloop-nextest-feynkit>
  143. 33.90 s gammaloop-nextest-feynkit> failures:
  144. 33.90 s gammaloop-nextest-feynkit> tests::standalone_python_pipeline_covers_generation_graphs_cff_and_kinematics
  145. 33.90 s gammaloop-nextest-feynkit>
  146. 33.90 s gammaloop-nextest-feynkit> test result: FAILED. 0 passed; 1 failed; 0 ignored; 0 measured; 13 filtered out; finished in 0.11s
  147. 33.90 s gammaloop-nextest-feynkit>
  148. 33.90 s gammaloop-nextest-feynkit> stderr ---
  149. 33.90 s gammaloop-nextest-feynkit>
  150. 33.90 s gammaloop-nextest-feynkit> thread 'tests::standalone_python_pipeline_covers_generation_graphs_cff_and_kinematics' (914) panicked at crates/feynkit-py/src/lib.rs:453:57:
  151. 33.90 s gammaloop-nextest-feynkit> called `Result::unwrap()` on an `Err` value: PyErr { type: <class 'AssertionError'>, value: AssertionError(), traceback: Some("Traceback (most recent call last):\n File \"<string>\", line 39, in <module>\n") }
  152. 33.90 s gammaloop-nextest-feynkit> stack backtrace:
  153. 33.90 s gammaloop-nextest-feynkit> 0: __rustc::rust_begin_unwind
  154. 33.90 s gammaloop-nextest-feynkit> 1: core::panicking::panic_fmt
  155. 33.90 s gammaloop-nextest-feynkit> 2: core::result::unwrap_failed
  156. 33.90 s gammaloop-nextest-feynkit> 3: feynkit_py::tests::standalone_python_pipeline_covers_generation_graphs_cff_and_kinematics
  157. 33.90 s gammaloop-nextest-feynkit> 4: <feynkit_py::tests::standalone_python_pipeline_covers_generation_graphs_cff_and_kinematics::{closure#0} as core::ops::function::FnOnce<()>>::call_once
  158. 33.90 s gammaloop-nextest-feynkit> note: Some details are omitted, run with `RUST_BACKTRACE=full` for a verbose backtrace.
  159. 33.90 s gammaloop-nextest-feynkit>
  160. 33.91 s gammaloop-nextest-feynkit> error: test run failed
  161. 33.95 s gammaloop-nextest-feynkit>
  162. 33.95 s gammaloop-nextest-feynkit> ========== nextest test summary ==========
  163. 33.95 s gammaloop-nextest-feynkit> report: target/nextest/ci_gammaloop/junit.xml
  164. 33.95 s gammaloop-nextest-feynkit> tests: 15, failures: 1, errors: 0
  165. 33.95 s gammaloop-nextest-feynkit>
  166. 33.95 s gammaloop-nextest-feynkit> 1. feynkit-py::tests::standalone_python_pipeline_covers_generation_graphs_cff_and_kinematics
  167. 33.95 s gammaloop-nextest-feynkit> failure: test failure with exit code 101
  168. 33.95 s gammaloop-nextest-feynkit> thread 'tests::standalone_python_pipeline_covers_generation_graphs_cff_and_kinematics' (914) panicked at crates/feynkit-py/src/lib.rs:453:57:
  169. 33.95 s gammaloop-nextest-feynkit> called `Result::unwrap()` on an `Err` value: PyErr { type: <class 'AssertionError'>, value: AssertionError(), traceback: Some("Traceback (most recent call last):\n File \"<string>\", line 39, in <module>\n") }
  170. 33.95 s gammaloop-nextest-feynkit> stack backtrace:
  171. 33.95 s gammaloop-nextest-feynkit> 0: __rustc::rust_begin_unwind
  172. 33.95 s gammaloop-nextest-feynkit> 1: core::panicking::panic_fmt
  173. 33.95 s gammaloop-nextest-feynkit> 2: core::result::unwrap_failed
  174. 33.95 s gammaloop-nextest-feynkit> 3: feynkit_py::tests::standalone_python_pipeline_covers_generation_graphs_cff_and_kinematics
  175. 33.95 s gammaloop-nextest-feynkit> 4: <feynkit_py::tests::standalone_python_pipeline_covers_generation_graphs_cff_and_kinematics::{closure#0} as core::ops::function::FnOnce<()>>::call_once
  176. 33.95 s gammaloop-nextest-feynkit> note: Some details are omitted, run with `RUST_BACKTRACE=full` for a verbose backtrace.
  177. 33.95 s gammaloop-nextest-feynkit> system-out
  178. 33.95 s gammaloop-nextest-feynkit> running 1 test
  179. 33.95 s gammaloop-nextest-feynkit> test tests::standalone_python_pipeline_covers_generation_graphs_cff_and_kinematics ... FAILED
  180. 33.95 s gammaloop-nextest-feynkit>
  181. 33.95 s gammaloop-nextest-feynkit> failures:
  182. 33.95 s gammaloop-nextest-feynkit>
  183. 33.95 s gammaloop-nextest-feynkit> failures:
  184. 33.95 s gammaloop-nextest-feynkit> tests::standalone_python_pipeline_covers_generation_graphs_cff_and_kinematics
  185. 33.95 s gammaloop-nextest-feynkit>
  186. 33.95 s gammaloop-nextest-feynkit> test result: FAILED. 0 passed; 1 failed; 0 ignored; 0 measured; 13 filtered out; finished in 0.11s
  187. 33.95 s gammaloop-nextest-feynkit> system-err
  188. 33.95 s gammaloop-nextest-feynkit> thread 'tests::standalone_python_pipeline_covers_generation_graphs_cff_and_kinematics' (914) panicked at crates/feynkit-py/src/lib.rs:453:57:
  189. 33.95 s gammaloop-nextest-feynkit> called `Result::unwrap()` on an `Err` value: PyErr { type: <class 'AssertionError'>, value: AssertionError(), traceback: Some("Traceback (most recent call last):\n File \"<string>\", line 39, in <module>\n") }
  190. 33.95 s gammaloop-nextest-feynkit> stack backtrace:
  191. 33.95 s gammaloop-nextest-feynkit> 0: __rustc::rust_begin_unwind
  192. 33.95 s gammaloop-nextest-feynkit> 1: core::panicking::panic_fmt
  193. 33.95 s gammaloop-nextest-feynkit> 2: core::result::unwrap_failed
  194. 33.95 s gammaloop-nextest-feynkit> 3: feynkit_py::tests::standalone_python_pipeline_covers_generation_graphs_cff_and_kinematics
  195. 33.95 s gammaloop-nextest-feynkit> 4: <feynkit_py::tests::standalone_python_pipeline_covers_generation_graphs_cff_and_kinematics::{closure#0} as core::ops::function::FnOnce<()>>::call_once
  196. 33.95 s gammaloop-nextest-feynkit> note: Some details are omitted, run with `RUST_BACKTRACE=full` for a verbose backtrace.
  197. 33.95 s gammaloop-nextest-feynkit> =========================================
  198. 33.97 s gammaloop-nextest-feynkit> Extracting 1 binary and 2 linked paths to /build/source
  199. 34.09 s gammaloop-nextest-feynkit> Extracted 15 files to /build/source in 0.11s
  200. 34.12 s gammaloop-nextest-feynkit> ------------
  201. 34.12 s gammaloop-nextest-feynkit> Nextest run ID 0395c8fd-4d4d-415b-9b01-96988a72ea8c with nextest profile: ci_gammaloop
  202. 34.12 s gammaloop-nextest-feynkit> Starting 45 tests across 1 binary (1 test skipped)
  203. 34.35 s gammaloop-nextest-feynkit> ------------
  204. 34.35 s gammaloop-nextest-feynkit> Summary [ 0.221s] 45 tests run: 45 passed, 1 skipped
  205. 34.39 s gammaloop-nextest-feynkit>
  206. 34.39 s gammaloop-nextest-feynkit> ========== nextest test summary ==========
  207. 34.39 s gammaloop-nextest-feynkit> report: target/nextest/ci_gammaloop/junit.xml
  208. 34.39 s gammaloop-nextest-feynkit> tests: 45, failures: 0, errors: 0
  209. 34.39 s gammaloop-nextest-feynkit> No failing testcases found.
  210. 34.39 s gammaloop-nextest-feynkit> =========================================
  211. 34.42 s gammaloop-nextest-feynkit> Extracting 1 binary and 2 linked paths to /build/source
  212. 34.51 s gammaloop-nextest-feynkit> Extracted 15 files to /build/source in 0.09s
  213. 34.54 s gammaloop-nextest-feynkit> ------------
  214. 34.54 s gammaloop-nextest-feynkit> Nextest run ID 3fc777b1-aeac-4738-a796-a74a0f8d674c with nextest profile: ci_gammaloop
  215. 34.54 s gammaloop-nextest-feynkit> Starting 2 tests across 1 binary
  216. 34.57 s gammaloop-nextest-feynkit> ------------
  217. 34.57 s gammaloop-nextest-feynkit> Summary [ 0.034s] 2 tests run: 2 passed, 0 skipped
  218. 34.63 s gammaloop-nextest-feynkit>
  219. 34.63 s gammaloop-nextest-feynkit> ========== nextest test summary ==========
  220. 34.63 s gammaloop-nextest-feynkit> report: target/nextest/ci_gammaloop/junit.xml
  221. 34.63 s gammaloop-nextest-feynkit> tests: 2, failures: 0, errors: 0
  222. 34.63 s gammaloop-nextest-feynkit> No failing testcases found.
  223. 34.63 s gammaloop-nextest-feynkit> =========================================
  224. 34.83 s error: Cannot build '/nix/store/pw1sr1820qvjnnlcx6p7zykcgslr2apy-gammaloop-nextest-feynkit.drv'.
  225. 34.83 s Reason: builder failed with exit code 100.
  226. 34.83 s Output paths:
  227. 34.83 s /nix/store/jmhwb0ssy41588g8h1g904h4dx0annx9-gammaloop-nextest-feynkit
  228. 34.83 s Last 199 log lines:
  229. 34.83 s > Extracting 1 binary and 2 linked paths to /build/source
  230. 34.83 s > Extracted 15 files to /build/source in 0.08s
  231. 34.83 s > ------------
  232. 34.83 s > Nextest run ID e79437d7-9bec-4635-bd82-6de0aa97d3b6 with nextest profile: ci_gammaloop
  233. 34.83 s > Starting 1 test across 1 binary
  234. 34.83 s > ------------
  235. 34.83 s > Summary [ 0.032s] 1 test run: 1 passed, 0 skipped
  236. 34.83 s >
  237. 34.83 s > ========== nextest test summary ==========
  238. 34.83 s > report: target/nextest/ci_gammaloop/junit.xml
  239. 34.83 s > tests: 1, failures: 0, errors: 0
  240. 34.83 s > No failing testcases found.
  241. 34.83 s > =========================================
  242. 34.83 s > Extracting 1 binary and 2 linked paths to /build/source
  243. 34.83 s > Extracted 15 files to /build/source in 0.09s
  244. 34.83 s > ------------
  245. 34.83 s > Nextest run ID a9bebbc4-5fe1-4900-b98a-45fa6f3a0c81 with nextest profile: ci_gammaloop
  246. 34.83 s > Starting 33 tests across 1 binary
  247. 34.83 s > ------------
  248. 34.83 s > Summary [ 0.105s] 33 tests run: 33 passed, 0 skipped
  249. 34.83 s >
  250. 34.83 s > ========== nextest test summary ==========
  251. 34.83 s > report: target/nextest/ci_gammaloop/junit.xml
  252. 34.83 s > tests: 33, failures: 0, errors: 0
  253. 34.83 s > No failing testcases found.
  254. 34.83 s > =========================================
  255. 34.83 s > Extracting 2 binaries and 2 linked paths to /build/source
  256. 34.83 s > Extracted 16 files to /build/source in 0.16s
  257. 34.83 s > ------------
  258. 34.83 s > Nextest run ID eec8202e-2c03-481b-851e-6007295f9842 with nextest profile: ci_gammaloop
  259. 34.83 s > Starting 60 tests across 2 binaries
  260. 34.83 s > ------------
  261. 34.83 s > Summary [ 0.109s] 60 tests run: 60 passed, 0 skipped
  262. 34.83 s >
  263. 34.83 s > ========== nextest test summary ==========
  264. 34.83 s > report: target/nextest/ci_gammaloop/junit.xml
  265. 34.83 s > tests: 60, failures: 0, errors: 0
  266. 34.83 s > No failing testcases found.
  267. 34.83 s > =========================================
  268. 34.83 s > Extracting 1 binary and 2 linked paths to /build/source
  269. 34.83 s > Extracted 15 files to /build/source in 0.09s
  270. 34.83 s > ------------
  271. 34.83 s > Nextest run ID 384ab7ec-50ee-4653-a5b0-117f7aca6bb0 with nextest profile: ci_gammaloop
  272. 34.83 s > Starting 28 tests across 1 binary
  273. 34.83 s > ------------
  274. 34.83 s > Summary [ 0.068s] 28 tests run: 28 passed, 0 skipped
  275. 34.83 s >
  276. 34.83 s > ========== nextest test summary ==========
  277. 34.83 s > report: target/nextest/ci_gammaloop/junit.xml
  278. 34.83 s > tests: 28, failures: 0, errors: 0
  279. 34.83 s > No failing testcases found.
  280. 34.83 s > =========================================
  281. 34.83 s > Extracting 1 binary and 1 linked path to /build/source
  282. 34.83 s > Extracted 7 files to /build/source in 0.13s
  283. 34.83 s > ------------
  284. 34.83 s > Nextest run ID 75609059-5848-4836-a457-2b15fccfad68 with nextest profile: ci_gammaloop
  285. 34.83 s > Starting 21 tests across 1 binary
  286. 34.83 s > ------------
  287. 34.83 s > Summary [ 0.056s] 21 tests run: 21 passed, 0 skipped
  288. 34.83 s >
  289. 34.83 s > ========== nextest test summary ==========
  290. 34.83 s > report: target/nextest/ci_gammaloop/junit.xml
  291. 34.83 s > tests: 21, failures: 0, errors: 0
  292. 34.83 s > No failing testcases found.
  293. 34.83 s > =========================================
  294. 34.83 s > Extracting 2 binaries and 2 linked paths to /build/source
  295. 34.83 s > Extracted 16 files to /build/source in 0.19s
  296. 34.83 s > ------------
  297. 34.83 s > Nextest run ID ae42f38b-0632-4c96-831c-268568e1ff86 with nextest profile: ci_gammaloop
  298. 34.83 s > Starting 14 tests across 2 binaries
  299. 34.83 s > ------------
  300. 34.83 s > Summary [ 0.043s] 14 tests run: 14 passed, 0 skipped
  301. 34.83 s >
  302. 34.83 s > ========== nextest test summary ==========
  303. 34.83 s > report: target/nextest/ci_gammaloop/junit.xml
  304. 34.83 s > tests: 14, failures: 0, errors: 0
  305. 34.83 s > No failing testcases found.
  306. 34.83 s > =========================================
  307. 34.83 s > Extracting 5 binaries (including 3 non-test binaries) and 2 linked paths to /build/source
  308. 34.83 s > Extracted 22 files to /build/source in 0.70s
  309. 34.83 s > ------------
  310. 34.83 s > Nextest run ID 73a9523b-6e5a-4cda-a54d-ee6959fdbc9d with nextest profile: ci_gammaloop
  311. 34.83 s > Starting 15 tests across 2 binaries
  312. 34.83 s > FAIL [ 0.120s] (11/15) feynkit-py tests::standalone_python_pipeline_covers_generation_graphs_cff_and_kinematics
  313. 34.83 s > stdout ---
  314. 34.83 s >
  315. 34.83 s > running 1 test
  316. 34.83 s > test tests::standalone_python_pipeline_covers_generation_graphs_cff_and_kinematics ... FAILED
  317. 34.83 s >
  318. 34.83 s > failures:
  319. 34.83 s >
  320. 34.83 s > failures:
  321. 34.83 s > tests::standalone_python_pipeline_covers_generation_graphs_cff_and_kinematics
  322. 34.83 s >
  323. 34.83 s > test result: FAILED. 0 passed; 1 failed; 0 ignored; 0 measured; 13 filtered out; finished in 0.11s
  324. 34.83 s >
  325. 34.83 s > stderr ---
  326. 34.83 s >
  327. 34.83 s > thread 'tests::standalone_python_pipeline_covers_generation_graphs_cff_and_kinematics' (914) panicked at crates/feynkit-py/src/lib.rs:453:57:
  328. 34.83 s > called `Result::unwrap()` on an `Err` value: PyErr { type: <class 'AssertionError'>, value: AssertionError(), traceback: Some("Traceback (most recent call last):\n File \"<string>\", line 39, in <module>\n") }
  329. 34.83 s > stack backtrace:
  330. 34.83 s > 0: __rustc::rust_begin_unwind
  331. 34.83 s > 1: core::panicking::panic_fmt
  332. 34.83 s > 2: core::result::unwrap_failed
  333. 34.83 s > 3: feynkit_py::tests::standalone_python_pipeline_covers_generation_graphs_cff_and_kinematics
  334. 34.83 s > 4: <feynkit_py::tests::standalone_python_pipeline_covers_generation_graphs_cff_and_kinematics::{closure#0} as core::ops::function::FnOnce<()>>::call_once
  335. 34.83 s > note: Some details are omitted, run with `RUST_BACKTRACE=full` for a verbose backtrace.
  336. 34.83 s >
  337. 34.83 s > ------------
  338. 34.83 s > Summary [ 0.803s] 15 tests run: 14 passed, 1 failed, 0 skipped
  339. 34.83 s > FAIL [ 0.120s] (11/15) feynkit-py tests::standalone_python_pipeline_covers_generation_graphs_cff_and_kinematics
  340. 34.83 s > stdout ---
  341. 34.83 s >
  342. 34.83 s > running 1 test
  343. 34.83 s > test tests::standalone_python_pipeline_covers_generation_graphs_cff_and_kinematics ... FAILED
  344. 34.83 s >
  345. 34.83 s > failures:
  346. 34.83 s >
  347. 34.83 s > failures:
  348. 34.83 s > tests::standalone_python_pipeline_covers_generation_graphs_cff_and_kinematics
  349. 34.83 s >
  350. 34.83 s > test result: FAILED. 0 passed; 1 failed; 0 ignored; 0 measured; 13 filtered out; finished in 0.11s
  351. 34.83 s >
  352. 34.83 s > stderr ---
  353. 34.83 s >
  354. 34.83 s > thread 'tests::standalone_python_pipeline_covers_generation_graphs_cff_and_kinematics' (914) panicked at crates/feynkit-py/src/lib.rs:453:57:
  355. 34.83 s > called `Result::unwrap()` on an `Err` value: PyErr { type: <class 'AssertionError'>, value: AssertionError(), traceback: Some("Traceback (most recent call last):\n File \"<string>\", line 39, in <module>\n") }
  356. 34.83 s > stack backtrace:
  357. 34.83 s > 0: __rustc::rust_begin_unwind
  358. 34.83 s > 1: core::panicking::panic_fmt
  359. 34.83 s > 2: core::result::unwrap_failed
  360. 34.83 s > 3: feynkit_py::tests::standalone_python_pipeline_covers_generation_graphs_cff_and_kinematics
  361. 34.83 s > 4: <feynkit_py::tests::standalone_python_pipeline_covers_generation_graphs_cff_and_kinematics::{closure#0} as core::ops::function::FnOnce<()>>::call_once
  362. 34.83 s > note: Some details are omitted, run with `RUST_BACKTRACE=full` for a verbose backtrace.
  363. 34.83 s >
  364. 34.83 s > error: test run failed
  365. 34.83 s >
  366. 34.83 s > ========== nextest test summary ==========
  367. 34.83 s > report: target/nextest/ci_gammaloop/junit.xml
  368. 34.83 s > tests: 15, failures: 1, errors: 0
  369. 34.83 s >
  370. 34.83 s > 1. feynkit-py::tests::standalone_python_pipeline_covers_generation_graphs_cff_and_kinematics
  371. 34.83 s > failure: test failure with exit code 101
  372. 34.83 s > thread 'tests::standalone_python_pipeline_covers_generation_graphs_cff_and_kinematics' (914) panicked at crates/feynkit-py/src/lib.rs:453:57:
  373. 34.83 s > called `Result::unwrap()` on an `Err` value: PyErr { type: <class 'AssertionError'>, value: AssertionError(), traceback: Some("Traceback (most recent call last):\n File \"<string>\", line 39, in <module>\n") }
  374. 34.83 s > stack backtrace:
  375. 34.83 s > 0: __rustc::rust_begin_unwind
  376. 34.83 s > 1: core::panicking::panic_fmt
  377. 34.83 s > 2: core::result::unwrap_failed
  378. 34.83 s > 3: feynkit_py::tests::standalone_python_pipeline_covers_generation_graphs_cff_and_kinematics
  379. 34.83 s > 4: <feynkit_py::tests::standalone_python_pipeline_covers_generation_graphs_cff_and_kinematics::{closure#0} as core::ops::function::FnOnce<()>>::call_once
  380. 34.83 s > note: Some details are omitted, run with `RUST_BACKTRACE=full` for a verbose backtrace.
  381. 34.83 s > system-out
  382. 34.83 s > running 1 test
  383. 34.83 s > test tests::standalone_python_pipeline_covers_generation_graphs_cff_and_kinematics ... FAILED
  384. 34.83 s >
  385. 34.83 s > failures:
  386. 34.83 s >
  387. 34.83 s > failures:
  388. 34.83 s > tests::standalone_python_pipeline_covers_generation_graphs_cff_and_kinematics
  389. 34.83 s >
  390. 34.83 s > test result: FAILED. 0 passed; 1 failed; 0 ignored; 0 measured; 13 filtered out; finished in 0.11s
  391. 34.83 s > system-err
  392. 34.83 s > thread 'tests::standalone_python_pipeline_covers_generation_graphs_cff_and_kinematics' (914) panicked at crates/feynkit-py/src/lib.rs:453:57:
  393. 34.83 s > called `Result::unwrap()` on an `Err` value: PyErr { type: <class 'AssertionError'>, value: AssertionError(), traceback: Some("Traceback (most recent call last):\n File \"<string>\", line 39, in <module>\n") }
  394. 34.83 s > stack backtrace:
  395. 34.83 s > 0: __rustc::rust_begin_unwind
  396. 34.83 s > 1: core::panicking::panic_fmt
  397. 34.83 s > 2: core::result::unwrap_failed
  398. 34.83 s > 3: feynkit_py::tests::standalone_python_pipeline_covers_generation_graphs_cff_and_kinematics
  399. 34.83 s > 4: <feynkit_py::tests::standalone_python_pipeline_covers_generation_graphs_cff_and_kinematics::{closure#0} as core::ops::function::FnOnce<()>>::call_once
  400. 34.83 s > note: Some details are omitted, run with `RUST_BACKTRACE=full` for a verbose backtrace.
  401. 34.83 s > =========================================
  402. 34.83 s > Extracting 1 binary and 2 linked paths to /build/source
  403. 34.83 s > Extracted 15 files to /build/source in 0.11s
  404. 34.83 s > ------------
  405. 34.83 s > Nextest run ID 0395c8fd-4d4d-415b-9b01-96988a72ea8c with nextest profile: ci_gammaloop
  406. 34.83 s > Starting 45 tests across 1 binary (1 test skipped)
  407. 34.83 s > ------------
  408. 34.83 s > Summary [ 0.221s] 45 tests run: 45 passed, 1 skipped
  409. 34.83 s >
  410. 34.83 s > ========== nextest test summary ==========
  411. 34.83 s > report: target/nextest/ci_gammaloop/junit.xml
  412. 34.83 s > tests: 45, failures: 0, errors: 0
  413. 34.83 s > No failing testcases found.
  414. 34.83 s > =========================================
  415. 34.83 s > Extracting 1 binary and 2 linked paths to /build/source
  416. 34.83 s > Extracted 15 files to /build/source in 0.09s
  417. 34.83 s > ------------
  418. 34.83 s > Nextest run ID 3fc777b1-aeac-4738-a796-a74a0f8d674c with nextest profile: ci_gammaloop
  419. 34.83 s > Starting 2 tests across 1 binary
  420. 34.83 s > ------------
  421. 34.83 s > Summary [ 0.034s] 2 tests run: 2 passed, 0 skipped
  422. 34.83 s >
  423. 34.83 s > ========== nextest test summary ==========
  424. 34.83 s > report: target/nextest/ci_gammaloop/junit.xml
  425. 34.83 s > tests: 2, failures: 0, errors: 0
  426. 34.83 s > No failing testcases found.
  427. 34.83 s > =========================================
  428. 34.83 s For full logs, run:
  429. 34.83 s nix log /nix/store/pw1sr1820qvjnnlcx6p7zykcgslr2apy-gammaloop-nextest-feynkit.drv
  430. 35.02 s [0 built (1 failed), 0.0Run failed.