1. 0.00 s $ /nix/store/61685rbaxmpigwi3z23i33sv3jyfl70q-coreutils-9.11/bin/timeout --kill-after=15s 7200s /nix/store/wknkybkzrc16r11vk5vrykh4wmw7a353-nix-2.34.8/bin/nix --extra-experimental-features nix-command --extra-experimental-features flakes flake clone git+https://github.com/alphal00p/gammaloop --dest /tmp/nix-ci-worker/stable-pwd/repo/
  2. 0.19 s Cloning into '/tmp/nix-ci-worker/stable-pwd/repo'...
  3. 1.08 s remote: Enumerating objects: 103390, done.
  4. 1.19 s remote: Counting objects: 0% (1/10104) remote: Counting objects: 1% (102/10104) remote: Counting objects: 2% (203/10104) remote: Counting objects: 3% (304/10104) remote: Counting objects: 4% (405/10104) remote: Counting objects: 5% (506/10104) remote: Counting objects: 6% (607/10104) remote: Counting objects: 7% (708/10104) remote: Counting objects: 8% (809/10104) remote: Counting objects: 9% (910/10104) remote: Counting objects: 10% (1011/10104) remote: Counting objects: 11% (1112/10104) remote: Counting objects: 12% (1213/10104) remote: Counting objects: 13% (1314/10104) remote: Counting objects: 14% (1415/10104) remote: Counting objects: 15% (1516/10104) remote: Counting objects: 16% (1617/10104) remote: Counting objects: 17% (1718/10104) remote: Counting objects: 18% (1819/10104) remote: Counting objects: 19% (1920/10104) remote: Counting objects: 20% (2021/10104) remote: Counting objects: 21% (2122/10104) remote: Counting objects: 22% (2223/10104) remote: Counting objects: 23% (2324/10104) remote: Counting objects: 24% (2425/10104) remote: Counting objects: 25% (2526/10104) remote: Counting objects: 26% (2628/10104) remote: Counting objects: 27% (2729/10104) remote: Counting objects: 28% (2830/10104) remote: Counting objects: 29% (2931/10104) remote: Counting objects: 30% (3032/10104) remote: Counting objects: 31% (3133/10104) remote: Counting objects: 32% (3234/10104) remote: Counting objects: 33% (3335/10104) remote: Counting objects: 34% (3436/10104) remote: Counting objects: 35% (3537/10104) remote: Counting objects: 36% (3638/10104) remote: Counting objects: 37% (3739/10104) remote: Counting objects: 38% (3840/10104) remote: Counting objects: 39% (3941/10104) remote: Counting objects: 40% (4042/10104) remote: Counting objects: 41% (4143/10104) remote: Counting objects: 42% (4244/10104) remote: Counting objects: 43% (4345/10104) remote: Counting objects: 44% (4446/10104) remote: Counting objects: 45% (4547/10104) remote: Counting objects: 46% (4648/10104) remote: Counting objects: 47% (4749/10104) remote: Counting objects: 48% (4850/10104) remote: Counting objects: 49% (4951/10104) remote: Counting objects: 50% (5052/10104) remote: Counting objects: 51% (5154/10104) remote: Counting objects: 52% (5255/10104) remote: Counting objects: 53% (5356/10104) remote: Counting objects: 54% (5457/10104) remote: Counting objects: 55% (5558/10104) remote: Counting objects: 56% (5659/10104) remote: Counting objects: 57% (5760/10104) remote: Counting objects: 58% (5861/10104) remote: Counting objects: 59% (5962/10104) remote: Counting objects: 60% (6063/10104) remote: Counting objects: 61% (6164/10104) remote: Counting objects: 62% (6265/10104) remote: Counting objects: 63% (6366/10104) remote: Counting objects: 64% (6467/10104) remote: Counting objects: 65% (6568/10104) remote: Counting objects: 66% (6669/10104) remote: Counting objects: 67% (6770/10104) remote: Counting objects: 68% (6871/10104) remote: Counting objects: 69% (6972/10104) remote: Counting objects: 70% (7073/10104) remote: Counting objects: 71% (7174/10104) remote: Counting objects: 72% (7275/10104) remote: Counting objects: 73% (7376/10104) remote: Counting objects: 74% (7477/10104) remote: Counting objects: 75% (7578/10104) remote: Counting objects: 76% (7680/10104) remote: Counting objects: 77% (7781/10104) remote: Counting objects: 78% (7882/10104) remote: Counting objects: 79% (7983/10104) remote: Counting objects: 80% (8084/10104) remote: Counting objects: 81% (8185/10104) remote: Counting objects: 82% (8286/10104) remote: Counting objects: 83% (8387/10104) remote: Counting objects: 84% (8488/10104) remote: Counting objects: 85% (8589/10104) remote: Counting objects: 86% (8690/10104) remote: Counting objects: 87% (8791/10104) remote: Counting objects: 88% (8892/10104) remote: Counting objects: 89% (8993/10104) remote: Counting objects: 90% (9094/10104) remote: Counting objects: 91% (9195/10104) remote: Counting objects: 92% (9296/10104) remote: Counting objects: 93% (9397/10104) remote: Counting objects: 94% (9498/10104) remote: Counting objects: 95% (9599/10104) remote: Counting objects: 96% (9700/10104) remote: Counting objects: 97% (9801/10104) remote: Counting objects: 98% (9902/10104) remote: Counting objects: 99% (10003/10104) remote: Counting objects: 100% (10104/10104) remote: Counting objects: 100% (10104/10104), done.
  5. 3.39 s remote: Compressing objects: 0% (1/2250) remote: Compressing objects: 1% (23/2250) remote: Compressing objects: 2% (45/2250) remote: Compressing objects: 3% (68/2250) remote: Compressing objects: 4% (90/2250) remote: Compressing objects: 5% (113/2250) remote: Compressing objects: 6% (135/2250) remote: Compressing objects: 7% (158/2250) remote: Compressing objects: 8% (180/2250) remote: Compressing objects: 9% (203/2250) remote: Compressing objects: 9% (216/2250) remote: Compressing objects: 10% (225/2250) remote: Compressing objects: 11% (248/2250) remote: Compressing objects: 12% (270/2250) remote: Compressing objects: 13% (293/2250) remote: Compressing objects: 14% (315/2250) remote: Compressing objects: 15% (338/2250) remote: Compressing objects: 16% (360/2250) remote: Compressing objects: 17% (383/2250) remote: Compressing objects: 18% (405/2250) remote: Compressing objects: 19% (428/2250) remote: Compressing objects: 20% (450/2250) remote: Compressing objects: 21% (473/2250) remote: Compressing objects: 22% (495/2250) remote: Compressing objects: 22% (502/2250) remote: Compressing objects: 23% (518/2250) remote: Compressing objects: 24% (540/2250) remote: Compressing objects: 25% (563/2250) remote: Compressing objects: 26% (585/2250) remote: Compressing objects: 27% (608/2250) remote: Compressing objects: 28% (630/2250) remote: Compressing objects: 29% (653/2250) remote: Compressing objects: 30% (675/2250) remote: Compressing objects: 31% (698/2250) remote: Compressing objects: 32% (720/2250) remote: Compressing objects: 33% (743/2250) remote: Compressing objects: 34% (765/2250) remote: Compressing objects: 35% (788/2250) remote: Compressing objects: 36% (810/2250) remote: Compressing objects: 37% (833/2250) remote: Compressing objects: 38% (855/2250) remote: Compressing objects: 39% (878/2250) remote: Compressing objects: 40% (900/2250) remote: Compressing objects: 41% (923/2250) remote: Compressing objects: 42% (945/2250) remote: Compressing objects: 43% (968/2250) remote: Compressing objects: 44% (990/2250) remote: Compressing objects: 45% (1013/2250) remote: Compressing objects: 46% (1035/2250) remote: Compressing objects: 47% (1058/2250) remote: Compressing objects: 48% (1080/2250) remote: Compressing objects: 49% (1103/2250) remote: Compressing objects: 50% (1125/2250) remote: Compressing objects: 51% (1148/2250) remote: Compressing objects: 52% (1170/2250) remote: Compressing objects: 53% (1193/2250) remote: Compressing objects: 54% (1215/2250) remote: Compressing objects: 55% (1238/2250) remote: Compressing objects: 56% (1260/2250) remote: Compressing objects: 57% (1283/2250) remote: Compressing objects: 58% (1305/2250) remote: Compressing objects: 59% (1328/2250) remote: Compressing objects: 60% (1350/2250) remote: Compressing objects: 61% (1373/2250) remote: Compressing objects: 62% (1395/2250) remote: Compressing objects: 63% (1418/2250) remote: Compressing objects: 64% (1440/2250) remote: Compressing objects: 65% (1463/2250) remote: Compressing objects: 66% (1485/2250) remote: Compressing objects: 67% (1508/2250) remote: Compressing objects: 68% (1530/2250) remote: Compressing objects: 69% (1553/2250) remote: Compressing objects: 70% (1575/2250) remote: Compressing objects: 71% (1598/2250) remote: Compressing objects: 72% (1620/2250) remote: Compressing objects: 73% (1643/2250) remote: Compressing objects: 74% (1665/2250) remote: Compressing objects: 75% (1688/2250) remote: Compressing objects: 76% (1710/2250) remote: Compressing objects: 77% (1733/2250) remote: Compressing objects: 78% (1755/2250) remote: Compressing objects: 79% (1778/2250) remote: Compressing objects: 80% (1800/2250) remote: Compressing objects: 81% (1823/2250) remote: Compressing objects: 82% (1845/2250) remote: Compressing objects: 83% (1868/2250) remote: Compressing objects: 84% (1890/2250) remote: Compressing objects: 85% (1913/2250) remote: Compressing objects: 86% (1935/2250) remote: Compressing objects: 87% (1958/2250) remote: Compressing objects: 88% (1980/2250) remote: Compressing objects: 89% (2003/2250) remote: Compressing objects: 90% (2025/2250) remote: Compressing objects: 91% (2048/2250) remote: Compressing objects: 92% (2070/2250) remote: Compressing objects: 93% (2093/2250) remote: Compressing objects: 94% (2115/2250) remote: Compressing objects: 95% (2138/2250) remote: Compressing objects: 96% (2160/2250) remote: Compressing objects: 97% (2183/2250) remote: Compressing objects: 98% (2205/2250) remote: Compressing objects: 99% (2228/2250) remote: Compressing objects: 100% (2250/2250) remote: Compressing objects: 100% (2250/2250), done.
  6. 16.72 s Receiving objects: 0% (1/103390) Receiving objects: 1% (1034/103390) Receiving objects: 2% (2068/103390) Receiving objects: 3% (3102/103390) Receiving objects: 4% (4136/103390) Receiving objects: 5% (5170/103390) Receiving objects: 6% (6204/103390) Receiving objects: 7% (7238/103390), 11.37 MiB | 22.73 MiB/s Receiving objects: 8% (8272/103390), 11.37 MiB | 22.73 MiB/s Receiving objects: 9% (9306/103390), 11.37 MiB | 22.73 MiB/s Receiving objects: 10% (10339/103390), 11.37 MiB | 22.73 MiB/s Receiving objects: 11% (11373/103390), 11.37 MiB | 22.73 MiB/s Receiving objects: 12% (12407/103390), 11.37 MiB | 22.73 MiB/s Receiving objects: 13% (13441/103390), 11.37 MiB | 22.73 MiB/s Receiving objects: 14% (14475/103390), 11.37 MiB | 22.73 MiB/s Receiving objects: 15% (15509/103390), 11.37 MiB | 22.73 MiB/s Receiving objects: 16% (16543/103390), 11.37 MiB | 22.73 MiB/s Receiving objects: 17% (17577/103390), 11.37 MiB | 22.73 MiB/s Receiving objects: 18% (18611/103390), 11.37 MiB | 22.73 MiB/s Receiving objects: 19% (19645/103390), 11.37 MiB | 22.73 MiB/s Receiving objects: 20% (20678/103390), 11.37 MiB | 22.73 MiB/s Receiving objects: 21% (21712/103390), 11.37 MiB | 22.73 MiB/s Receiving objects: 22% (22746/103390), 11.37 MiB | 22.73 MiB/s Receiving objects: 23% (23780/103390), 11.37 MiB | 22.73 MiB/s Receiving objects: 24% (24814/103390), 11.37 MiB | 22.73 MiB/s Receiving objects: 25% (25848/103390), 11.37 MiB | 22.73 MiB/s Receiving objects: 26% (26882/103390), 11.37 MiB | 22.73 MiB/s Receiving objects: 27% (27916/103390), 11.37 MiB | 22.73 MiB/s Receiving objects: 28% (28950/103390), 11.37 MiB | 22.73 MiB/s Receiving objects: 29% (29984/103390), 11.37 MiB | 22.73 MiB/s Receiving objects: 30% (31017/103390), 11.37 MiB | 22.73 MiB/s Receiving objects: 30% (31426/103390), 29.28 MiB | 29.27 MiB/s Receiving objects: 31% (32051/103390), 29.28 MiB | 29.27 MiB/s Receiving objects: 32% (33085/103390), 29.28 MiB | 29.27 MiB/s Receiving objects: 33% (34119/103390), 29.28 MiB | 29.27 MiB/s Receiving objects: 34% (35153/103390), 29.28 MiB | 29.27 MiB/s Receiving objects: 35% (36187/103390), 29.28 MiB | 29.27 MiB/s Receiving objects: 36% (37221/103390), 29.28 MiB | 29.27 MiB/s Receiving objects: 37% (38255/103390), 41.64 MiB | 27.75 MiB/s Receiving objects: 38% (39289/103390), 41.64 MiB | 27.75 MiB/s Receiving objects: 39% (40323/103390), 41.64 MiB | 27.75 MiB/s Receiving objects: 40% (41356/103390), 41.64 MiB | 27.75 MiB/s Receiving objects: 41% (42390/103390), 41.64 MiB | 27.75 MiB/s Receiving objects: 42% (43424/103390), 41.64 MiB | 27.75 MiB/s Receiving objects: 43% (44458/103390), 41.64 MiB | 27.75 MiB/s Receiving objects: 43% (44846/103390), 41.64 MiB | 27.75 MiB/s Receiving objects: 44% (45492/103390), 54.30 MiB | 27.13 MiB/s Receiving objects: 45% (46526/103390), 54.30 MiB | 27.13 MiB/s Receiving objects: 46% (47560/103390), 54.30 MiB | 27.13 MiB/s Receiving objects: 47% (48594/103390), 54.30 MiB | 27.13 MiB/s Receiving objects: 48% (49628/103390), 67.95 MiB | 27.16 MiB/s Receiving objects: 49% (50662/103390), 67.95 MiB | 27.16 MiB/s Receiving objects: 50% (51695/103390), 67.95 MiB | 27.16 MiB/s Receiving objects: 51% (52729/103390), 67.95 MiB | 27.16 MiB/s Receiving objects: 52% (53763/103390), 67.95 MiB | 27.16 MiB/s Receiving objects: 52% (54762/103390), 67.95 MiB | 27.16 MiB/s Receiving objects: 53% (54797/103390), 80.57 MiB | 26.83 MiB/s Receiving objects: 54% (55831/103390), 80.57 MiB | 26.83 MiB/s Receiving objects: 55% (56865/103390), 80.57 MiB | 26.83 MiB/s Receiving objects: 56% (57899/103390), 80.57 MiB | 26.83 MiB/s Receiving objects: 57% (58933/103390), 94.25 MiB | 26.89 MiB/s Receiving objects: 58% (59967/103390), 94.25 MiB | 26.89 MiB/s Receiving objects: 59% (61001/103390), 94.25 MiB | 26.89 MiB/s Receiving objects: 59% (61130/103390), 109.38 MiB | 27.24 MiB/s Receiving objects: 60% (62034/103390), 109.38 MiB | 27.24 MiB/s Receiving objects: 61% (63068/103390), 109.38 MiB | 27.24 MiB/s Receiving objects: 62% (64102/103390), 125.94 MiB | 27.89 MiB/s Receiving objects: 62% (64121/103390), 125.94 MiB | 27.89 MiB/s Receiving objects: 63% (65136/103390), 142.36 MiB | 29.01 MiB/s Receiving objects: 63% (66032/103390), 174.51 MiB | 29.37 MiB/s Receiving objects: 63% (66060/103390), 207.41 MiB | 30.84 MiB/s Receiving objects: 64% (66170/103390), 223.86 MiB | 31.69 MiB/s Receiving objects: 64% (66172/103390), 223.86 MiB | 31.69 MiB/s Receiving objects: 64% (66297/103390), 256.15 MiB | 32.57 MiB/s Receiving objects: 65% (67204/103390), 284.59 MiB | 31.56 MiB/s Receiving objects: 66% (68238/103390), 284.59 MiB | 31.56 MiB/s Receiving objects: 66% (68751/103390), 284.59 MiB | 31.56 MiB/s Receiving objects: 67% (69272/103390), 284.59 MiB | 31.56 MiB/s Receiving objects: 68% (70306/103390), 299.10 MiB | 31.24 MiB/s Receiving objects: 69% (71340/103390), 299.10 MiB | 31.24 MiB/s Receiving objects: 70% (72373/103390), 299.10 MiB | 31.24 MiB/s Receiving objects: 71% (73407/103390), 299.10 MiB | 31.24 MiB/s Receiving objects: 72% (74441/103390), 313.16 MiB | 30.39 MiB/s Receiving objects: 73% (75475/103390), 313.16 MiB | 30.39 MiB/s Receiving objects: 74% (76509/103390), 313.16 MiB | 30.39 MiB/s Receiving objects: 75% (77543/103390), 313.16 MiB | 30.39 MiB/s Receiving objects: 76% (78577/103390), 313.16 MiB | 30.39 MiB/s Receiving objects: 77% (79611/103390), 313.16 MiB | 30.39 MiB/s Receiving objects: 77% (80587/103390), 313.16 MiB | 30.39 MiB/s Receiving objects: 78% (80645/103390), 313.16 MiB | 30.39 MiB/s Receiving objects: 79% (81679/103390), 313.16 MiB | 30.39 MiB/s Receiving objects: 80% (82712/103390), 328.30 MiB | 30.03 MiB/s Receiving objects: 81% (83746/103390), 328.30 MiB | 30.03 MiB/s Receiving objects: 82% (84780/103390), 328.30 MiB | 30.03 MiB/s Receiving objects: 83% (85814/103390), 344.12 MiB | 29.55 MiB/s Receiving objects: 83% (85985/103390), 344.12 MiB | 29.55 MiB/s Receiving objects: 84% (86848/103390), 359.52 MiB | 29.33 MiB/s Receiving objects: 85% (87882/103390), 359.52 MiB | 29.33 MiB/s Receiving objects: 86% (88916/103390), 359.52 MiB | 29.33 MiB/s Receiving objects: 87% (89950/103390), 359.52 MiB | 29.33 MiB/s Receiving objects: 88% (90984/103390), 373.67 MiB | 28.54 MiB/s Receiving objects: 89% (92018/103390), 373.67 MiB | 28.54 MiB/s Receiving objects: 90% (93051/103390), 373.67 MiB | 28.54 MiB/s Receiving objects: 90% (93074/103390), 373.67 MiB | 28.54 MiB/s Receiving objects: 91% (94085/103390), 373.67 MiB | 28.54 MiB/s Receiving objects: 92% (95119/103390), 373.67 MiB | 28.54 MiB/s Receiving objects: 93% (96153/103390), 373.67 MiB | 28.54 MiB/s Receiving objects: 94% (97187/103390), 373.67 MiB | 28.54 MiB/s Receiving objects: 95% (98221/103390), 373.67 MiB | 28.54 MiB/s Receiving objects: 96% (99255/103390), 373.67 MiB | 28.54 MiB/s Receiving objects: 97% (100289/103390), 373.67 MiB | 28.54 MiB/s Receiving objects: 98% (101323/103390), 373.67 MiB | 28.54 MiB/s Receiving objects: 99% (102357/103390), 388.93 MiB | 28.30 MiB/s remote: Total 103390 (delta 8622), reused 8039 (delta 7829), pack-reused 93286 (from 4)
  7. 16.72 s Receiving objects: 100% (103390/103390), 388.93 MiB | 28.30 MiB/s Receiving objects: 100% (103390/103390), 391.81 MiB | 29.39 MiB/s, done.
  8. 17.99 s Resolving deltas: 0% (0/67724) Resolving deltas: 1% (678/67724) Resolving deltas: 2% (1355/67724) Resolving deltas: 3% (2032/67724) Resolving deltas: 4% (2709/67724) Resolving deltas: 5% (3387/67724) Resolving deltas: 6% (4065/67724) Resolving deltas: 7% (4741/67724) Resolving deltas: 8% (5418/67724) Resolving deltas: 9% (6096/67724) Resolving deltas: 10% (6773/67724) Resolving deltas: 11% (7450/67724) Resolving deltas: 12% (8127/67724) Resolving deltas: 13% (8805/67724) Resolving deltas: 14% (9483/67724) Resolving deltas: 15% (10164/67724) Resolving deltas: 16% (10836/67724) Resolving deltas: 17% (11515/67724) Resolving deltas: 18% (12191/67724) Resolving deltas: 19% (12868/67724) Resolving deltas: 20% (13546/67724) Resolving deltas: 21% (14223/67724) Resolving deltas: 22% (14900/67724) Resolving deltas: 23% (15577/67724) Resolving deltas: 24% (16254/67724) Resolving deltas: 25% (16931/67724) Resolving deltas: 26% (17609/67724) Resolving deltas: 27% (18286/67724) Resolving deltas: 28% (18963/67724) Resolving deltas: 29% (19640/67724) Resolving deltas: 30% (20318/67724) Resolving deltas: 31% (20996/67724) Resolving deltas: 32% (21672/67724) Resolving deltas: 33% (22349/67724) Resolving deltas: 34% (23027/67724) Resolving deltas: 35% (23704/67724) Resolving deltas: 36% (24381/67724) Resolving deltas: 37% (25058/67724) Resolving deltas: 38% (25739/67724) Resolving deltas: 39% (26413/67724) Resolving deltas: 40% (27091/67724) Resolving deltas: 41% (27768/67724) Resolving deltas: 42% (28448/67724) Resolving deltas: 43% (29122/67724) Resolving deltas: 44% (29800/67724) Resolving deltas: 45% (30476/67724) Resolving deltas: 46% (31154/67724) Resolving deltas: 47% (31831/67724) Resolving deltas: 48% (32508/67724) Resolving deltas: 49% (33185/67724) Resolving deltas: 50% (33865/67724) Resolving deltas: 51% (34540/67724) Resolving deltas: 52% (35220/67724) Resolving deltas: 53% (35894/67724) Resolving deltas: 54% (36571/67724) Resolving deltas: 55% (37249/67724) Resolving deltas: 56% (37926/67724) Resolving deltas: 57% (38603/67724) Resolving deltas: 58% (39281/67724) Resolving deltas: 59% (39958/67724) Resolving deltas: 60% (40635/67724) Resolving deltas: 61% (41312/67724) Resolving deltas: 62% (41989/67724) Resolving deltas: 63% (42667/67724) Resolving deltas: 64% (43344/67724) Resolving deltas: 65% (44021/67724) Resolving deltas: 66% (44698/67724) Resolving deltas: 67% (45376/67724) Resolving deltas: 68% (46054/67724) Resolving deltas: 69% (46730/67724) Resolving deltas: 70% (47407/67724) Resolving deltas: 71% (48085/67724) Resolving deltas: 72% (48762/67724) Resolving deltas: 73% (49440/67724) Resolving deltas: 74% (50116/67724) Resolving deltas: 75% (50794/67724) Resolving deltas: 76% (51471/67724) Resolving deltas: 77% (52148/67724) Resolving deltas: 78% (52826/67724) Resolving deltas: 79% (53502/67724) Resolving deltas: 79% (53858/67724) Resolving deltas: 80% (54180/67724) Resolving deltas: 81% (54857/67724) Resolving deltas: 82% (55534/67724) Resolving deltas: 83% (56212/67724) Resolving deltas: 84% (56889/67724) Resolving deltas: 85% (57566/67724) Resolving deltas: 86% (58244/67724) Resolving deltas: 87% (58920/67724) Resolving deltas: 88% (59598/67724) Resolving deltas: 89% (60275/67724) Resolving deltas: 90% (60952/67724) Resolving deltas: 91% (61629/67724) Resolving deltas: 92% (62307/67724) Resolving deltas: 93% (62984/67724) Resolving deltas: 94% (63661/67724) Resolving deltas: 95% (64338/67724) Resolving deltas: 96% (65016/67724) Resolving deltas: 97% (65693/67724) Resolving deltas: 98% (66372/67724) Resolving deltas: 99% (67047/67724) Resolving deltas: 100% (67724/67724) Resolving deltas: 100% (67724/67724), done.
  9. 19.04 s Fetching commit 0afa8ad228d762fc4c781c8dbec2e17f2eb2f1c6 for feynkit ...
  10. 19.04 s $ /nix/store/5vpcfsdx1lcnlb2y4k7xyc74shp5qwbh-git-2.54.0/bin/git fetch origin 0afa8ad228d762fc4c781c8dbec2e17f2eb2f1c6
  11. 19.56 s From https://github.com/alphal00p/gammaloop
  12. 19.56 s * branch 0afa8ad228d762fc4c781c8dbec2e17f2eb2f1c6 -> FETCH_HEAD
  13. 19.57 s $ /nix/store/61685rbaxmpigwi3z23i33sv3jyfl70q-coreutils-9.11/bin/timeout --kill-after=15s 7200s /nix/store/5vpcfsdx1lcnlb2y4k7xyc74shp5qwbh-git-2.54.0/bin/git -c advice.detachedHead=false checkout 0afa8ad228d762fc4c781c8dbec2e17f2eb2f1c6
  14. 19.81 s HEAD is now at 0afa8ad22 align generation defaults and avoid repeated numerator expansion
  15. 19.82 s $ /nix/store/61685rbaxmpigwi3z23i33sv3jyfl70q-coreutils-9.11/bin/timeout --kill-after=15s 7200s /nix/store/wknkybkzrc16r11vk5vrykh4wmw7a353-nix-2.34.8/bin/nix --extra-experimental-features nix-command --extra-experimental-features flakes --log-format internal-json run .#packages.x86_64-linux.nix-ci-check-gammaloop-nextest-feynkit --print-build-logs
  16. 19.92 s warning: ignoring untrusted flake configuration setting 'extra-substituters'.
  17. 19.92 s Pass '--accept-flake-config' to trust it
  18. 19.92 s warning: ignoring untrusted flake configuration setting 'extra-trusted-public-keys'.
  19. 19.92 s Pass '--accept-flake-config' to trust it
  20. 19.92 s
  21. 20.11 s do you want to allow configuration setting 'extra-substituters' to be set to 'https://cache.nix-ci.com' (y/N)? do you want to permanently mark this value as untrusted (y/N)? warning: ignoring untrusted flake configuration setting 'extra-substituters'.
  22. 20.11 s Pass '--accept-flake-config' to trust it
  23. 20.11 s evaluating derivation 'gdo you want to allow configuration setting 'extra-trusted-public-keys' to be set to 'nix-ci:g3xV5BDTLtIBZr/A00IU1x0EtKKlb7YLgBN2SgYgM6A=' (y/N)? do you want to permanently mark this value as untrusted (y/N)? warning: ignoring untrusted flake configuration setting 'extra-trusted-public-keys'.
  24. 20.11 s Pass '--accept-flake-config' to trust it
  25. 25.27 s copying '/nix/store/s70x evaluating derivation 'g copying '/nix/store/s70x evaluating derivation 'g copying '/nix/store/s70x evaluating derivation 'g copying '/nix/store/s70x evaluating derivation 'g copying '/nix/store/s70x evaluating derivation 'g copying '/nix/store/s70x evaluating derivation 'g [0/1 built] [1/0/1 built] building ggammaloop-nextest-feynkit> Extracting 1 binary and 2 linked paths to /build/source
  26. 25.34 s gammaloop-nextest-feynkit> Extracted 15 files to /build/source in 0.07s
  27. 25.35 s gammaloop-nextest-feynkit> ------------
  28. 25.35 s gammaloop-nextest-feynkit> Nextest run ID 958bae9b-a381-474f-ab03-abd6d84d24f7 with nextest profile: ci_gammaloop
  29. 25.35 s gammaloop-nextest-feynkit> Starting 1 test across 1 binary
  30. 25.35 s gammaloop-nextest-feynkit> ------------
  31. 25.35 s gammaloop-nextest-feynkit> Summary [ 0.005s] 1 test run: 1 passed, 0 skipped
  32. 25.38 s gammaloop-nextest-feynkit>
  33. 25.38 s gammaloop-nextest-feynkit> ========== nextest test summary ==========
  34. 25.38 s gammaloop-nextest-feynkit> report: target/nextest/ci_gammaloop/junit.xml
  35. 25.38 s gammaloop-nextest-feynkit> tests: 1, failures: 0, errors: 0
  36. 25.38 s gammaloop-nextest-feynkit> No failing testcases found.
  37. 25.38 s gammaloop-nextest-feynkit> =========================================
  38. 25.39 s gammaloop-nextest-feynkit> Extracting 1 binary and 2 linked paths to /build/source
  39. 25.48 s gammaloop-nextest-feynkit> Extracted 15 files to /build/source in 0.08s
  40. 25.49 s gammaloop-nextest-feynkit> ------------
  41. 25.49 s gammaloop-nextest-feynkit> Nextest run ID 3e5f0756-4d37-4e73-96d9-3c70d42f302a with nextest profile: ci_gammaloop
  42. 25.49 s gammaloop-nextest-feynkit> Starting 33 tests across 1 binary
  43. 25.51 s gammaloop-nextest-feynkit> ------------
  44. 25.51 s gammaloop-nextest-feynkit> Summary [ 0.021s] 33 tests run: 33 passed, 0 skipped
  45. 25.54 s gammaloop-nextest-feynkit>
  46. 25.54 s gammaloop-nextest-feynkit> ========== nextest test summary ==========
  47. 25.54 s gammaloop-nextest-feynkit> report: target/nextest/ci_gammaloop/junit.xml
  48. 25.54 s gammaloop-nextest-feynkit> tests: 33, failures: 0, errors: 0
  49. 25.54 s gammaloop-nextest-feynkit> No failing testcases found.
  50. 25.54 s gammaloop-nextest-feynkit> =========================================
  51. 25.55 s gammaloop-nextest-feynkit> Extracting 2 binaries and 2 linked paths to /build/source
  52. 25.69 s gammaloop-nextest-feynkit> Extracted 16 files to /build/source in 0.14s
  53. 25.70 s gammaloop-nextest-feynkit> ------------
  54. 25.70 s gammaloop-nextest-feynkit> Nextest run ID 296f6331-8b80-45bf-bf5d-e2ca2acfe5ee with nextest profile: ci_gammaloop
  55. 25.70 s gammaloop-nextest-feynkit> Starting 60 tests across 2 binaries
  56. 25.74 s gammaloop-nextest-feynkit> ------------
  57. 25.74 s gammaloop-nextest-feynkit> Summary [ 0.043s] 60 tests run: 60 passed, 0 skipped
  58. 25.77 s gammaloop-nextest-feynkit>
  59. 25.77 s gammaloop-nextest-feynkit> ========== nextest test summary ==========
  60. 25.77 s gammaloop-nextest-feynkit> report: target/nextest/ci_gammaloop/junit.xml
  61. 25.77 s gammaloop-nextest-feynkit> tests: 60, failures: 0, errors: 0
  62. 25.77 s gammaloop-nextest-feynkit> No failing testcases found.
  63. 25.77 s gammaloop-nextest-feynkit> =========================================
  64. 25.79 s gammaloop-nextest-feynkit> Extracting 1 binary and 2 linked paths to /build/source
  65. 25.87 s gammaloop-nextest-feynkit> Extracted 15 files to /build/source in 0.08s
  66. 25.88 s gammaloop-nextest-feynkit> ------------
  67. 25.88 s gammaloop-nextest-feynkit> Nextest run ID 841f110b-8784-4df6-a310-4786b9686c7e with nextest profile: ci_gammaloop
  68. 25.88 s gammaloop-nextest-feynkit> Starting 28 tests across 1 binary
  69. 25.90 s gammaloop-nextest-feynkit> ------------
  70. 25.90 s gammaloop-nextest-feynkit> Summary [ 0.017s] 28 tests run: 28 passed, 0 skipped
  71. 25.93 s gammaloop-nextest-feynkit>
  72. 25.93 s gammaloop-nextest-feynkit> ========== nextest test summary ==========
  73. 25.93 s gammaloop-nextest-feynkit> report: target/nextest/ci_gammaloop/junit.xml
  74. 25.93 s gammaloop-nextest-feynkit> tests: 28, failures: 0, errors: 0
  75. 25.93 s gammaloop-nextest-feynkit> No failing testcases found.
  76. 25.93 s gammaloop-nextest-feynkit> =========================================
  77. 25.94 s gammaloop-nextest-feynkit> Extracting 1 binary and 1 linked path to /build/source
  78. 26.01 s gammaloop-nextest-feynkit> Extracted 7 files to /build/source in 0.07s
  79. 26.02 s gammaloop-nextest-feynkit> ------------
  80. 26.02 s gammaloop-nextest-feynkit> Nextest run ID 1a879672-1f9b-4cd8-a97c-a854a2be7abf with nextest profile: ci_gammaloop
  81. 26.02 s gammaloop-nextest-feynkit> Starting 21 tests across 1 binary
  82. 26.03 s gammaloop-nextest-feynkit> ------------
  83. 26.03 s gammaloop-nextest-feynkit> Summary [ 0.012s] 21 tests run: 21 passed, 0 skipped
  84. 26.06 s gammaloop-nextest-feynkit>
  85. 26.06 s gammaloop-nextest-feynkit> ========== nextest test summary ==========
  86. 26.06 s gammaloop-nextest-feynkit> report: target/nextest/ci_gammaloop/junit.xml
  87. 26.06 s gammaloop-nextest-feynkit> tests: 21, failures: 0, errors: 0
  88. 26.06 s gammaloop-nextest-feynkit> No failing testcases found.
  89. 26.06 s gammaloop-nextest-feynkit> =========================================
  90. 26.08 s gammaloop-nextest-feynkit> Extracting 2 binaries and 2 linked paths to /build/source
  91. 26.18 s gammaloop-nextest-feynkit> Extracted 16 files to /build/source in 0.11s
  92. 26.19 s gammaloop-nextest-feynkit> ------------
  93. 26.19 s gammaloop-nextest-feynkit> Nextest run ID 8210e2a7-f551-4381-bb1c-9617d25d34a1 with nextest profile: ci_gammaloop
  94. 26.19 s gammaloop-nextest-feynkit> Starting 14 tests across 2 binaries
  95. 26.21 s gammaloop-nextest-feynkit> ------------
  96. 26.21 s gammaloop-nextest-feynkit> Summary [ 0.011s] 14 tests run: 14 passed, 0 skipped
  97. 26.24 s gammaloop-nextest-feynkit>
  98. 26.24 s gammaloop-nextest-feynkit> ========== nextest test summary ==========
  99. 26.24 s gammaloop-nextest-feynkit> report: target/nextest/ci_gammaloop/junit.xml
  100. 26.24 s gammaloop-nextest-feynkit> tests: 14, failures: 0, errors: 0
  101. 26.24 s gammaloop-nextest-feynkit> No failing testcases found.
  102. 26.24 s gammaloop-nextest-feynkit> =========================================
  103. 26.25 s gammaloop-nextest-feynkit> Extracting 5 binaries (including 3 non-test binaries) and 2 linked paths to /build/source
  104. 26.83 s gammaloop-nextest-feynkit> Extracted 22 files to /build/source in 0.58s
  105. 26.84 s gammaloop-nextest-feynkit> ------------
  106. 26.84 s gammaloop-nextest-feynkit> Nextest run ID 1ddd708b-776f-4145-9084-265df6d76584 with nextest profile: ci_gammaloop
  107. 26.84 s gammaloop-nextest-feynkit> Starting 15 tests across 2 binaries
  108. 26.92 s gammaloop-nextest-feynkit> FAIL [ 0.076s] (10/15) feynkit-py tests::standalone_python_pipeline_covers_generation_graphs_cff_and_kinematics
  109. 26.92 s gammaloop-nextest-feynkit> stdout ---
  110. 26.92 s gammaloop-nextest-feynkit>
  111. 26.92 s gammaloop-nextest-feynkit> running 1 test
  112. 26.92 s gammaloop-nextest-feynkit> test tests::standalone_python_pipeline_covers_generation_graphs_cff_and_kinematics ... FAILED
  113. 26.92 s gammaloop-nextest-feynkit>
  114. 26.92 s gammaloop-nextest-feynkit> failures:
  115. 26.92 s gammaloop-nextest-feynkit>
  116. 26.92 s gammaloop-nextest-feynkit> failures:
  117. 26.92 s gammaloop-nextest-feynkit> tests::standalone_python_pipeline_covers_generation_graphs_cff_and_kinematics
  118. 26.92 s gammaloop-nextest-feynkit>
  119. 26.92 s gammaloop-nextest-feynkit> test result: FAILED. 0 passed; 1 failed; 0 ignored; 0 measured; 13 filtered out; finished in 0.06s
  120. 26.92 s gammaloop-nextest-feynkit>
  121. 26.92 s gammaloop-nextest-feynkit> stderr ---
  122. 26.92 s gammaloop-nextest-feynkit>
  123. 26.92 s gammaloop-nextest-feynkit> thread 'tests::standalone_python_pipeline_covers_generation_graphs_cff_and_kinematics' (914) panicked at crates/feynkit-py/src/lib.rs:453:57:
  124. 26.92 s gammaloop-nextest-feynkit> called `Result::unwrap()` on an `Err` value: PyErr { type: <class 'AssertionError'>, value: AssertionError(), traceback: Some("Traceback (most recent call last):\n File \"<string>\", line 39, in <module>\n") }
  125. 26.92 s gammaloop-nextest-feynkit> stack backtrace:
  126. 26.92 s gammaloop-nextest-feynkit> 0: __rustc::rust_begin_unwind
  127. 26.92 s gammaloop-nextest-feynkit> 1: core::panicking::panic_fmt
  128. 26.92 s gammaloop-nextest-feynkit> 2: core::result::unwrap_failed
  129. 26.92 s gammaloop-nextest-feynkit> 3: feynkit_py::tests::standalone_python_pipeline_covers_generation_graphs_cff_and_kinematics
  130. 26.92 s gammaloop-nextest-feynkit> 4: <feynkit_py::tests::standalone_python_pipeline_covers_generation_graphs_cff_and_kinematics::{closure#0} as core::ops::function::FnOnce<()>>::call_once
  131. 26.92 s gammaloop-nextest-feynkit> note: Some details are omitted, run with `RUST_BACKTRACE=full` for a verbose backtrace.
  132. 26.92 s gammaloop-nextest-feynkit>
  133. 27.51 s gammaloop-nextest-feynkit> ------------
  134. 27.51 s gammaloop-nextest-feynkit> Summary [ 0.669s] 15 tests run: 14 passed, 1 failed, 0 skipped
  135. 27.51 s gammaloop-nextest-feynkit> FAIL [ 0.076s] (10/15) feynkit-py tests::standalone_python_pipeline_covers_generation_graphs_cff_and_kinematics
  136. 27.51 s gammaloop-nextest-feynkit> stdout ---
  137. 27.51 s gammaloop-nextest-feynkit>
  138. 27.51 s gammaloop-nextest-feynkit> running 1 test
  139. 27.51 s gammaloop-nextest-feynkit> test tests::standalone_python_pipeline_covers_generation_graphs_cff_and_kinematics ... FAILED
  140. 27.51 s gammaloop-nextest-feynkit>
  141. 27.51 s gammaloop-nextest-feynkit> failures:
  142. 27.51 s gammaloop-nextest-feynkit>
  143. 27.51 s gammaloop-nextest-feynkit> failures:
  144. 27.51 s gammaloop-nextest-feynkit> tests::standalone_python_pipeline_covers_generation_graphs_cff_and_kinematics
  145. 27.51 s gammaloop-nextest-feynkit>
  146. 27.51 s gammaloop-nextest-feynkit> test result: FAILED. 0 passed; 1 failed; 0 ignored; 0 measured; 13 filtered out; finished in 0.06s
  147. 27.51 s gammaloop-nextest-feynkit>
  148. 27.51 s gammaloop-nextest-feynkit> stderr ---
  149. 27.51 s gammaloop-nextest-feynkit>
  150. 27.51 s gammaloop-nextest-feynkit> thread 'tests::standalone_python_pipeline_covers_generation_graphs_cff_and_kinematics' (914) panicked at crates/feynkit-py/src/lib.rs:453:57:
  151. 27.51 s gammaloop-nextest-feynkit> called `Result::unwrap()` on an `Err` value: PyErr { type: <class 'AssertionError'>, value: AssertionError(), traceback: Some("Traceback (most recent call last):\n File \"<string>\", line 39, in <module>\n") }
  152. 27.51 s gammaloop-nextest-feynkit> stack backtrace:
  153. 27.51 s gammaloop-nextest-feynkit> 0: __rustc::rust_begin_unwind
  154. 27.51 s gammaloop-nextest-feynkit> 1: core::panicking::panic_fmt
  155. 27.51 s gammaloop-nextest-feynkit> 2: core::result::unwrap_failed
  156. 27.51 s gammaloop-nextest-feynkit> 3: feynkit_py::tests::standalone_python_pipeline_covers_generation_graphs_cff_and_kinematics
  157. 27.51 s gammaloop-nextest-feynkit> 4: <feynkit_py::tests::standalone_python_pipeline_covers_generation_graphs_cff_and_kinematics::{closure#0} as core::ops::function::FnOnce<()>>::call_once
  158. 27.51 s gammaloop-nextest-feynkit> note: Some details are omitted, run with `RUST_BACKTRACE=full` for a verbose backtrace.
  159. 27.51 s gammaloop-nextest-feynkit>
  160. 27.51 s gammaloop-nextest-feynkit> error: test run failed
  161. 27.54 s gammaloop-nextest-feynkit>
  162. 27.54 s gammaloop-nextest-feynkit> ========== nextest test summary ==========
  163. 27.54 s gammaloop-nextest-feynkit> report: target/nextest/ci_gammaloop/junit.xml
  164. 27.54 s gammaloop-nextest-feynkit> tests: 15, failures: 1, errors: 0
  165. 27.54 s gammaloop-nextest-feynkit>
  166. 27.54 s gammaloop-nextest-feynkit> 1. feynkit-py::tests::standalone_python_pipeline_covers_generation_graphs_cff_and_kinematics
  167. 27.54 s gammaloop-nextest-feynkit> failure: test failure with exit code 101
  168. 27.54 s gammaloop-nextest-feynkit> thread 'tests::standalone_python_pipeline_covers_generation_graphs_cff_and_kinematics' (914) panicked at crates/feynkit-py/src/lib.rs:453:57:
  169. 27.54 s gammaloop-nextest-feynkit> called `Result::unwrap()` on an `Err` value: PyErr { type: <class 'AssertionError'>, value: AssertionError(), traceback: Some("Traceback (most recent call last):\n File \"<string>\", line 39, in <module>\n") }
  170. 27.54 s gammaloop-nextest-feynkit> stack backtrace:
  171. 27.54 s gammaloop-nextest-feynkit> 0: __rustc::rust_begin_unwind
  172. 27.54 s gammaloop-nextest-feynkit> 1: core::panicking::panic_fmt
  173. 27.54 s gammaloop-nextest-feynkit> 2: core::result::unwrap_failed
  174. 27.54 s gammaloop-nextest-feynkit> 3: feynkit_py::tests::standalone_python_pipeline_covers_generation_graphs_cff_and_kinematics
  175. 27.54 s gammaloop-nextest-feynkit> 4: <feynkit_py::tests::standalone_python_pipeline_covers_generation_graphs_cff_and_kinematics::{closure#0} as core::ops::function::FnOnce<()>>::call_once
  176. 27.54 s gammaloop-nextest-feynkit> note: Some details are omitted, run with `RUST_BACKTRACE=full` for a verbose backtrace.
  177. 27.54 s gammaloop-nextest-feynkit> system-out
  178. 27.54 s gammaloop-nextest-feynkit> running 1 test
  179. 27.54 s gammaloop-nextest-feynkit> test tests::standalone_python_pipeline_covers_generation_graphs_cff_and_kinematics ... FAILED
  180. 27.54 s gammaloop-nextest-feynkit>
  181. 27.54 s gammaloop-nextest-feynkit> failures:
  182. 27.54 s gammaloop-nextest-feynkit>
  183. 27.54 s gammaloop-nextest-feynkit> failures:
  184. 27.54 s gammaloop-nextest-feynkit> tests::standalone_python_pipeline_covers_generation_graphs_cff_and_kinematics
  185. 27.54 s gammaloop-nextest-feynkit>
  186. 27.54 s gammaloop-nextest-feynkit> test result: FAILED. 0 passed; 1 failed; 0 ignored; 0 measured; 13 filtered out; finished in 0.06s
  187. 27.54 s gammaloop-nextest-feynkit> system-err
  188. 27.54 s gammaloop-nextest-feynkit> thread 'tests::standalone_python_pipeline_covers_generation_graphs_cff_and_kinematics' (914) panicked at crates/feynkit-py/src/lib.rs:453:57:
  189. 27.54 s gammaloop-nextest-feynkit> called `Result::unwrap()` on an `Err` value: PyErr { type: <class 'AssertionError'>, value: AssertionError(), traceback: Some("Traceback (most recent call last):\n File \"<string>\", line 39, in <module>\n") }
  190. 27.54 s gammaloop-nextest-feynkit> stack backtrace:
  191. 27.54 s gammaloop-nextest-feynkit> 0: __rustc::rust_begin_unwind
  192. 27.54 s gammaloop-nextest-feynkit> 1: core::panicking::panic_fmt
  193. 27.54 s gammaloop-nextest-feynkit> 2: core::result::unwrap_failed
  194. 27.54 s gammaloop-nextest-feynkit> 3: feynkit_py::tests::standalone_python_pipeline_covers_generation_graphs_cff_and_kinematics
  195. 27.54 s gammaloop-nextest-feynkit> 4: <feynkit_py::tests::standalone_python_pipeline_covers_generation_graphs_cff_and_kinematics::{closure#0} as core::ops::function::FnOnce<()>>::call_once
  196. 27.54 s gammaloop-nextest-feynkit> note: Some details are omitted, run with `RUST_BACKTRACE=full` for a verbose backtrace.
  197. 27.54 s gammaloop-nextest-feynkit> =========================================
  198. 27.55 s gammaloop-nextest-feynkit> Extracting 1 binary and 2 linked paths to /build/source
  199. 27.64 s gammaloop-nextest-feynkit> Extracted 15 files to /build/source in 0.09s
  200. 27.65 s gammaloop-nextest-feynkit> ------------
  201. 27.65 s gammaloop-nextest-feynkit> Nextest run ID 6eea1038-9e0a-4482-8d19-83beaf5e7b41 with nextest profile: ci_gammaloop
  202. 27.65 s gammaloop-nextest-feynkit> Starting 45 tests across 1 binary (1 test skipped)
  203. 27.76 s gammaloop-nextest-feynkit> ------------
  204. 27.76 s gammaloop-nextest-feynkit> Summary [ 0.108s] 45 tests run: 45 passed, 1 skipped
  205. 27.79 s gammaloop-nextest-feynkit>
  206. 27.79 s gammaloop-nextest-feynkit> ========== nextest test summary ==========
  207. 27.79 s gammaloop-nextest-feynkit> report: target/nextest/ci_gammaloop/junit.xml
  208. 27.79 s gammaloop-nextest-feynkit> tests: 45, failures: 0, errors: 0
  209. 27.79 s gammaloop-nextest-feynkit> No failing testcases found.
  210. 27.79 s gammaloop-nextest-feynkit> =========================================
  211. 27.80 s gammaloop-nextest-feynkit> Extracting 1 binary and 2 linked paths to /build/source
  212. 27.88 s gammaloop-nextest-feynkit> Extracted 15 files to /build/source in 0.08s
  213. 27.89 s gammaloop-nextest-feynkit> ------------
  214. 27.89 s gammaloop-nextest-feynkit> Nextest run ID 5708c692-35f4-4723-a704-338e6cd75490 with nextest profile: ci_gammaloop
  215. 27.89 s gammaloop-nextest-feynkit> Starting 2 tests across 1 binary
  216. 27.91 s gammaloop-nextest-feynkit> ------------
  217. 27.91 s gammaloop-nextest-feynkit> Summary [ 0.017s] 2 tests run: 2 passed, 0 skipped
  218. 27.94 s gammaloop-nextest-feynkit>
  219. 27.94 s gammaloop-nextest-feynkit> ========== nextest test summary ==========
  220. 27.94 s gammaloop-nextest-feynkit> report: target/nextest/ci_gammaloop/junit.xml
  221. 27.94 s gammaloop-nextest-feynkit> tests: 2, failures: 0, errors: 0
  222. 27.94 s gammaloop-nextest-feynkit> No failing testcases found.
  223. 27.94 s gammaloop-nextest-feynkit> =========================================
  224. 28.09 s [0 built (1 failed)]error: Cannot build '/nix/store/pw1sr1820qvjnnlcx6p7zykcgslr2apy-gammaloop-nextest-feynkit.drv'.
  225. 28.09 s Reason: builder failed with exit code 100.
  226. 28.09 s Output paths:
  227. 28.09 s /nix/store/jmhwb0ssy41588g8h1g904h4dx0annx9-gammaloop-nextest-feynkit
  228. 28.09 s Last 199 log lines:
  229. 28.09 s > Extracting 1 binary and 2 linked paths to /build/source
  230. 28.09 s > Extracted 15 files to /build/source in 0.07s
  231. 28.09 s > ------------
  232. 28.09 s > Nextest run ID 958bae9b-a381-474f-ab03-abd6d84d24f7 with nextest profile: ci_gammaloop
  233. 28.09 s > Starting 1 test across 1 binary
  234. 28.09 s > ------------
  235. 28.09 s > Summary [ 0.005s] 1 test run: 1 passed, 0 skipped
  236. 28.09 s >
  237. 28.09 s > ========== nextest test summary ==========
  238. 28.09 s > report: target/nextest/ci_gammaloop/junit.xml
  239. 28.09 s > tests: 1, failures: 0, errors: 0
  240. 28.09 s > No failing testcases found.
  241. 28.09 s > =========================================
  242. 28.09 s > Extracting 1 binary and 2 linked paths to /build/source
  243. 28.09 s > Extracted 15 files to /build/source in 0.08s
  244. 28.09 s > ------------
  245. 28.09 s > Nextest run ID 3e5f0756-4d37-4e73-96d9-3c70d42f302a with nextest profile: ci_gammaloop
  246. 28.09 s > Starting 33 tests across 1 binary
  247. 28.09 s > ------------
  248. 28.09 s > Summary [ 0.021s] 33 tests run: 33 passed, 0 skipped
  249. 28.09 s >
  250. 28.09 s > ========== nextest test summary ==========
  251. 28.09 s > report: target/nextest/ci_gammaloop/junit.xml
  252. 28.09 s > tests: 33, failures: 0, errors: 0
  253. 28.09 s > No failing testcases found.
  254. 28.09 s > =========================================
  255. 28.09 s > Extracting 2 binaries and 2 linked paths to /build/source
  256. 28.09 s > Extracted 16 files to /build/source in 0.14s
  257. 28.09 s > ------------
  258. 28.09 s > Nextest run ID 296f6331-8b80-45bf-bf5d-e2ca2acfe5ee with nextest profile: ci_gammaloop
  259. 28.09 s > Starting 60 tests across 2 binaries
  260. 28.09 s > ------------
  261. 28.09 s > Summary [ 0.043s] 60 tests run: 60 passed, 0 skipped
  262. 28.09 s >
  263. 28.09 s > ========== nextest test summary ==========
  264. 28.09 s > report: target/nextest/ci_gammaloop/junit.xml
  265. 28.09 s > tests: 60, failures: 0, errors: 0
  266. 28.09 s > No failing testcases found.
  267. 28.09 s > =========================================
  268. 28.09 s > Extracting 1 binary and 2 linked paths to /build/source
  269. 28.09 s > Extracted 15 files to /build/source in 0.08s
  270. 28.09 s > ------------
  271. 28.09 s > Nextest run ID 841f110b-8784-4df6-a310-4786b9686c7e with nextest profile: ci_gammaloop
  272. 28.09 s > Starting 28 tests across 1 binary
  273. 28.09 s > ------------
  274. 28.09 s > Summary [ 0.017s] 28 tests run: 28 passed, 0 skipped
  275. 28.09 s >
  276. 28.09 s > ========== nextest test summary ==========
  277. 28.09 s > report: target/nextest/ci_gammaloop/junit.xml
  278. 28.09 s > tests: 28, failures: 0, errors: 0
  279. 28.09 s > No failing testcases found.
  280. 28.09 s > =========================================
  281. 28.09 s > Extracting 1 binary and 1 linked path to /build/source
  282. 28.09 s > Extracted 7 files to /build/source in 0.07s
  283. 28.09 s > ------------
  284. 28.09 s > Nextest run ID 1a879672-1f9b-4cd8-a97c-a854a2be7abf with nextest profile: ci_gammaloop
  285. 28.09 s > Starting 21 tests across 1 binary
  286. 28.09 s > ------------
  287. 28.09 s > Summary [ 0.012s] 21 tests run: 21 passed, 0 skipped
  288. 28.09 s >
  289. 28.09 s > ========== nextest test summary ==========
  290. 28.09 s > report: target/nextest/ci_gammaloop/junit.xml
  291. 28.09 s > tests: 21, failures: 0, errors: 0
  292. 28.09 s > No failing testcases found.
  293. 28.09 s > =========================================
  294. 28.09 s > Extracting 2 binaries and 2 linked paths to /build/source
  295. 28.09 s > Extracted 16 files to /build/source in 0.11s
  296. 28.09 s > ------------
  297. 28.09 s > Nextest run ID 8210e2a7-f551-4381-bb1c-9617d25d34a1 with nextest profile: ci_gammaloop
  298. 28.09 s > Starting 14 tests across 2 binaries
  299. 28.09 s > ------------
  300. 28.09 s > Summary [ 0.011s] 14 tests run: 14 passed, 0 skipped
  301. 28.09 s >
  302. 28.09 s > ========== nextest test summary ==========
  303. 28.09 s > report: target/nextest/ci_gammaloop/junit.xml
  304. 28.09 s > tests: 14, failures: 0, errors: 0
  305. 28.09 s > No failing testcases found.
  306. 28.09 s > =========================================
  307. 28.09 s > Extracting 5 binaries (including 3 non-test binaries) and 2 linked paths to /build/source
  308. 28.09 s > Extracted 22 files to /build/source in 0.58s
  309. 28.09 s > ------------
  310. 28.09 s > Nextest run ID 1ddd708b-776f-4145-9084-265df6d76584 with nextest profile: ci_gammaloop
  311. 28.09 s > Starting 15 tests across 2 binaries
  312. 28.09 s > FAIL [ 0.076s] (10/15) feynkit-py tests::standalone_python_pipeline_covers_generation_graphs_cff_and_kinematics
  313. 28.09 s > stdout ---
  314. 28.09 s >
  315. 28.09 s > running 1 test
  316. 28.09 s > test tests::standalone_python_pipeline_covers_generation_graphs_cff_and_kinematics ... FAILED
  317. 28.09 s >
  318. 28.09 s > failures:
  319. 28.09 s >
  320. 28.09 s > failures:
  321. 28.09 s > tests::standalone_python_pipeline_covers_generation_graphs_cff_and_kinematics
  322. 28.09 s >
  323. 28.09 s > test result: FAILED. 0 passed; 1 failed; 0 ignored; 0 measured; 13 filtered out; finished in 0.06s
  324. 28.09 s >
  325. 28.09 s > stderr ---
  326. 28.09 s >
  327. 28.09 s > thread 'tests::standalone_python_pipeline_covers_generation_graphs_cff_and_kinematics' (914) panicked at crates/feynkit-py/src/lib.rs:453:57:
  328. 28.09 s > called `Result::unwrap()` on an `Err` value: PyErr { type: <class 'AssertionError'>, value: AssertionError(), traceback: Some("Traceback (most recent call last):\n File \"<string>\", line 39, in <module>\n") }
  329. 28.09 s > stack backtrace:
  330. 28.09 s > 0: __rustc::rust_begin_unwind
  331. 28.09 s > 1: core::panicking::panic_fmt
  332. 28.09 s > 2: core::result::unwrap_failed
  333. 28.09 s > 3: feynkit_py::tests::standalone_python_pipeline_covers_generation_graphs_cff_and_kinematics
  334. 28.09 s > 4: <feynkit_py::tests::standalone_python_pipeline_covers_generation_graphs_cff_and_kinematics::{closure#0} as core::ops::function::FnOnce<()>>::call_once
  335. 28.09 s > note: Some details are omitted, run with `RUST_BACKTRACE=full` for a verbose backtrace.
  336. 28.09 s >
  337. 28.09 s > ------------
  338. 28.09 s > Summary [ 0.669s] 15 tests run: 14 passed, 1 failed, 0 skipped
  339. 28.09 s > FAIL [ 0.076s] (10/15) feynkit-py tests::standalone_python_pipeline_covers_generation_graphs_cff_and_kinematics
  340. 28.09 s > stdout ---
  341. 28.09 s >
  342. 28.09 s > running 1 test
  343. 28.09 s > test tests::standalone_python_pipeline_covers_generation_graphs_cff_and_kinematics ... FAILED
  344. 28.09 s >
  345. 28.09 s > failures:
  346. 28.09 s >
  347. 28.09 s > failures:
  348. 28.09 s > tests::standalone_python_pipeline_covers_generation_graphs_cff_and_kinematics
  349. 28.09 s >
  350. 28.09 s > test result: FAILED. 0 passed; 1 failed; 0 ignored; 0 measured; 13 filtered out; finished in 0.06s
  351. 28.09 s >
  352. 28.09 s > stderr ---
  353. 28.09 s >
  354. 28.09 s > thread 'tests::standalone_python_pipeline_covers_generation_graphs_cff_and_kinematics' (914) panicked at crates/feynkit-py/src/lib.rs:453:57:
  355. 28.09 s > called `Result::unwrap()` on an `Err` value: PyErr { type: <class 'AssertionError'>, value: AssertionError(), traceback: Some("Traceback (most recent call last):\n File \"<string>\", line 39, in <module>\n") }
  356. 28.09 s > stack backtrace:
  357. 28.09 s > 0: __rustc::rust_begin_unwind
  358. 28.09 s > 1: core::panicking::panic_fmt
  359. 28.09 s > 2: core::result::unwrap_failed
  360. 28.09 s > 3: feynkit_py::tests::standalone_python_pipeline_covers_generation_graphs_cff_and_kinematics
  361. 28.09 s > 4: <feynkit_py::tests::standalone_python_pipeline_covers_generation_graphs_cff_and_kinematics::{closure#0} as core::ops::function::FnOnce<()>>::call_once
  362. 28.09 s > note: Some details are omitted, run with `RUST_BACKTRACE=full` for a verbose backtrace.
  363. 28.09 s >
  364. 28.09 s > error: test run failed
  365. 28.09 s >
  366. 28.09 s > ========== nextest test summary ==========
  367. 28.09 s > report: target/nextest/ci_gammaloop/junit.xml
  368. 28.09 s > tests: 15, failures: 1, errors: 0
  369. 28.09 s >
  370. 28.09 s > 1. feynkit-py::tests::standalone_python_pipeline_covers_generation_graphs_cff_and_kinematics
  371. 28.09 s > failure: test failure with exit code 101
  372. 28.09 s > thread 'tests::standalone_python_pipeline_covers_generation_graphs_cff_and_kinematics' (914) panicked at crates/feynkit-py/src/lib.rs:453:57:
  373. 28.09 s > called `Result::unwrap()` on an `Err` value: PyErr { type: <class 'AssertionError'>, value: AssertionError(), traceback: Some("Traceback (most recent call last):\n File \"<string>\", line 39, in <module>\n") }
  374. 28.09 s > stack backtrace:
  375. 28.09 s > 0: __rustc::rust_begin_unwind
  376. 28.09 s > 1: core::panicking::panic_fmt
  377. 28.09 s > 2: core::result::unwrap_failed
  378. 28.09 s > 3: feynkit_py::tests::standalone_python_pipeline_covers_generation_graphs_cff_and_kinematics
  379. 28.09 s > 4: <feynkit_py::tests::standalone_python_pipeline_covers_generation_graphs_cff_and_kinematics::{closure#0} as core::ops::function::FnOnce<()>>::call_once
  380. 28.09 s > note: Some details are omitted, run with `RUST_BACKTRACE=full` for a verbose backtrace.
  381. 28.09 s > system-out
  382. 28.09 s > running 1 test
  383. 28.09 s > test tests::standalone_python_pipeline_covers_generation_graphs_cff_and_kinematics ... FAILED
  384. 28.09 s >
  385. 28.09 s > failures:
  386. 28.09 s >
  387. 28.09 s > failures:
  388. 28.09 s > tests::standalone_python_pipeline_covers_generation_graphs_cff_and_kinematics
  389. 28.09 s >
  390. 28.09 s > test result: FAILED. 0 passed; 1 failed; 0 ignored; 0 measured; 13 filtered out; finished in 0.06s
  391. 28.09 s > system-err
  392. 28.09 s > thread 'tests::standalone_python_pipeline_covers_generation_graphs_cff_and_kinematics' (914) panicked at crates/feynkit-py/src/lib.rs:453:57:
  393. 28.09 s > called `Result::unwrap()` on an `Err` value: PyErr { type: <class 'AssertionError'>, value: AssertionError(), traceback: Some("Traceback (most recent call last):\n File \"<string>\", line 39, in <module>\n") }
  394. 28.09 s > stack backtrace:
  395. 28.09 s > 0: __rustc::rust_begin_unwind
  396. 28.09 s > 1: core::panicking::panic_fmt
  397. 28.09 s > 2: core::result::unwrap_failed
  398. 28.09 s > 3: feynkit_py::tests::standalone_python_pipeline_covers_generation_graphs_cff_and_kinematics
  399. 28.09 s > 4: <feynkit_py::tests::standalone_python_pipeline_covers_generation_graphs_cff_and_kinematics::{closure#0} as core::ops::function::FnOnce<()>>::call_once
  400. 28.09 s > note: Some details are omitted, run with `RUST_BACKTRACE=full` for a verbose backtrace.
  401. 28.09 s > =========================================
  402. 28.09 s > Extracting 1 binary and 2 linked paths to /build/source
  403. 28.09 s > Extracted 15 files to /build/source in 0.09s
  404. 28.09 s > ------------
  405. 28.09 s > Nextest run ID 6eea1038-9e0a-4482-8d19-83beaf5e7b41 with nextest profile: ci_gammaloop
  406. 28.09 s > Starting 45 tests across 1 binary (1 test skipped)
  407. 28.09 s > ------------
  408. 28.09 s > Summary [ 0.108s] 45 tests run: 45 passed, 1 skipped
  409. 28.09 s >
  410. 28.09 s > ========== nextest test summary ==========
  411. 28.09 s > report: target/nextest/ci_gammaloop/junit.xml
  412. 28.09 s > tests: 45, failures: 0, errors: 0
  413. 28.09 s > No failing testcases found.
  414. 28.09 s > =========================================
  415. 28.09 s > Extracting 1 binary and 2 linked paths to /build/source
  416. 28.09 s > Extracted 15 files to /build/source in 0.08s
  417. 28.09 s > ------------
  418. 28.09 s > Nextest run ID 5708c692-35f4-4723-a704-338e6cd75490 with nextest profile: ci_gammaloop
  419. 28.09 s > Starting 2 tests across 1 binary
  420. 28.09 s > ------------
  421. 28.09 s > Summary [ 0.017s] 2 tests run: 2 passed, 0 skipped
  422. 28.09 s >
  423. 28.09 s > ========== nextest test summary ==========
  424. 28.09 s > report: target/nextest/ci_gammaloop/junit.xml
  425. 28.09 s > tests: 2, failures: 0, errors: 0
  426. 28.09 s > No failing testcases found.
  427. 28.09 s > =========================================
  428. 28.09 s For full logs, run:
  429. 28.09 s nix log /nix/store/pw1sr1820qvjnnlcx6p7zykcgslr2apy-gammaloop-nextest-feynkit.drv
  430. 28.26 s Run failed.