1. 0.04 s $ /nix/store/61685rbaxmpigwi3z23i33sv3jyfl70q-coreutils-9.11/bin/timeout --kill-after=15s 7200s /nix/store/wknkybkzrc16r11vk5vrykh4wmw7a353-nix-2.34.8/bin/nix --extra-experimental-features nix-command --extra-experimental-features flakes flake clone git+https://github.com/alphal00p/gammaloop --dest /tmp/nix-ci-worker/stable-pwd/repo/
  2. 0.11 s Cloning into '/tmp/nix-ci-worker/stable-pwd/repo'...
  3. 0.86 s remote: Enumerating objects: 103390, done.
  4. 0.97 s remote: Counting objects: 0% (1/10104) remote: Counting objects: 1% (102/10104) remote: Counting objects: 2% (203/10104) remote: Counting objects: 3% (304/10104) remote: Counting objects: 4% (405/10104) remote: Counting objects: 5% (506/10104) remote: Counting objects: 6% (607/10104) remote: Counting objects: 7% (708/10104) remote: Counting objects: 8% (809/10104) remote: Counting objects: 9% (910/10104) remote: Counting objects: 10% (1011/10104) remote: Counting objects: 11% (1112/10104) remote: Counting objects: 12% (1213/10104) remote: Counting objects: 13% (1314/10104) remote: Counting objects: 14% (1415/10104) remote: Counting objects: 15% (1516/10104) remote: Counting objects: 16% (1617/10104) remote: Counting objects: 17% (1718/10104) remote: Counting objects: 18% (1819/10104) remote: Counting objects: 19% (1920/10104) remote: Counting objects: 20% (2021/10104) remote: Counting objects: 21% (2122/10104) remote: Counting objects: 22% (2223/10104) remote: Counting objects: 23% (2324/10104) remote: Counting objects: 24% (2425/10104) remote: Counting objects: 25% (2526/10104) remote: Counting objects: 26% (2628/10104) remote: Counting objects: 27% (2729/10104) remote: Counting objects: 28% (2830/10104) remote: Counting objects: 29% (2931/10104) remote: Counting objects: 30% (3032/10104) remote: Counting objects: 31% (3133/10104) remote: Counting objects: 32% (3234/10104) remote: Counting objects: 33% (3335/10104) remote: Counting objects: 34% (3436/10104) remote: Counting objects: 35% (3537/10104) remote: Counting objects: 36% (3638/10104) remote: Counting objects: 37% (3739/10104) remote: Counting objects: 38% (3840/10104) remote: Counting objects: 39% (3941/10104) remote: Counting objects: 40% (4042/10104) remote: Counting objects: 41% (4143/10104) remote: Counting objects: 42% (4244/10104) remote: Counting objects: 43% (4345/10104) remote: Counting objects: 44% (4446/10104) remote: Counting objects: 45% (4547/10104) remote: Counting objects: 46% (4648/10104) remote: Counting objects: 47% (4749/10104) remote: Counting objects: 48% (4850/10104) remote: Counting objects: 49% (4951/10104) remote: Counting objects: 50% (5052/10104) remote: Counting objects: 51% (5154/10104) remote: Counting objects: 52% (5255/10104) remote: Counting objects: 53% (5356/10104) remote: Counting objects: 54% (5457/10104) remote: Counting objects: 55% (5558/10104) remote: Counting objects: 56% (5659/10104) remote: Counting objects: 57% (5760/10104) remote: Counting objects: 58% (5861/10104) remote: Counting objects: 59% (5962/10104) remote: Counting objects: 60% (6063/10104) remote: Counting objects: 61% (6164/10104) remote: Counting objects: 62% (6265/10104) remote: Counting objects: 63% (6366/10104) remote: Counting objects: 64% (6467/10104) remote: Counting objects: 65% (6568/10104) remote: Counting objects: 66% (6669/10104) remote: Counting objects: 67% (6770/10104) remote: Counting objects: 68% (6871/10104) remote: Counting objects: 69% (6972/10104) remote: Counting objects: 70% (7073/10104) remote: Counting objects: 71% (7174/10104) remote: Counting objects: 72% (7275/10104) remote: Counting objects: 73% (7376/10104) remote: Counting objects: 74% (7477/10104) remote: Counting objects: 75% (7578/10104) remote: Counting objects: 76% (7680/10104) remote: Counting objects: 77% (7781/10104) remote: Counting objects: 78% (7882/10104) remote: Counting objects: 79% (7983/10104) remote: Counting objects: 80% (8084/10104) remote: Counting objects: 81% (8185/10104) remote: Counting objects: 82% (8286/10104) remote: Counting objects: 83% (8387/10104) remote: Counting objects: 84% (8488/10104) remote: Counting objects: 85% (8589/10104) remote: Counting objects: 86% (8690/10104) remote: Counting objects: 87% (8791/10104) remote: Counting objects: 88% (8892/10104) remote: Counting objects: 89% (8993/10104) remote: Counting objects: 90% (9094/10104) remote: Counting objects: 91% (9195/10104) remote: Counting objects: 92% (9296/10104) remote: Counting objects: 93% (9397/10104) remote: Counting objects: 94% (9498/10104) remote: Counting objects: 95% (9599/10104) remote: Counting objects: 96% (9700/10104) remote: Counting objects: 97% (9801/10104) remote: Counting objects: 98% (9902/10104) remote: Counting objects: 99% (10003/10104) remote: Counting objects: 100% (10104/10104) remote: Counting objects: 100% (10104/10104), done.
  5. 3.15 s remote: Compressing objects: 0% (1/2250) remote: Compressing objects: 1% (23/2250) remote: Compressing objects: 2% (45/2250) remote: Compressing objects: 3% (68/2250) remote: Compressing objects: 4% (90/2250) remote: Compressing objects: 5% (113/2250) remote: Compressing objects: 6% (135/2250) remote: Compressing objects: 7% (158/2250) remote: Compressing objects: 8% (180/2250) remote: Compressing objects: 9% (203/2250) remote: Compressing objects: 9% (216/2250) remote: Compressing objects: 10% (225/2250) remote: Compressing objects: 11% (248/2250) remote: Compressing objects: 12% (270/2250) remote: Compressing objects: 13% (293/2250) remote: Compressing objects: 14% (315/2250) remote: Compressing objects: 15% (338/2250) remote: Compressing objects: 16% (360/2250) remote: Compressing objects: 17% (383/2250) remote: Compressing objects: 18% (405/2250) remote: Compressing objects: 19% (428/2250) remote: Compressing objects: 20% (450/2250) remote: Compressing objects: 21% (473/2250) remote: Compressing objects: 22% (495/2250) remote: Compressing objects: 22% (506/2250) remote: Compressing objects: 23% (518/2250) remote: Compressing objects: 24% (540/2250) remote: Compressing objects: 25% (563/2250) remote: Compressing objects: 26% (585/2250) remote: Compressing objects: 27% (608/2250) remote: Compressing objects: 28% (630/2250) remote: Compressing objects: 29% (653/2250) remote: Compressing objects: 30% (675/2250) remote: Compressing objects: 31% (698/2250) remote: Compressing objects: 32% (720/2250) remote: Compressing objects: 33% (743/2250) remote: Compressing objects: 34% (765/2250) remote: Compressing objects: 35% (788/2250) remote: Compressing objects: 36% (810/2250) remote: Compressing objects: 37% (833/2250) remote: Compressing objects: 38% (855/2250) remote: Compressing objects: 39% (878/2250) remote: Compressing objects: 40% (900/2250) remote: Compressing objects: 41% (923/2250) remote: Compressing objects: 42% (945/2250) remote: Compressing objects: 43% (968/2250) remote: Compressing objects: 44% (990/2250) remote: Compressing objects: 45% (1013/2250) remote: Compressing objects: 46% (1035/2250) remote: Compressing objects: 47% (1058/2250) remote: Compressing objects: 48% (1080/2250) remote: Compressing objects: 49% (1103/2250) remote: Compressing objects: 50% (1125/2250) remote: Compressing objects: 51% (1148/2250) remote: Compressing objects: 52% (1170/2250) remote: Compressing objects: 53% (1193/2250) remote: Compressing objects: 54% (1215/2250) remote: Compressing objects: 55% (1238/2250) remote: Compressing objects: 56% (1260/2250) remote: Compressing objects: 57% (1283/2250) remote: Compressing objects: 58% (1305/2250) remote: Compressing objects: 59% (1328/2250) remote: Compressing objects: 60% (1350/2250) remote: Compressing objects: 61% (1373/2250) remote: Compressing objects: 62% (1395/2250) remote: Compressing objects: 63% (1418/2250) remote: Compressing objects: 64% (1440/2250) remote: Compressing objects: 65% (1463/2250) remote: Compressing objects: 66% (1485/2250) remote: Compressing objects: 67% (1508/2250) remote: Compressing objects: 68% (1530/2250) remote: Compressing objects: 69% (1553/2250) remote: Compressing objects: 70% (1575/2250) remote: Compressing objects: 71% (1598/2250) remote: Compressing objects: 72% (1620/2250) remote: Compressing objects: 73% (1643/2250) remote: Compressing objects: 74% (1665/2250) remote: Compressing objects: 75% (1688/2250) remote: Compressing objects: 76% (1710/2250) remote: Compressing objects: 77% (1733/2250) remote: Compressing objects: 78% (1755/2250) remote: Compressing objects: 79% (1778/2250) remote: Compressing objects: 80% (1800/2250) remote: Compressing objects: 81% (1823/2250) remote: Compressing objects: 82% (1845/2250) remote: Compressing objects: 83% (1868/2250) remote: Compressing objects: 84% (1890/2250) remote: Compressing objects: 85% (1913/2250) remote: Compressing objects: 86% (1935/2250) remote: Compressing objects: 87% (1958/2250) remote: Compressing objects: 88% (1980/2250) remote: Compressing objects: 89% (2003/2250) remote: Compressing objects: 90% (2025/2250) remote: Compressing objects: 91% (2048/2250) remote: Compressing objects: 92% (2070/2250) remote: Compressing objects: 93% (2093/2250) remote: Compressing objects: 94% (2115/2250) remote: Compressing objects: 95% (2138/2250) remote: Compressing objects: 96% (2160/2250) remote: Compressing objects: 97% (2183/2250) remote: Compressing objects: 98% (2205/2250) remote: Compressing objects: 99% (2228/2250) remote: Compressing objects: 100% (2250/2250) remote: Compressing objects: 100% (2250/2250), done.
  6. 14.40 s Receiving objects: 0% (1/103390) Receiving objects: 1% (1034/103390) Receiving objects: 2% (2068/103390) Receiving objects: 3% (3102/103390) Receiving objects: 4% (4136/103390) Receiving objects: 5% (5170/103390) Receiving objects: 6% (6204/103390) Receiving objects: 7% (7238/103390), 16.73 MiB | 33.44 MiB/s Receiving objects: 8% (8272/103390), 16.73 MiB | 33.44 MiB/s Receiving objects: 9% (9306/103390), 16.73 MiB | 33.44 MiB/s Receiving objects: 10% (10339/103390), 16.73 MiB | 33.44 MiB/s Receiving objects: 11% (11373/103390), 16.73 MiB | 33.44 MiB/s Receiving objects: 12% (12407/103390), 16.73 MiB | 33.44 MiB/s Receiving objects: 13% (13441/103390), 16.73 MiB | 33.44 MiB/s Receiving objects: 14% (14475/103390), 16.73 MiB | 33.44 MiB/s Receiving objects: 15% (15509/103390), 16.73 MiB | 33.44 MiB/s Receiving objects: 16% (16543/103390), 16.73 MiB | 33.44 MiB/s Receiving objects: 17% (17577/103390), 16.73 MiB | 33.44 MiB/s Receiving objects: 18% (18611/103390), 16.73 MiB | 33.44 MiB/s Receiving objects: 19% (19645/103390), 16.73 MiB | 33.44 MiB/s Receiving objects: 20% (20678/103390), 16.73 MiB | 33.44 MiB/s Receiving objects: 21% (21712/103390), 16.73 MiB | 33.44 MiB/s Receiving objects: 22% (22746/103390), 16.73 MiB | 33.44 MiB/s Receiving objects: 23% (23780/103390), 16.73 MiB | 33.44 MiB/s Receiving objects: 24% (24814/103390), 16.73 MiB | 33.44 MiB/s Receiving objects: 25% (25848/103390), 16.73 MiB | 33.44 MiB/s Receiving objects: 26% (26882/103390), 16.73 MiB | 33.44 MiB/s Receiving objects: 27% (27916/103390), 16.73 MiB | 33.44 MiB/s Receiving objects: 28% (28950/103390), 16.73 MiB | 33.44 MiB/s Receiving objects: 29% (29984/103390), 16.73 MiB | 33.44 MiB/s Receiving objects: 30% (31017/103390), 16.73 MiB | 33.44 MiB/s Receiving objects: 31% (32051/103390), 16.73 MiB | 33.44 MiB/s Receiving objects: 32% (33085/103390), 16.73 MiB | 33.44 MiB/s Receiving objects: 32% (34022/103390), 33.77 MiB | 33.76 MiB/s Receiving objects: 33% (34119/103390), 33.77 MiB | 33.76 MiB/s Receiving objects: 34% (35153/103390), 33.77 MiB | 33.76 MiB/s Receiving objects: 35% (36187/103390), 33.77 MiB | 33.76 MiB/s Receiving objects: 36% (37221/103390), 33.77 MiB | 33.76 MiB/s Receiving objects: 37% (38255/103390), 33.77 MiB | 33.76 MiB/s Receiving objects: 38% (39289/103390), 33.77 MiB | 33.76 MiB/s Receiving objects: 39% (40323/103390), 33.77 MiB | 33.76 MiB/s Receiving objects: 40% (41356/103390), 33.77 MiB | 33.76 MiB/s Receiving objects: 41% (42390/103390), 33.77 MiB | 33.76 MiB/s Receiving objects: 42% (43424/103390), 51.47 MiB | 34.31 MiB/s Receiving objects: 43% (44458/103390), 51.47 MiB | 34.31 MiB/s Receiving objects: 44% (45492/103390), 51.47 MiB | 34.31 MiB/s Receiving objects: 45% (46526/103390), 51.47 MiB | 34.31 MiB/s Receiving objects: 46% (47560/103390), 51.47 MiB | 34.31 MiB/s Receiving objects: 47% (48594/103390), 51.47 MiB | 34.31 MiB/s Receiving objects: 47% (49575/103390), 51.47 MiB | 34.31 MiB/s Receiving objects: 48% (49628/103390), 68.28 MiB | 34.14 MiB/s Receiving objects: 49% (50662/103390), 68.28 MiB | 34.14 MiB/s Receiving objects: 50% (51695/103390), 68.28 MiB | 34.14 MiB/s Receiving objects: 51% (52729/103390), 68.28 MiB | 34.14 MiB/s Receiving objects: 52% (53763/103390), 68.28 MiB | 34.14 MiB/s Receiving objects: 53% (54797/103390), 68.28 MiB | 34.14 MiB/s Receiving objects: 54% (55831/103390), 68.28 MiB | 34.14 MiB/s Receiving objects: 55% (56865/103390), 68.28 MiB | 34.14 MiB/s Receiving objects: 56% (57899/103390), 86.28 MiB | 34.00 MiB/s Receiving objects: 57% (58933/103390), 86.28 MiB | 34.00 MiB/s Receiving objects: 58% (59967/103390), 86.28 MiB | 34.00 MiB/s Receiving objects: 58% (60496/103390), 86.28 MiB | 34.00 MiB/s Receiving objects: 59% (61001/103390), 105.02 MiB | 34.54 MiB/s Receiving objects: 60% (62034/103390), 105.02 MiB | 34.54 MiB/s Receiving objects: 61% (63068/103390), 105.02 MiB | 34.54 MiB/s Receiving objects: 61% (64059/103390), 121.57 MiB | 34.34 MiB/s Receiving objects: 62% (64102/103390), 121.57 MiB | 34.34 MiB/s Receiving objects: 63% (65136/103390), 140.18 MiB | 34.70 MiB/s Receiving objects: 63% (66032/103390), 175.19 MiB | 34.90 MiB/s Receiving objects: 63% (66060/103390), 210.04 MiB | 34.67 MiB/s Receiving objects: 64% (66170/103390), 228.25 MiB | 34.95 MiB/s Receiving objects: 64% (66195/103390), 245.43 MiB | 35.05 MiB/s Receiving objects: 64% (66327/103390), 280.27 MiB | 34.98 MiB/s Receiving objects: 65% (67204/103390), 280.27 MiB | 34.98 MiB/s Receiving objects: 66% (68238/103390), 280.27 MiB | 34.98 MiB/s Receiving objects: 67% (69272/103390), 298.07 MiB | 34.80 MiB/s Receiving objects: 68% (70306/103390), 298.07 MiB | 34.80 MiB/s Receiving objects: 69% (71340/103390), 298.07 MiB | 34.80 MiB/s Receiving objects: 70% (72373/103390), 298.07 MiB | 34.80 MiB/s Receiving objects: 71% (73407/103390), 298.07 MiB | 34.80 MiB/s Receiving objects: 71% (73542/103390), 298.07 MiB | 34.80 MiB/s Receiving objects: 72% (74441/103390), 315.22 MiB | 34.94 MiB/s Receiving objects: 73% (75475/103390), 315.22 MiB | 34.94 MiB/s Receiving objects: 74% (76509/103390), 315.22 MiB | 34.94 MiB/s Receiving objects: 75% (77543/103390), 315.22 MiB | 34.94 MiB/s Receiving objects: 76% (78577/103390), 315.22 MiB | 34.94 MiB/s Receiving objects: 77% (79611/103390), 315.22 MiB | 34.94 MiB/s Receiving objects: 78% (80645/103390), 315.22 MiB | 34.94 MiB/s Receiving objects: 79% (81679/103390), 315.22 MiB | 34.94 MiB/s Receiving objects: 80% (82712/103390), 315.22 MiB | 34.94 MiB/s Receiving objects: 81% (83746/103390), 315.22 MiB | 34.94 MiB/s Receiving objects: 82% (84780/103390), 333.36 MiB | 34.86 MiB/s Receiving objects: 82% (85811/103390), 333.36 MiB | 34.86 MiB/s Receiving objects: 83% (85814/103390), 333.36 MiB | 34.86 MiB/s Receiving objects: 84% (86848/103390), 350.37 MiB | 34.95 MiB/s Receiving objects: 85% (87882/103390), 350.37 MiB | 34.95 MiB/s Receiving objects: 86% (88916/103390), 368.43 MiB | 34.93 MiB/s Receiving objects: 87% (89950/103390), 368.43 MiB | 34.93 MiB/s Receiving objects: 88% (90984/103390), 368.43 MiB | 34.93 MiB/s Receiving objects: 89% (92018/103390), 368.43 MiB | 34.93 MiB/s Receiving objects: 89% (92864/103390), 368.43 MiB | 34.93 MiB/s Receiving objects: 90% (93051/103390), 368.43 MiB | 34.93 MiB/s Receiving objects: 91% (94085/103390), 368.43 MiB | 34.93 MiB/s Receiving objects: 92% (95119/103390), 368.43 MiB | 34.93 MiB/s Receiving objects: 93% (96153/103390), 368.43 MiB | 34.93 MiB/s Receiving objects: 94% (97187/103390), 368.43 MiB | 34.93 MiB/s Receiving objects: 95% (98221/103390), 386.86 MiB | 35.01 MiB/s Receiving objects: 96% (99255/103390), 386.86 MiB | 35.01 MiB/s Receiving objects: 97% (100289/103390), 386.86 MiB | 35.01 MiB/s Receiving objects: 98% (101323/103390), 386.86 MiB | 35.01 MiB/s Receiving objects: 99% (102357/103390), 386.86 MiB | 35.01 MiB/s remote: Total 103390 (delta 8622), reused 8039 (delta 7829), pack-reused 93286 (from 4)
  7. 14.40 s Receiving objects: 100% (103390/103390), 386.86 MiB | 35.01 MiB/s Receiving objects: 100% (103390/103390), 391.81 MiB | 34.84 MiB/s, done.
  8. 15.60 s Resolving deltas: 0% (0/67724) Resolving deltas: 1% (678/67724) Resolving deltas: 2% (1355/67724) Resolving deltas: 3% (2032/67724) Resolving deltas: 4% (2709/67724) Resolving deltas: 5% (3387/67724) Resolving deltas: 6% (4066/67724) Resolving deltas: 7% (4741/67724) Resolving deltas: 8% (5418/67724) Resolving deltas: 9% (6096/67724) Resolving deltas: 10% (6773/67724) Resolving deltas: 11% (7450/67724) Resolving deltas: 12% (8127/67724) Resolving deltas: 13% (8805/67724) Resolving deltas: 14% (9482/67724) Resolving deltas: 15% (10159/67724) Resolving deltas: 16% (10836/67724) Resolving deltas: 17% (11514/67724) Resolving deltas: 18% (12191/67724) Resolving deltas: 19% (12870/67724) Resolving deltas: 20% (13545/67724) Resolving deltas: 21% (14223/67724) Resolving deltas: 22% (14900/67724) Resolving deltas: 23% (15577/67724) Resolving deltas: 24% (16255/67724) Resolving deltas: 25% (16932/67724) Resolving deltas: 26% (17609/67724) Resolving deltas: 27% (18287/67724) Resolving deltas: 28% (18963/67724) Resolving deltas: 29% (19640/67724) Resolving deltas: 30% (20318/67724) Resolving deltas: 31% (20996/67724) Resolving deltas: 32% (21673/67724) Resolving deltas: 33% (22349/67724) Resolving deltas: 34% (23027/67724) Resolving deltas: 35% (23704/67724) Resolving deltas: 36% (24385/67724) Resolving deltas: 37% (25058/67724) Resolving deltas: 38% (25736/67724) Resolving deltas: 39% (26413/67724) Resolving deltas: 40% (27090/67724) Resolving deltas: 41% (27769/67724) Resolving deltas: 42% (28445/67724) Resolving deltas: 43% (29126/67724) Resolving deltas: 44% (29800/67724) Resolving deltas: 45% (30476/67724) Resolving deltas: 46% (31154/67724) Resolving deltas: 47% (31831/67724) Resolving deltas: 48% (32510/67724) Resolving deltas: 49% (33185/67724) Resolving deltas: 50% (33862/67724) Resolving deltas: 51% (34540/67724) Resolving deltas: 52% (35220/67724) Resolving deltas: 53% (35894/67724) Resolving deltas: 54% (36572/67724) Resolving deltas: 55% (37249/67724) Resolving deltas: 56% (37926/67724) Resolving deltas: 57% (38603/67724) Resolving deltas: 58% (39280/67724) Resolving deltas: 59% (39958/67724) Resolving deltas: 60% (40635/67724) Resolving deltas: 61% (41312/67724) Resolving deltas: 62% (41990/67724) Resolving deltas: 63% (42667/67724) Resolving deltas: 64% (43344/67724) Resolving deltas: 65% (44021/67724) Resolving deltas: 66% (44698/67724) Resolving deltas: 67% (45376/67724) Resolving deltas: 68% (46053/67724) Resolving deltas: 69% (46732/67724) Resolving deltas: 70% (47407/67724) Resolving deltas: 71% (48086/67724) Resolving deltas: 72% (48765/67724) Resolving deltas: 73% (49441/67724) Resolving deltas: 74% (50118/67724) Resolving deltas: 75% (50793/67724) Resolving deltas: 76% (51471/67724) Resolving deltas: 77% (52148/67724) Resolving deltas: 78% (52825/67724) Resolving deltas: 79% (53502/67724) Resolving deltas: 80% (54180/67724) Resolving deltas: 81% (54857/67724) Resolving deltas: 82% (55535/67724) Resolving deltas: 82% (55805/67724) Resolving deltas: 83% (56211/67724) Resolving deltas: 84% (56889/67724) Resolving deltas: 85% (57566/67724) Resolving deltas: 86% (58243/67724) Resolving deltas: 87% (58920/67724) Resolving deltas: 88% (59599/67724) Resolving deltas: 89% (60276/67724) Resolving deltas: 90% (60952/67724) Resolving deltas: 91% (61629/67724) Resolving deltas: 92% (62307/67724) Resolving deltas: 93% (62984/67724) Resolving deltas: 94% (63661/67724) Resolving deltas: 95% (64338/67724) Resolving deltas: 96% (65017/67724) Resolving deltas: 97% (65693/67724) Resolving deltas: 98% (66370/67724) Resolving deltas: 99% (67047/67724) Resolving deltas: 100% (67724/67724) Resolving deltas: 100% (67724/67724), done.
  9. 16.22 s Fetching commit 0afa8ad228d762fc4c781c8dbec2e17f2eb2f1c6 for feynkit ...
  10. 16.22 s $ /nix/store/5vpcfsdx1lcnlb2y4k7xyc74shp5qwbh-git-2.54.0/bin/git fetch origin 0afa8ad228d762fc4c781c8dbec2e17f2eb2f1c6
  11. 16.65 s From https://github.com/alphal00p/gammaloop
  12. 16.65 s * branch 0afa8ad228d762fc4c781c8dbec2e17f2eb2f1c6 -> FETCH_HEAD
  13. 16.66 s $ /nix/store/61685rbaxmpigwi3z23i33sv3jyfl70q-coreutils-9.11/bin/timeout --kill-after=15s 7200s /nix/store/5vpcfsdx1lcnlb2y4k7xyc74shp5qwbh-git-2.54.0/bin/git -c advice.detachedHead=false checkout 0afa8ad228d762fc4c781c8dbec2e17f2eb2f1c6
  14. 16.89 s HEAD is now at 0afa8ad22 align generation defaults and avoid repeated numerator expansion
  15. 16.89 s $ /nix/store/61685rbaxmpigwi3z23i33sv3jyfl70q-coreutils-9.11/bin/timeout --kill-after=15s 7200s /nix/store/wknkybkzrc16r11vk5vrykh4wmw7a353-nix-2.34.8/bin/nix --extra-experimental-features nix-command --extra-experimental-features flakes --log-format internal-json run .#packages.x86_64-linux.nix-ci-check-gammaloop-nextest-core --print-build-logs
  16. 17.30 s warning: ignoring untrusted flake configuration setting 'extra-substituters'.
  17. 17.30 s Pass '--accept-flake-config' to trust it
  18. 17.30 s warning: ignoring untrusted flake configuration setting 'extra-trusted-public-keys'.
  19. 17.30 s Pass '--accept-flake-config' to trust it
  20. 17.34 s
  21. 17.85 s Downloading cached source from https://cache.nix-ci.com
  22. 24.59 s Downloaded cached source (204.9 MiB) in 6.7s
  23. 24.59 s Progress: 1 of 1 downloaded from cache
  24. 39.89 s
  25. 39.89 s Downloading cached xgcc-15.3.0-libgcc from https://cache.nix-ci.com
  26. 39.90 s Downloading cached busybox from https://cache.nix-ci.com
  27. 39.90 s Downloading cached gcc-15.3.0-libgcc from https://cache.nix-ci.com
  28. 39.90 s Downloading cached libunistring from https://cache.nix-ci.com
  29. 39.90 s Downloading cached publicsuffix-list-0-unstable-2026-09 from https://cache.nix-ci.com
  30. 39.91 s Downloaded cached xgcc-15.3.0-libgcc (193 KiB) in 16ms
  31. 39.91 s Progress: 0 of 1 built, 1 of 65 downloaded from cache (4 downloading)
  32. 39.91 s Downloaded cached gcc-15.3.0-libgcc (193 KiB) in 15ms
  33. 39.91 s Progress: 0 of 1 built, 2 of 65 downloaded from cache (3 downloading)
  34. 39.91 s Downloaded cached busybox (230 KiB) in 16ms
  35. 39.91 s Progress: 0 of 1 built, 3 of 65 downloaded from cache (2 downloading)
  36. 39.91 s Downloaded cached publicsuffix-list-0-unstable-2026-09 (330 KiB) in 15ms
  37. 39.91 s Progress: 0 of 1 built, 4 of 65 downloaded from cache (1 downloading)
  38. 40.02 s Downloaded cached libunistring (2 MiB) in 122ms
  39. 40.02 s Progress: 0 of 1 built, 5 of 65 downloaded from cache
  40. 40.02 s Downloading cached libidn2 from https://cache.nix-ci.com
  41. 40.04 s Downloaded cached libidn2 (359 KiB) in 18ms
  42. 40.04 s Progress: 0 of 1 built, 6 of 65 downloaded from cache
  43. 40.04 s Downloading cached glibc-2.42 from https://cache.nix-ci.com
  44. 40.19 s Downloaded cached glibc-2.42 (33.4 MiB) in 154ms
  45. 40.19 s Progress: 0 of 1 built, 7 of 65 downloaded from cache
  46. 40.19 s Downloading cached acl from https://cache.nix-ci.com
  47. 40.19 s Downloading cached aws-c-common from https://cache.nix-ci.com
  48. 40.19 s Downloading cached bash from https://cache.nix-ci.com
  49. 40.19 s Downloading cached brotli-1.2.0-lib from https://cache.nix-ci.com
  50. 40.19 s Downloading cached bzip2 from https://cache.nix-ci.com
  51. 40.19 s Downloading cached editline-1.17.1-unstable-2025-05 from https://cache.nix-ci.com
  52. 40.19 s Downloading cached gcc-15.3.0-lib from https://cache.nix-ci.com
  53. 40.19 s Downloading cached hwloc-2.14.0-lib from https://cache.nix-ci.com
  54. 40.19 s Downloading cached keyutils-1.6.3-lib from https://cache.nix-ci.com
  55. 40.19 s Downloading cached libcpuid from https://cache.nix-ci.com
  56. 40.19 s Downloading cached libpsl from https://cache.nix-ci.com
  57. 40.19 s Downloading cached libseccomp-2.6.1-lib from https://cache.nix-ci.com
  58. 40.19 s Downloading cached libsodium-1.0.22-unstable-2026-08 from https://cache.nix-ci.com
  59. 40.19 s Downloading cached libxml2 from https://cache.nix-ci.com
  60. 40.19 s Downloading cached llhttp from https://cache.nix-ci.com
  61. 40.19 s Downloading cached lowdown-3.0.1-lib from https://cache.nix-ci.com
  62. 40.21 s Downloaded cached acl (134 KiB) in 21ms
  63. 40.21 s Progress: 0 of 1 built, 8 of 65 downloaded from cache (15 downloading)
  64. 40.21 s Downloading cached nghttp2-1.70.0-lib from https://cache.nix-ci.com
  65. 40.22 s Downloaded cached editline-1.17.1-unstable-2025-05 (58 KiB) in 23ms
  66. 40.22 s Progress: 0 of 1 built, 9 of 65 downloaded from cache (15 downloading)
  67. 40.22 s Downloading cached nghttp3 from https://cache.nix-ci.com
  68. 40.22 s Downloaded cached bzip2 (86 KiB) in 26ms
  69. 40.22 s Progress: 0 of 1 built, 10 of 65 downloaded from cache (15 downloading)
  70. 40.22 s Downloaded cached hwloc-2.14.0-lib (458 KiB) in 25ms
  71. 40.22 s Progress: 0 of 1 built, 11 of 65 downloaded from cache (15 downloading)
  72. 40.22 s Downloaded cached keyutils-1.6.3-lib (41 KiB) in 25ms
  73. 40.22 s Downloading cached openssl from https://cache.nix-ci.com
  74. 40.22 s Downloading cached pcre2 from https://cache.nix-ci.com
  75. 40.22 s Progress: 0 of 1 built, 12 of 65 downloaded from cache (15 downloading)
  76. 40.22 s Downloading cached xz from https://cache.nix-ci.com
  77. 40.22 s Downloaded cached aws-c-common (1.1 MiB) in 30ms
  78. 40.22 s Progress: 0 of 1 built, 13 of 65 downloaded from cache (15 downloading)
  79. 40.22 s Downloading cached zlib from https://cache.nix-ci.com
  80. 40.23 s Downloaded cached brotli-1.2.0-lib (961 KiB) in 32ms
  81. 40.23 s Progress: 0 of 1 built, 14 of 65 downloaded from cache (15 downloading)
  82. 40.23 s Downloading cached aws-c-compression from https://cache.nix-ci.com
  83. 40.23 s Downloaded cached llhttp (89 KiB) in 35ms
  84. 40.23 s Progress: 0 of 1 built, 15 of 65 downloaded from cache (15 downloading)
  85. 40.23 s Downloading cached aws-c-sdkutils from https://cache.nix-ci.com
  86. 40.23 s Downloaded cached libcpuid (326 KiB) in 35ms
  87. 40.23 s Progress: 0 of 1 built, 16 of 65 downloaded from cache (15 downloading)
  88. 40.23 s Downloading cached aws-checksums from https://cache.nix-ci.com
  89. 40.24 s Downloaded cached libseccomp-2.6.1-lib (189 KiB) in 49ms
  90. 40.24 s Progress: 0 of 1 built, 17 of 65 downloaded from cache (15 downloading)
  91. 40.25 s Downloaded cached lowdown-3.0.1-lib (341 KiB) in 51ms
  92. 40.25 s Progress: 0 of 1 built, 18 of 65 downloaded from cache (14 downloading)
  93. 40.25 s Downloaded cached aws-c-compression (31 KiB) in 21ms
  94. 40.25 s Progress: 0 of 1 built, 19 of 65 downloaded from cache (13 downloading)
  95. 40.25 s Downloaded cached libpsl (114 KiB) in 54ms
  96. 40.25 s Progress: 0 of 1 built, 20 of 65 downloaded from cache (12 downloading)
  97. 40.25 s Downloaded cached zlib (129 KiB) in 25ms
  98. 40.25 s Downloaded cached nghttp3 (228 KiB) in 32ms
  99. 40.25 s Progress: 0 of 1 built, 21 of 65 downloaded from cache (11 downloading)
  100. 40.25 s Downloaded cached nghttp2-1.70.0-lib (225 KiB) in 35ms
  101. 40.25 s Downloading cached sqlite from https://cache.nix-ci.com
  102. 40.25 s Progress: 0 of 1 built, 22 of 65 downloaded from cache (11 downloading)
  103. 40.25 s Progress: 0 of 1 built, 23 of 65 downloaded from cache (10 downloading)
  104. 40.25 s Downloaded cached aws-c-sdkutils (155 KiB) in 23ms
  105. 40.25 s Progress: 0 of 1 built, 24 of 65 downloaded from cache (9 downloading)
  106. 40.26 s Downloaded cached libsodium-1.0.22-unstable-2026-08 (669 KiB) in 64ms
  107. 40.26 s Progress: 0 of 1 built, 25 of 65 downloaded from cache (8 downloading)
  108. 40.26 s Downloaded cached aws-checksums (86 KiB) in 28ms
  109. 40.26 s Progress: 0 of 1 built, 26 of 65 downloaded from cache (7 downloading)
  110. 40.26 s Downloaded cached xz (837 KiB) in 43ms
  111. 40.26 s Progress: 0 of 1 built, 27 of 65 downloaded from cache (6 downloading)
  112. 40.27 s Downloaded cached bash (1.8 MiB) in 75ms
  113. 40.27 s Progress: 0 of 1 built, 28 of 65 downloaded from cache (5 downloading)
  114. 40.27 s Downloaded cached libxml2 (1.4 MiB) in 79ms
  115. 40.27 s Progress: 0 of 1 built, 29 of 65 downloaded from cache (4 downloading)
  116. 40.27 s Downloaded cached pcre2 (2 MiB) in 54ms
  117. 40.27 s Progress: 0 of 1 built, 30 of 65 downloaded from cache (3 downloading)
  118. 40.33 s Downloaded cached gcc-15.3.0-lib (9.8 MiB) in 132ms
  119. 40.33 s Progress: 0 of 1 built, 31 of 65 downloaded from cache (2 downloading)
  120. 40.33 s Downloading cached boehm-gc from https://cache.nix-ci.com
  121. 40.33 s Downloading cached icu4c from https://cache.nix-ci.com
  122. 40.33 s Downloading cached onetbb from https://cache.nix-ci.com
  123. 40.33 s Downloading cached zstd from https://cache.nix-ci.com
  124. 40.34 s Downloaded cached openssl (8.9 MiB) in 116ms
  125. 40.34 s Progress: 0 of 1 built, 32 of 65 downloaded from cache (5 downloading)
  126. 40.34 s Downloading cached aws-c-cal from https://cache.nix-ci.com
  127. 40.34 s Downloading cached krb5-1.22.2-lib from https://cache.nix-ci.com
  128. 40.34 s Downloading cached libssh2 from https://cache.nix-ci.com
  129. 40.34 s Downloading cached ngtcp2 from https://cache.nix-ci.com
  130. 40.34 s Downloading cached s2n-tls from https://cache.nix-ci.com
  131. 40.34 s Downloaded cached sqlite (5.7 MiB) in 86ms
  132. 40.34 s Progress: 0 of 1 built, 33 of 65 downloaded from cache (9 downloading)
  133. 40.35 s Downloaded cached zstd (1.1 MiB) in 21ms
  134. 40.35 s Progress: 0 of 1 built, 34 of 65 downloaded from cache (8 downloading)
  135. 40.35 s Downloading cached libarchive-3.8.9-lib from https://cache.nix-ci.com
  136. 40.35 s Downloaded cached boehm-gc (312 KiB) in 23ms
  137. 40.35 s Progress: 0 of 1 built, 35 of 65 downloaded from cache (8 downloading)
  138. 40.36 s Downloaded cached ngtcp2 (515 KiB) in 20ms
  139. 40.36 s Progress: 0 of 1 built, 36 of 65 downloaded from cache (7 downloading)
  140. 40.36 s Downloaded cached s2n-tls (1.3 MiB) in 28ms
  141. 40.36 s Progress: 0 of 1 built, 37 of 65 downloaded from cache (6 downloading)
  142. 40.37 s Downloaded cached libssh2 (330 KiB) in 31ms
  143. 40.37 s Progress: 0 of 1 built, 38 of 65 downloaded from cache (5 downloading)
  144. 40.37 s Downloading cached libgit2-1.9.7-lib from https://cache.nix-ci.com
  145. 40.38 s Downloaded cached aws-c-cal (158 KiB) in 47ms
  146. 40.38 s Progress: 0 of 1 built, 39 of 65 downloaded from cache (5 downloading)
  147. 40.38 s Downloading cached aws-c-io from https://cache.nix-ci.com
  148. 40.39 s Downloaded cached krb5-1.22.2-lib (2.7 MiB) in 49ms
  149. 40.39 s Progress: 0 of 1 built, 40 of 65 downloaded from cache (5 downloading)
  150. 40.39 s Downloading cached curl from https://cache.nix-ci.com
  151. 40.39 s Downloaded cached onetbb (626 KiB) in 60ms
  152. 40.39 s Progress: 0 of 1 built, 41 of 65 downloaded from cache (5 downloading)
  153. 40.39 s Downloading cached libblake3 from https://cache.nix-ci.com
  154. 40.39 s Downloaded cached libarchive-3.8.9-lib (961 KiB) in 39ms
  155. 40.39 s Progress: 0 of 1 built, 42 of 65 downloaded from cache (5 downloading)
  156. 40.41 s Downloaded cached libgit2-1.9.7-lib (1.6 MiB) in 37ms
  157. 40.41 s Progress: 0 of 1 built, 43 of 65 downloaded from cache (4 downloading)
  158. 40.42 s Downloaded cached libblake3 (117 KiB) in 31ms
  159. 40.42 s Progress: 0 of 1 built, 44 of 65 downloaded from cache (3 downloading)
  160. 40.42 s Downloaded cached aws-c-io (648 KiB) in 36ms
  161. 40.42 s Progress: 0 of 1 built, 45 of 65 downloaded from cache (2 downloading)
  162. 40.42 s Downloading cached aws-c-event-stream from https://cache.nix-ci.com
  163. 40.42 s Downloading cached aws-c-http from https://cache.nix-ci.com
  164. 40.42 s Downloaded cached curl (1.2 MiB) in 36ms
  165. 40.42 s Progress: 0 of 1 built, 46 of 65 downloaded from cache (3 downloading)
  166. 40.45 s Downloaded cached aws-c-http (641 KiB) in 30ms
  167. 40.45 s Progress: 0 of 1 built, 47 of 65 downloaded from cache (2 downloading)
  168. 40.45 s Downloading cached aws-c-auth from https://cache.nix-ci.com
  169. 40.45 s Downloading cached aws-c-mqtt from https://cache.nix-ci.com
  170. 40.45 s Downloaded cached aws-c-event-stream (176 KiB) in 33ms
  171. 40.45 s Progress: 0 of 1 built, 48 of 65 downloaded from cache (3 downloading)
  172. 40.49 s Downloaded cached aws-c-auth (387 KiB) in 36ms
  173. 40.49 s Progress: 0 of 1 built, 49 of 65 downloaded from cache (2 downloading)
  174. 40.49 s Downloading cached aws-c-s3 from https://cache.nix-ci.com
  175. 40.49 s Downloaded cached aws-c-mqtt (557 KiB) in 43ms
  176. 40.49 s Progress: 0 of 1 built, 50 of 65 downloaded from cache (2 downloading)
  177. 40.52 s Downloaded cached aws-c-s3 (384 KiB) in 30ms
  178. 40.52 s Progress: 0 of 1 built, 51 of 65 downloaded from cache (1 downloading)
  179. 40.52 s Downloading cached aws-crt-cpp from https://cache.nix-ci.com
  180. 40.52 s Downloaded cached icu4c (39.5 MiB) in 193ms
  181. 40.52 s Progress: 0 of 1 built, 52 of 65 downloaded from cache (1 downloading)
  182. 40.52 s Downloading cached boost from https://cache.nix-ci.com
  183. 40.53 s Downloaded cached aws-crt-cpp (979 KiB) in 15ms
  184. 40.53 s Progress: 0 of 1 built, 53 of 65 downloaded from cache (1 downloading)
  185. 40.58 s Downloaded cached boost (14.5 MiB) in 55ms
  186. 40.58 s Progress: 0 of 1 built, 54 of 65 downloaded from cache
  187. 40.58 s Downloading cached nix-util from https://cache.nix-ci.com
  188. 40.60 s Downloaded cached nix-util (2.4 MiB) in 21ms
  189. 40.60 s Progress: 0 of 1 built, 55 of 65 downloaded from cache
  190. 40.60 s Downloading cached nix-nswrapper from https://cache.nix-ci.com
  191. 40.60 s Downloading cached nix-store from https://cache.nix-ci.com
  192. 40.61 s Downloaded cached nix-nswrapper (131 KiB) in 12ms
  193. 40.61 s Progress: 0 of 1 built, 56 of 65 downloaded from cache (1 downloading)
  194. 40.63 s Downloaded cached nix-store (5.8 MiB) in 30ms
  195. 40.63 s Progress: 0 of 1 built, 57 of 65 downloaded from cache
  196. 40.63 s Downloading cached nix-fetchers from https://cache.nix-ci.com
  197. 40.63 s Downloading cached nix-main from https://cache.nix-ci.com
  198. 40.65 s Downloaded cached nix-main (393 KiB) in 16ms
  199. 40.65 s Progress: 0 of 1 built, 58 of 65 downloaded from cache (1 downloading)
  200. 40.65 s Downloaded cached nix-fetchers (1.5 MiB) in 21ms
  201. 40.65 s Progress: 0 of 1 built, 59 of 65 downloaded from cache
  202. 40.65 s Downloading cached nix-expr from https://cache.nix-ci.com
  203. 40.67 s Downloaded cached nix-expr (3.3 MiB) in 23ms
  204. 40.67 s Progress: 0 of 1 built, 60 of 65 downloaded from cache
  205. 40.67 s Downloading cached nix-flake from https://cache.nix-ci.com
  206. 40.69 s Downloaded cached nix-flake (956 KiB) in 16ms
  207. 40.69 s Progress: 0 of 1 built, 61 of 65 downloaded from cache
  208. 40.69 s Downloading cached nix-cmd from https://cache.nix-ci.com
  209. 40.71 s Downloaded cached nix-cmd (1 MiB) in 22ms
  210. 40.71 s Progress: 0 of 1 built, 62 of 65 downloaded from cache
  211. 40.71 s Downloading cached nix from https://cache.nix-ci.com
  212. 40.80 s Downloaded cached nix (3.9 MiB) in 83ms
  213. 40.80 s Progress: 0 of 1 built, 63 of 65 downloaded from cache
  214. 40.80 s Downloading cached nix from https://cache.nix-ci.com
  215. 40.81 s Downloaded cached nix (8848 B) in 13ms
  216. 40.81 s Progress: 0 of 1 built, 64 of 65 downloaded from cache
  217. 40.81 s Downloading cached nix-ci-check-gammaloop-nextest-core from https://cache.nix-ci.com
  218. 40.82 s Downloaded cached nix-ci-check-gammaloop-nextest-core (1128 B) in 4ms
  219. 40.82 s Progress: 0 of 1 built, 65 of 65 downloaded from cache
  220. 40.98 s evaluating derivation 'gdo you want to allow configuration setting 'extra-substituters' to be set to 'https://cache.nix-ci.com' (y/N)? do you want to permanently mark this value as untrusted (y/N)? warning: ignoring untrusted flake configuration setting 'extra-substituters'.
  221. 40.98 s Pass '--accept-flake-config' to trust it
  222. 40.98 s do you want to allow configuration setting 'extra-trusted-public-keys' to be set to 'nix-ci:g3xV5BDTLtIBZr/A00IU1x0EtKKlb7YLgBN2SgYgM6A=' (y/N)? do you want to permanently mark this value as untrusted (y/N)? warning: ignoring untrusted flake configuration setting 'extra-trusted-public-keys'.
  223. 40.98 s Pass '--accept-flake-config' to trust it
  224. 46.29 s copying '/nix/store/s70x evaluating derivation 'g copying '/nix/store/s70x evaluating derivation 'g copying '/nix/store/s70x evaluating derivation 'g copying '/nix/store/s70x evaluating derivation 'g copying '/nix/store/s70x evaluating derivation 'g copying '/nix/store/s70x evaluating derivation 'g querying gammaloop-nexte [19.3/18.6 KiB DL] query [0/26 built, 0/64 copied [0/27 built, 16/8/68 cop [0/26 built, 16/14/68 co [0/25 built, 16/21/68 co [0/25 built, 16/24/68 co [0/25 built, 16/27/68 co [0/21 built, 16/36/68 co [0/21 built, 16/40/68 co [0/20 built, 14/46/68 co [0/19 built, 10/51/68 co [0/18 built, 9/54/68 cop [1/0/18 built, 9/54/68 ccrane-dummy-cargo-target.rs> structuredAttrs is enabled
  225. 46.31 s [2/0/18 built, 9/54/68 ccrane-dummy-cargo-target.rs (post)> Uploading to the NixCI cache: /nix/store/h9idxv2cp1lvcmhzmgqyh438ad00r3gj-crane-dummy-cargo-target.rs
  226. 46.37 s crane-dummy-cargo-target.rs (post)> warning: 'warn-short-path-literals' is deprecated, use 'lint-short-path-literals = ignore' instead
  227. 46.41 s crane-dummy-cargo-target.rs (post)> copying 0 paths...
  228. 46.48 s crane-dummy-cargo-target.rs (post)> warning: 'warn-short-path-literals' is deprecated, use 'lint-short-path-literals = ignore' instead
  229. 47.32 s crane-dummy-cargo-target.rs (post)> copying 0 paths...
  230. 47.34 s crane-dummy-proc-macro-cargo-target.rs> structuredAttrs is enabled
  231. 47.36 s [1/1/18 built, 5/58/68 ccrane-dummy-proc-macro-cargo-target.rs (post)> Uploading to the NixCI cache: /nix/store/pqldjybaz45ml2lph0qcpw3vpa5j90n9-crane-dummy-proc-macro-cargo-target.rs
  232. 47.41 s [1/1/17 built, 8/58/68 ccrane-dummy-proc-macro-cargo-target.rs (post)> warning: 'warn-short-path-literals' is deprecated, use 'lint-short-path-literals = ignore' instead
  233. 47.47 s crane-dummy-proc-macro-cargo-target.rs (post)> copying 0 paths...
  234. 47.55 s crane-dummy-proc-macro-cargo-target.rs (post)> warning: 'warn-short-path-literals' is deprecated, use 'lint-short-path-literals = ignore' instead
  235. 47.64 s crane-dummy-proc-macro-cargo-target.rs (post)> copying 0 paths...
  236. 48.94 s [2/15 built, 6/60/68 cop [2/14 built, 5/61/68 cop [2/13 built, 5/62/68 cop [2/12 built, 4/63/68 cop [2/11 built, 3/64/68 cop [2/10 built, 2/65/68 cop [1/2/9 built, 1/66/68 cogammaloop-nextest-binaries-core (post)> Uploading to the NixCI cache: /nix/store/130an616afsz7nsgfv2vjyabn9fw265r-gammaloop-nextest-binaries-core
  237. 48.98 s gammaloop-nextest-binaries-core (post)> warning: 'warn-short-path-literals' is deprecated, use 'lint-short-path-literals = ignore' instead
  238. 49.01 s gammaloop-nextest-binaries-core (post)> copying 0 paths...
  239. 49.07 s gammaloop-nextest-binaries-core (post)> warning: 'warn-short-path-literals' is deprecated, use 'lint-short-path-literals = ignore' instead
  240. 51.30 s gammaloop-nextest-binaries-core (post)> copying 0 paths...
  241. 51.69 s [3/8 built, 1/67/68 copi [1/3/8 built, 1/67/68 co [2/3/7 built, 68 copied rust-stable-with-std (post)> Uploading to the NixCI cache: /nix/store/wg9kw4yhn1jn01mjs8cwx5mz69l1s64z-rust-stable-with-std-2026-09-03
  242. 51.73 s rust-stable-with-std (post)> warning: 'warn-short-path-literals' is deprecated, use 'lint-short-path-literals = ignore' instead
  243. 51.76 s rust-stable-with-std (post)> copying 0 paths...
  244. 51.80 s rust-stable-with-std (post)> warning: 'warn-short-path-literals' is deprecated, use 'lint-short-path-literals = ignore' instead
  245. 51.85 s rust-stable-with-std (post)> copying 0 paths...
  246. 52.02 s [1/4/8 built, 68 copied clippy-stable-with-std (post)> Uploading to the NixCI cache: /nix/store/s9nslw8h7m9vh88zd2hilmjb298pfca4-clippy-stable-with-std-2026-09-03
  247. 52.07 s clippy-stable-with-std (post)> warning: 'warn-short-path-literals' is deprecated, use 'lint-short-path-literals = ignore' instead
  248. 52.09 s clippy-stable-with-std (post)> copying 0 paths...
  249. 52.15 s clippy-stable-with-std (post)> warning: 'warn-short-path-literals' is deprecated, use 'lint-short-path-literals = ignore' instead
  250. 52.20 s clippy-stable-with-std (post)> copying 0 paths...
  251. 52.28 s [5/8 built, 68 copied (1rust-stable-with-components> /nix/store/wg9kw4yhn1jn01mjs8cwx5mz69l1s64z-rust-stable-with-std-2026-09-03/bin:
  252. 52.28 s [1/5/7 built, 68 copied rust-stable-with-components> rust-gdbgui: Keeping existing link to /nix/store/s9nslw8h7m9vh88zd2hilmjb298pfca4-clippy-stable-with-std-2026-09-03/bin/rust-gdbgui
  253. 52.28 s rust-stable-with-components> rustc: Keeping existing link to /nix/store/s9nslw8h7m9vh88zd2hilmjb298pfca4-clippy-stable-with-std-2026-09-03/bin/rustc
  254. 52.28 s rust-stable-with-components> rustdoc: Keeping existing link to /nix/store/s9nslw8h7m9vh88zd2hilmjb298pfca4-clippy-stable-with-std-2026-09-03/bin/rustdoc
  255. 52.28 s rust-stable-with-components> rust-gdb: Keeping existing link to /nix/store/s9nslw8h7m9vh88zd2hilmjb298pfca4-clippy-stable-with-std-2026-09-03/bin/rust-gdb
  256. 52.28 s rust-stable-with-components> rust-lldb: Keeping existing link to /nix/store/s9nslw8h7m9vh88zd2hilmjb298pfca4-clippy-stable-with-std-2026-09-03/bin/rust-lldb
  257. 52.29 s rust-stable-with-components> /nix/store/wg9kw4yhn1jn01mjs8cwx5mz69l1s64z-rust-stable-with-std-2026-09-03/lib:
  258. 52.29 s rust-stable-with-components> librustc_driver-eaf3ed1d23ca5027.so: Keeping existing link to /nix/store/s9nslw8h7m9vh88zd2hilmjb298pfca4-clippy-stable-with-std-2026-09-03/lib/librustc_driver-eaf3ed1d23ca5027.so
  259. 52.74 s rust-stable-with-components (post)> Uploading to the NixCI cache: /nix/store/c3bpv60f5wgp4pmgsifaykxk214h6463-rust-stable-with-components-2026-09-03
  260. 52.79 s rust-stable-with-components (post)> warning: 'warn-short-path-literals' is deprecated, use 'lint-short-path-literals = ignore' instead
  261. 52.81 s rust-stable-with-components (post)> copying 0 paths...
  262. 52.86 s rust-stable-with-components (post)> warning: 'warn-short-path-literals' is deprecated, use 'lint-short-path-literals = ignore' instead
  263. 52.90 s rust-stable-with-components (post)> copying 0 paths...
  264. 53.28 s [6/8 built, 68 copied (1 [1/6/7 built, 68 copied gammaloop-nextest-core> Extracting 4 binaries (including 2 non-test binaries), 1 build script output directory, and 2 linked paths to /build/source
  265. 53.78 s gammaloop-nextest-core> Extracted 20 files to /build/source in 0.51s
  266. 53.79 s gammaloop-nextest-core> ------------
  267. 53.79 s gammaloop-nextest-core> Nextest run ID 53e4a6bc-a967-435c-8a57-940e3ec872d8 with nextest profile: ci_gammaloop
  268. 53.79 s gammaloop-nextest-core> Starting 341 tests across 2 binaries (1 test skipped)
  269. 54.26 s gammaloop-nextest-core> ------------
  270. 54.26 s gammaloop-nextest-core> Summary [ 0.465s] 341 tests run: 341 passed, 1 skipped
  271. 54.29 s gammaloop-nextest-core>
  272. 54.29 s gammaloop-nextest-core> ========== nextest test summary ==========
  273. 54.29 s gammaloop-nextest-core> report: target/nextest/ci_gammaloop/junit.xml
  274. 54.29 s gammaloop-nextest-core> tests: 341, failures: 0, errors: 0
  275. 54.29 s gammaloop-nextest-core> No failing testcases found.
  276. 54.29 s gammaloop-nextest-core> =========================================
  277. 54.31 s gammaloop-nextest-core> Extracting 1 binary and 1 linked path to /build/source
  278. 54.38 s gammaloop-nextest-core> Extracted 7 files to /build/source in 0.07s
  279. 54.39 s gammaloop-nextest-core> ------------
  280. 54.39 s gammaloop-nextest-core> Nextest run ID 51b43329-401d-4ef4-8ac5-59277d446db5 with nextest profile: ci_gammaloop
  281. 54.39 s gammaloop-nextest-core> Starting 19 tests across 1 binary
  282. 54.40 s gammaloop-nextest-core> ------------
  283. 54.40 s gammaloop-nextest-core> Summary [ 0.012s] 19 tests run: 19 passed, 0 skipped
  284. 54.43 s gammaloop-nextest-core>
  285. 54.43 s gammaloop-nextest-core> ========== nextest test summary ==========
  286. 54.43 s gammaloop-nextest-core> report: target/nextest/ci_gammaloop/junit.xml
  287. 54.43 s gammaloop-nextest-core> tests: 19, failures: 0, errors: 0
  288. 54.43 s gammaloop-nextest-core> No failing testcases found.
  289. 54.43 s gammaloop-nextest-core> =========================================
  290. 54.45 s gammaloop-nextest-core> Extracting 1 binary to /build/source
  291. 54.49 s gammaloop-nextest-core> Extracted 4 files to /build/source in 0.04s
  292. 54.50 s gammaloop-nextest-core> ------------
  293. 54.50 s gammaloop-nextest-core> Nextest run ID f00bf667-ae56-4f30-aa1c-c56319f237a8 with nextest profile: ci_gammaloop
  294. 54.50 s gammaloop-nextest-core> Starting 0 tests across 1 binary
  295. 54.50 s gammaloop-nextest-core> ------------
  296. 54.50 s gammaloop-nextest-core> Summary [ 0.000s] 0 tests run: 0 passed, 0 skipped
  297. 54.53 s gammaloop-nextest-core>
  298. 54.53 s gammaloop-nextest-core> ========== nextest test summary ==========
  299. 54.53 s gammaloop-nextest-core> report: target/nextest/ci_gammaloop/junit.xml
  300. 54.53 s gammaloop-nextest-core> tests: 0, failures: 0, errors: 0
  301. 54.53 s gammaloop-nextest-core> No failing testcases found.
  302. 54.53 s gammaloop-nextest-core> =========================================
  303. 54.56 s gammaloop-nextest-core> Extracting 4 binaries (including 1 non-test binary), 1 build script output directory, and 2 linked paths to /build/source
  304. 55.06 s gammaloop-nextest-core> Extracted 19 files to /build/source in 0.51s
  305. 55.07 s gammaloop-nextest-core> ------------
  306. 55.07 s gammaloop-nextest-core> Nextest run ID 46ae359a-f3aa-4612-a724-9291715493e2 with nextest profile: ci_gammaloop
  307. 55.07 s gammaloop-nextest-core> Starting 421 tests across 3 binaries (31 tests skipped, including 30 tests via profile.ci_gammaloop.default-filter)
  308. 55.68 s gammaloop-nextest-core> FAIL [ 0.058s] (364/421) gammalooprs utils::test_utils::normalization
  309. 55.68 s gammaloop-nextest-core> stdout ---
  310. 55.68 s gammaloop-nextest-core>
  311. 55.68 s gammaloop-nextest-core> running 1 test
  312. 55.68 s gammaloop-nextest-core> ━━━━━━━━━━━━━━━━━━━━━━━━━━━━━━━ Snapshot Summary ━━━━━━━━━━━━━━━━━━━━━━━━━━━━━━━
  313. 55.68 s gammaloop-nextest-core> Snapshot: normalization-2
  314. 55.68 s gammaloop-nextest-core> Source: crates/gammalooprs/src/utils/test_utils.rs:44
  315. 55.68 s gammaloop-nextest-core> ────────────────────────────────────────────────────────────────────────────────
  316. 55.68 s gammaloop-nextest-core> Expression: b.to_canonical_string()
  317. 55.68 s gammaloop-nextest-core> ────────────────────────────────────────────────────────────────────────────────
  318. 55.68 s gammaloop-nextest-core> -old snapshot
  319. 55.68 s gammaloop-nextest-core> +new results
  320. 55.68 s gammaloop-nextest-core> ────────────┬───────────────────────────────────────────────────────────────────
  321. 55.68 s gammaloop-nextest-core> 1 │-gammalooprs::{spenso::rank1,spenso::tensor}::Q(1,spenso::{}::cind(1))
  322. 55.68 s gammaloop-nextest-core> 1 │+gammalooprs::{spenso::rank1,spenso::tensor,spenso::tensor-label:q}::Q(1,spenso::{}::cind(1))
  323. 55.68 s gammaloop-nextest-core> ────────────┴───────────────────────────────────────────────────────────────────
  324. 55.68 s gammaloop-nextest-core> To update snapshots run `cargo insta review`
  325. 55.68 s gammaloop-nextest-core> Stopped on the first failure. Run `cargo insta test` to run all snapshots.
  326. 55.68 s gammaloop-nextest-core> test utils::test_utils::normalization ... FAILED
  327. 55.68 s gammaloop-nextest-core>
  328. 55.68 s gammaloop-nextest-core> failures:
  329. 55.68 s gammaloop-nextest-core>
  330. 55.68 s gammaloop-nextest-core> failures:
  331. 55.68 s gammaloop-nextest-core> utils::test_utils::normalization
  332. 55.68 s gammaloop-nextest-core>
  333. 55.68 s gammaloop-nextest-core> test result: FAILED. 0 passed; 1 failed; 0 ignored; 0 measured; 445 filtered out; finished in 0.05s
  334. 55.68 s gammaloop-nextest-core>
  335. 55.68 s gammaloop-nextest-core> stderr ---
  336. 55.68 s gammaloop-nextest-core>
  337. 55.68 s gammaloop-nextest-core> thread 'utils::test_utils::normalization' (2244) panicked at /nix/store/c7lwckzlfrfsdw1ay0aqz4dpc2j7ry8d-vendor-cargo-deps/c19b7c6f923b580ac259164a89f2577984ad5ab09ee9d583b888f934adbbe8d0/insta-1.47.2/src/runtime.rs:719:13:
  338. 55.68 s gammaloop-nextest-core> snapshot assertion for 'normalization-2' failed in line 44
  339. 55.68 s gammaloop-nextest-core> stack backtrace:
  340. 55.68 s gammaloop-nextest-core> 0: __rustc::rust_begin_unwind
  341. 55.68 s gammaloop-nextest-core> 1: core::panicking::panic_fmt
  342. 55.68 s gammaloop-nextest-core> 2: insta::runtime::assert_snapshot
  343. 55.68 s gammaloop-nextest-core> 3: gammalooprs::utils::test_utils::normalization
  344. 55.68 s gammaloop-nextest-core> 4: <gammalooprs::utils::test_utils::normalization::{closure#0} as core::ops::function::FnOnce<()>>::call_once
  345. 55.68 s gammaloop-nextest-core> note: Some details are omitted, run with `RUST_BACKTRACE=full` for a verbose backtrace.
  346. 55.68 s gammaloop-nextest-core>
  347. 61.70 s gammaloop-nextest-core> ------------
  348. 61.70 s gammaloop-nextest-core> Summary [ 6.625s] 421 tests run: 420 passed, 1 failed, 31 skipped
  349. 61.70 s gammaloop-nextest-core> FAIL [ 0.058s] (364/421) gammalooprs utils::test_utils::normalization
  350. 61.70 s gammaloop-nextest-core> stdout ---
  351. 61.70 s gammaloop-nextest-core>
  352. 61.70 s gammaloop-nextest-core> running 1 test
  353. 61.70 s gammaloop-nextest-core> ━━━━━━━━━━━━━━━━━━━━━━━━━━━━━━━ Snapshot Summary ━━━━━━━━━━━━━━━━━━━━━━━━━━━━━━━
  354. 61.70 s gammaloop-nextest-core> Snapshot: normalization-2
  355. 61.70 s gammaloop-nextest-core> Source: crates/gammalooprs/src/utils/test_utils.rs:44
  356. 61.70 s gammaloop-nextest-core> ────────────────────────────────────────────────────────────────────────────────
  357. 61.70 s gammaloop-nextest-core> Expression: b.to_canonical_string()
  358. 61.70 s gammaloop-nextest-core> ────────────────────────────────────────────────────────────────────────────────
  359. 61.70 s gammaloop-nextest-core> -old snapshot
  360. 61.70 s gammaloop-nextest-core> +new results
  361. 61.70 s gammaloop-nextest-core> ────────────┬───────────────────────────────────────────────────────────────────
  362. 61.70 s gammaloop-nextest-core> 1 │-gammalooprs::{spenso::rank1,spenso::tensor}::Q(1,spenso::{}::cind(1))
  363. 61.70 s gammaloop-nextest-core> 1 │+gammalooprs::{spenso::rank1,spenso::tensor,spenso::tensor-label:q}::Q(1,spenso::{}::cind(1))
  364. 61.70 s gammaloop-nextest-core> ────────────┴───────────────────────────────────────────────────────────────────
  365. 61.70 s gammaloop-nextest-core> To update snapshots run `cargo insta review`
  366. 61.70 s gammaloop-nextest-core> Stopped on the first failure. Run `cargo insta test` to run all snapshots.
  367. 61.70 s gammaloop-nextest-core> test utils::test_utils::normalization ... FAILED
  368. 61.70 s gammaloop-nextest-core>
  369. 61.70 s gammaloop-nextest-core> failures:
  370. 61.70 s gammaloop-nextest-core>
  371. 61.70 s gammaloop-nextest-core> failures:
  372. 61.70 s gammaloop-nextest-core> utils::test_utils::normalization
  373. 61.70 s gammaloop-nextest-core>
  374. 61.70 s gammaloop-nextest-core> test result: FAILED. 0 passed; 1 failed; 0 ignored; 0 measured; 445 filtered out; finished in 0.05s
  375. 61.70 s gammaloop-nextest-core>
  376. 61.70 s gammaloop-nextest-core> stderr ---
  377. 61.70 s gammaloop-nextest-core>
  378. 61.70 s gammaloop-nextest-core> thread 'utils::test_utils::normalization' (2244) panicked at /nix/store/c7lwckzlfrfsdw1ay0aqz4dpc2j7ry8d-vendor-cargo-deps/c19b7c6f923b580ac259164a89f2577984ad5ab09ee9d583b888f934adbbe8d0/insta-1.47.2/src/runtime.rs:719:13:
  379. 61.70 s gammaloop-nextest-core> snapshot assertion for 'normalization-2' failed in line 44
  380. 61.70 s gammaloop-nextest-core> stack backtrace:
  381. 61.70 s gammaloop-nextest-core> 0: __rustc::rust_begin_unwind
  382. 61.70 s gammaloop-nextest-core> 1: core::panicking::panic_fmt
  383. 61.70 s gammaloop-nextest-core> 2: insta::runtime::assert_snapshot
  384. 61.70 s gammaloop-nextest-core> 3: gammalooprs::utils::test_utils::normalization
  385. 61.70 s gammaloop-nextest-core> 4: <gammalooprs::utils::test_utils::normalization::{closure#0} as core::ops::function::FnOnce<()>>::call_once
  386. 61.70 s gammaloop-nextest-core> note: Some details are omitted, run with `RUST_BACKTRACE=full` for a verbose backtrace.
  387. 61.70 s gammaloop-nextest-core>
  388. 61.71 s gammaloop-nextest-core> error: test run failed
  389. 61.73 s gammaloop-nextest-core>
  390. 61.73 s gammaloop-nextest-core> ========== nextest test summary ==========
  391. 61.73 s gammaloop-nextest-core> report: target/nextest/ci_gammaloop/junit.xml
  392. 61.73 s gammaloop-nextest-core> tests: 421, failures: 1, errors: 0
  393. 61.73 s gammaloop-nextest-core>
  394. 61.73 s gammaloop-nextest-core> 1. gammalooprs::utils::test_utils::normalization
  395. 61.73 s gammaloop-nextest-core> failure: test failure with exit code 101
  396. 61.73 s gammaloop-nextest-core> thread 'utils::test_utils::normalization' (2244) panicked at /nix/store/c7lwckzlfrfsdw1ay0aqz4dpc2j7ry8d-vendor-cargo-deps/c19b7c6f923b580ac259164a89f2577984ad5ab09ee9d583b888f934adbbe8d0/insta-1.47.2/src/runtime.rs:719:13:
  397. 61.73 s gammaloop-nextest-core> snapshot assertion for 'normalization-2' failed in line 44
  398. 61.73 s gammaloop-nextest-core> stack backtrace:
  399. 61.73 s gammaloop-nextest-core> 0: __rustc::rust_begin_unwind
  400. 61.73 s gammaloop-nextest-core> 1: core::panicking::panic_fmt
  401. 61.73 s gammaloop-nextest-core> 2: insta::runtime::assert_snapshot
  402. 61.73 s gammaloop-nextest-core> 3: gammalooprs::utils::test_utils::normalization
  403. 61.73 s gammaloop-nextest-core> 4: <gammalooprs::utils::test_utils::normalization::{closure#0} as core::ops::function::FnOnce<()>>::call_once
  404. 61.73 s gammaloop-nextest-core> note: Some details are omitted, run with `RUST_BACKTRACE=full` for a verbose backtrace.
  405. 61.73 s gammaloop-nextest-core> system-out
  406. 61.73 s gammaloop-nextest-core> running 1 test
  407. 61.73 s gammaloop-nextest-core> ━━━━━━━━━━━━━━━━━━━━━━━━━━━━━━━ Snapshot Summary ━━━━━━━━━━━━━━━━━━━━━━━━━━━━━━━
  408. 61.73 s gammaloop-nextest-core> Snapshot: normalization-2
  409. 61.73 s gammaloop-nextest-core> Source: crates/gammalooprs/src/utils/test_utils.rs:44
  410. 61.73 s gammaloop-nextest-core> ────────────────────────────────────────────────────────────────────────────────
  411. 61.73 s gammaloop-nextest-core> Expression: b.to_canonical_string()
  412. 61.73 s gammaloop-nextest-core> ────────────────────────────────────────────────────────────────────────────────
  413. 61.73 s gammaloop-nextest-core> -old snapshot
  414. 61.73 s gammaloop-nextest-core> +new results
  415. 61.73 s gammaloop-nextest-core> ────────────┬───────────────────────────────────────────────────────────────────
  416. 61.73 s gammaloop-nextest-core> 1 │-gammalooprs::{spenso::rank1,spenso::tensor}::Q(1,spenso::{}::cind(1))
  417. 61.73 s gammaloop-nextest-core> 1 │+gammalooprs::{spenso::rank1,spenso::tensor,spenso::tensor-label:q}::Q(1,spenso::{}::cind(1))
  418. 61.73 s gammaloop-nextest-core> ────────────┴───────────────────────────────────────────────────────────────────
  419. 61.73 s gammaloop-nextest-core> To update snapshots run `cargo insta review`
  420. 61.73 s gammaloop-nextest-core> Stopped on the first failure. Run `cargo insta test` to run all snapshots.
  421. 61.73 s gammaloop-nextest-core> test utils::test_utils::normalization ... FAILED
  422. 61.73 s gammaloop-nextest-core>
  423. 61.73 s gammaloop-nextest-core> failures:
  424. 61.73 s gammaloop-nextest-core>
  425. 61.73 s gammaloop-nextest-core> failures:
  426. 61.73 s gammaloop-nextest-core> utils::test_utils::normalization
  427. 61.73 s gammaloop-nextest-core>
  428. 61.73 s gammaloop-nextest-core> test result: FAILED. 0 passed; 1 failed; 0 ignored; 0 measured; 445 filtered out; finished in 0.05s
  429. 61.73 s gammaloop-nextest-core> system-err
  430. 61.73 s gammaloop-nextest-core> thread 'utils::test_utils::normalization' (2244) panicked at /nix/store/c7lwckzlfrfsdw1ay0aqz4dpc2j7ry8d-vendor-cargo-deps/c19b7c6f923b580ac259164a89f2577984ad5ab09ee9d583b888f934adbbe8d0/insta-1.47.2/src/runtime.rs:719:13:
  431. 61.73 s gammaloop-nextest-core> snapshot assertion for 'normalization-2' failed in line 44
  432. 61.73 s gammaloop-nextest-core> stack backtrace:
  433. 61.73 s gammaloop-nextest-core> 0: __rustc::rust_begin_unwind
  434. 61.73 s gammaloop-nextest-core> 1: core::panicking::panic_fmt
  435. 61.73 s gammaloop-nextest-core> 2: insta::runtime::assert_snapshot
  436. 61.73 s gammaloop-nextest-core> 3: gammalooprs::utils::test_utils::normalization
  437. 61.73 s gammaloop-nextest-core> 4: <gammalooprs::utils::test_utils::normalization::{closure#0} as core::ops::function::FnOnce<()>>::call_once
  438. 61.73 s gammaloop-nextest-core> note: Some details are omitted, run with `RUST_BACKTRACE=full` for a verbose backtrace.
  439. 61.73 s gammaloop-nextest-core> =========================================
  440. 61.88 s error: Cannot build '/nix/store/0rndpqvn1mhrhym0h67djwsb96dh29hx-gammaloop-nextest-core.drv'.
  441. 61.88 s Reason: builder failed with exit code 100.
  442. 61.88 s Output paths:
  443. 61.88 s /nix/store/rczb80lc4sz8skn6psc0kmwyvxg6gk58-gammaloop-nextest-core
  444. 61.88 s Last 176 log lines:
  445. 61.88 s > Extracting 4 binaries (including 2 non-test binaries), 1 build script output directory, and 2 linked paths to /build/source
  446. 61.88 s > Extracted 20 files to /build/source in 0.51s
  447. 61.88 s > ------------
  448. 61.88 s > Nextest run ID 53e4a6bc-a967-435c-8a57-940e3ec872d8 with nextest profile: ci_gammaloop
  449. 61.88 s > Starting 341 tests across 2 binaries (1 test skipped)
  450. 61.88 s > ------------
  451. 61.88 s > Summary [ 0.465s] 341 tests run: 341 passed, 1 skipped
  452. 61.88 s >
  453. 61.88 s > ========== nextest test summary ==========
  454. 61.88 s > report: target/nextest/ci_gammaloop/junit.xml
  455. 61.88 s > tests: 341, failures: 0, errors: 0
  456. 61.88 s > No failing testcases found.
  457. 61.88 s > =========================================
  458. 61.88 s > Extracting 1 binary and 1 linked path to /build/source
  459. 61.88 s > Extracted 7 files to /build/source in 0.07s
  460. 61.88 s > ------------
  461. 61.88 s > Nextest run ID 51b43329-401d-4ef4-8ac5-59277d446db5 with nextest profile: ci_gammaloop
  462. 61.88 s > Starting 19 tests across 1 binary
  463. 61.88 s > ------------
  464. 61.88 s > Summary [ 0.012s] 19 tests run: 19 passed, 0 skipped
  465. 61.88 s >
  466. 61.88 s > ========== nextest test summary ==========
  467. 61.88 s > report: target/nextest/ci_gammaloop/junit.xml
  468. 61.88 s > tests: 19, failures: 0, errors: 0
  469. 61.88 s > No failing testcases found.
  470. 61.88 s > =========================================
  471. 61.88 s > Extracting 1 binary to /build/source
  472. 61.88 s > Extracted 4 files to /build/source in 0.04s
  473. 61.88 s > ------------
  474. 61.88 s > Nextest run ID f00bf667-ae56-4f30-aa1c-c56319f237a8 with nextest profile: ci_gammaloop
  475. 61.88 s > Starting 0 tests across 1 binary
  476. 61.88 s > ------------
  477. 61.88 s > Summary [ 0.000s] 0 tests run: 0 passed, 0 skipped
  478. 61.88 s >
  479. 61.88 s > ========== nextest test summary ==========
  480. 61.88 s > report: target/nextest/ci_gammaloop/junit.xml
  481. 61.88 s > tests: 0, failures: 0, errors: 0
  482. 61.88 s > No failing testcases found.
  483. 61.88 s > =========================================
  484. 61.88 s > Extracting 4 binaries (including 1 non-test binary), 1 build script output directory, and 2 linked paths to /build/source
  485. 61.88 s > Extracted 19 files to /build/source in 0.51s
  486. 61.88 s > ------------
  487. 61.88 s > Nextest run ID 46ae359a-f3aa-4612-a724-9291715493e2 with nextest profile: ci_gammaloop
  488. 61.88 s > Starting 421 tests across 3 binaries (31 tests skipped, including 30 tests via profile.ci_gammaloop.default-filter)
  489. 61.88 s > FAIL [ 0.058s] (364/421) gammalooprs utils::test_utils::normalization
  490. 61.88 s > stdout ---
  491. 61.88 s >
  492. 61.88 s > running 1 test
  493. 61.88 s > ━━━━━━━━━━━━━━━━━━━━━━━━━━━━━━━ Snapshot Summary ━━━━━━━━━━━━━━━━━━━━━━━━━━━━━━━
  494. 61.88 s > Snapshot: normalization-2
  495. 61.88 s > Source: crates/gammalooprs/src/utils/test_utils.rs:44
  496. 61.88 s > ────────────────────────────────────────────────────────────────────────────────
  497. 61.88 s > Expression: b.to_canonical_string()
  498. 61.88 s > ────────────────────────────────────────────────────────────────────────────────
  499. 61.88 s > -old snapshot
  500. 61.88 s > +new results
  501. 61.88 s > ────────────┬───────────────────────────────────────────────────────────────────
  502. 61.88 s > 1 │-gammalooprs::{spenso::rank1,spenso::tensor}::Q(1,spenso::{}::cind(1))
  503. 61.88 s > 1 │+gammalooprs::{spenso::rank1,spenso::tensor,spenso::tensor-label:q}::Q(1,spenso::{}::cind(1))
  504. 61.88 s > ────────────┴───────────────────────────────────────────────────────────────────
  505. 61.88 s > To update snapshots run `cargo insta review`
  506. 61.88 s > Stopped on the first failure. Run `cargo insta test` to run all snapshots.
  507. 61.88 s > test utils::test_utils::normalization ... FAILED
  508. 61.88 s >
  509. 61.88 s > failures:
  510. 61.88 s >
  511. 61.88 s > failures:
  512. 61.88 s > utils::test_utils::normalization
  513. 61.88 s >
  514. 61.88 s > test result: FAILED. 0 passed; 1 failed; 0 ignored; 0 measured; 445 filtered out; finished in 0.05s
  515. 61.88 s >
  516. 61.88 s > stderr ---
  517. 61.88 s >
  518. 61.88 s > thread 'utils::test_utils::normalization' (2244) panicked at /nix/store/c7lwckzlfrfsdw1ay0aqz4dpc2j7ry8d-vendor-cargo-deps/c19b7c6f923b580ac259164a89f2577984ad5ab09ee9d583b888f934adbbe8d0/insta-1.47.2/src/runtime.rs:719:13:
  519. 61.88 s > snapshot assertion for 'normalization-2' failed in line 44
  520. 61.88 s > stack backtrace:
  521. 61.88 s > 0: __rustc::rust_begin_unwind
  522. 61.88 s > 1: core::panicking::panic_fmt
  523. 61.88 s > 2: insta::runtime::assert_snapshot
  524. 61.88 s > 3: gammalooprs::utils::test_utils::normalization
  525. 61.88 s > 4: <gammalooprs::utils::test_utils::normalization::{closure#0} as core::ops::function::FnOnce<()>>::call_once
  526. 61.88 s > note: Some details are omitted, run with `RUST_BACKTRACE=full` for a verbose backtrace.
  527. 61.88 s >
  528. 61.88 s > ------------
  529. 61.88 s > Summary [ 6.625s] 421 tests run: 420 passed, 1 failed, 31 skipped
  530. 61.88 s > FAIL [ 0.058s] (364/421) gammalooprs utils::test_utils::normalization
  531. 61.88 s > stdout ---
  532. 61.88 s >
  533. 61.88 s > running 1 test
  534. 61.88 s > ━━━━━━━━━━━━━━━━━━━━━━━━━━━━━━━ Snapshot Summary ━━━━━━━━━━━━━━━━━━━━━━━━━━━━━━━
  535. 61.88 s > Snapshot: normalization-2
  536. 61.88 s > Source: crates/gammalooprs/src/utils/test_utils.rs:44
  537. 61.88 s > ────────────────────────────────────────────────────────────────────────────────
  538. 61.88 s > Expression: b.to_canonical_string()
  539. 61.88 s > ────────────────────────────────────────────────────────────────────────────────
  540. 61.88 s > -old snapshot
  541. 61.88 s > +new results
  542. 61.88 s > ────────────┬───────────────────────────────────────────────────────────────────
  543. 61.88 s > 1 │-gammalooprs::{spenso::rank1,spenso::tensor}::Q(1,spenso::{}::cind(1))
  544. 61.88 s > 1 │+gammalooprs::{spenso::rank1,spenso::tensor,spenso::tensor-label:q}::Q(1,spenso::{}::cind(1))
  545. 61.88 s > ────────────┴───────────────────────────────────────────────────────────────────
  546. 61.88 s > To update snapshots run `cargo insta review`
  547. 61.88 s > Stopped on the first failure. Run `cargo insta test` to run all snapshots.
  548. 61.88 s > test utils::test_utils::normalization ... FAILED
  549. 61.88 s >
  550. 61.88 s > failures:
  551. 61.88 s >
  552. 61.88 s > failures:
  553. 61.88 s > utils::test_utils::normalization
  554. 61.88 s >
  555. 61.88 s > test result: FAILED. 0 passed; 1 failed; 0 ignored; 0 measured; 445 filtered out; finished in 0.05s
  556. 61.88 s >
  557. 61.88 s > stderr ---
  558. 61.88 s >
  559. 61.88 s > thread 'utils::test_utils::normalization' (2244) panicked at /nix/store/c7lwckzlfrfsdw1ay0aqz4dpc2j7ry8d-vendor-cargo-deps/c19b7c6f923b580ac259164a89f2577984ad5ab09ee9d583b888f934adbbe8d0/insta-1.47.2/src/runtime.rs:719:13:
  560. 61.88 s > snapshot assertion for 'normalization-2' failed in line 44
  561. 61.88 s > stack backtrace:
  562. 61.88 s > 0: __rustc::rust_begin_unwind
  563. 61.88 s > 1: core::panicking::panic_fmt
  564. 61.88 s > 2: insta::runtime::assert_snapshot
  565. 61.88 s > 3: gammalooprs::utils::test_utils::normalization
  566. 61.88 s > 4: <gammalooprs::utils::test_utils::normalization::{closure#0} as core::ops::function::FnOnce<()>>::call_once
  567. 61.88 s > note: Some details are omitted, run with `RUST_BACKTRACE=full` for a verbose backtrace.
  568. 61.88 s >
  569. 61.88 s > error: test run failed
  570. 61.88 s >
  571. 61.88 s > ========== nextest test summary ==========
  572. 61.88 s > report: target/nextest/ci_gammaloop/junit.xml
  573. 61.88 s > tests: 421, failures: 1, errors: 0
  574. 61.88 s >
  575. 61.88 s > 1. gammalooprs::utils::test_utils::normalization
  576. 61.88 s > failure: test failure with exit code 101
  577. 61.88 s > thread 'utils::test_utils::normalization' (2244) panicked at /nix/store/c7lwckzlfrfsdw1ay0aqz4dpc2j7ry8d-vendor-cargo-deps/c19b7c6f923b580ac259164a89f2577984ad5ab09ee9d583b888f934adbbe8d0/insta-1.47.2/src/runtime.rs:719:13:
  578. 61.88 s > snapshot assertion for 'normalization-2' failed in line 44
  579. 61.88 s > stack backtrace:
  580. 61.88 s > 0: __rustc::rust_begin_unwind
  581. 61.88 s > 1: core::panicking::panic_fmt
  582. 61.88 s > 2: insta::runtime::assert_snapshot
  583. 61.88 s > 3: gammalooprs::utils::test_utils::normalization
  584. 61.88 s > 4: <gammalooprs::utils::test_utils::normalization::{closure#0} as core::ops::function::FnOnce<()>>::call_once
  585. 61.88 s > note: Some details are omitted, run with `RUST_BACKTRACE=full` for a verbose backtrace.
  586. 61.88 s > system-out
  587. 61.88 s > running 1 test
  588. 61.88 s > ━━━━━━━━━━━━━━━━━━━━━━━━━━━━━━━ Snapshot Summary ━━━━━━━━━━━━━━━━━━━━━━━━━━━━━━━
  589. 61.88 s > Snapshot: normalization-2
  590. 61.88 s > Source: crates/gammalooprs/src/utils/test_utils.rs:44
  591. 61.88 s > ────────────────────────────────────────────────────────────────────────────────
  592. 61.88 s > Expression: b.to_canonical_string()
  593. 61.88 s > ────────────────────────────────────────────────────────────────────────────────
  594. 61.88 s > -old snapshot
  595. 61.88 s > +new results
  596. 61.88 s > ────────────┬───────────────────────────────────────────────────────────────────
  597. 61.88 s > 1 │-gammalooprs::{spenso::rank1,spenso::tensor}::Q(1,spenso::{}::cind(1))
  598. 61.88 s > 1 │+gammalooprs::{spenso::rank1,spenso::tensor,spenso::tensor-label:q}::Q(1,spenso::{}::cind(1))
  599. 61.88 s > ────────────┴───────────────────────────────────────────────────────────────────
  600. 61.88 s > To update snapshots run `cargo insta review`
  601. 61.88 s > Stopped on the first failure. Run `cargo insta test` to run all snapshots.
  602. 61.88 s > test utils::test_utils::normalization ... FAILED
  603. 61.88 s >
  604. 61.88 s > failures:
  605. 61.88 s >
  606. 61.88 s > failures:
  607. 61.88 s > utils::test_utils::normalization
  608. 61.88 s >
  609. 61.88 s > test result: FAILED. 0 passed; 1 failed; 0 ignored; 0 measured; 445 filtered out; finished in 0.05s
  610. 61.88 s > system-err
  611. 61.88 s > thread 'utils::test_utils::normalization' (2244) panicked at /nix/store/c7lwckzlfrfsdw1ay0aqz4dpc2j7ry8d-vendor-cargo-deps/c19b7c6f923b580ac259164a89f2577984ad5ab09ee9d583b888f934adbbe8d0/insta-1.47.2/src/runtime.rs:719:13:
  612. 61.88 s > snapshot assertion for 'normalization-2' failed in line 44
  613. 61.88 s > stack backtrace:
  614. 61.88 s > 0: __rustc::rust_begin_unwind
  615. 61.88 s > 1: core::panicking::panic_fmt
  616. 61.88 s > 2: insta::runtime::assert_snapshot
  617. 61.88 s > 3: gammalooprs::utils::test_utils::normalization
  618. 61.88 s > 4: <gammalooprs::utils::test_utils::normalization::{closure#0} as core::ops::function::FnOnce<()>>::call_once
  619. 61.88 s > note: Some details are omitted, run with `RUST_BACKTRACE=full` for a verbose backtrace.
  620. 61.88 s > =========================================
  621. 61.88 s For full logs, run:
  622. 61.88 s nix log /nix/store/0rndpqvn1mhrhym0h67djwsb96dh29hx-gammaloop-nextest-core.drv
  623. 62.03 s [6 built (1 failed), 68 Run failed.