0.00 s
$ /nix/store/61685rbaxmpigwi3z23i33sv3jyfl70q-coreutils-9.11/bin/timeout --kill-after=15s 7200s /nix/store/wknkybkzrc16r11vk5vrykh4wmw7a353-nix-2.34.8/bin/nix --extra-experimental-features nix-command --extra-experimental-features flakes flake clone git+https://github.com/alphal00p/gammaloop --dest /tmp/nix-ci-worker/stable-pwd/repo/
0.18 s
Cloning into '/tmp/nix-ci-worker/stable-pwd/repo'...
1.14 s
remote: Enumerating objects: 103497, done.
1.26 s
remote: Counting objects: 0% (1/10120)
remote: Counting objects: 1% (102/10120)
remote: Counting objects: 2% (203/10120)
remote: Counting objects: 3% (304/10120)
remote: Counting objects: 4% (405/10120)
remote: Counting objects: 5% (506/10120)
remote: Counting objects: 6% (608/10120)
remote: Counting objects: 7% (709/10120)
remote: Counting objects: 8% (810/10120)
remote: Counting objects: 9% (911/10120)
remote: Counting objects: 10% (1012/10120)
remote: Counting objects: 11% (1114/10120)
remote: Counting objects: 12% (1215/10120)
remote: Counting objects: 13% (1316/10120)
remote: Counting objects: 14% (1417/10120)
remote: Counting objects: 15% (1518/10120)
remote: Counting objects: 16% (1620/10120)
remote: Counting objects: 17% (1721/10120)
remote: Counting objects: 18% (1822/10120)
remote: Counting objects: 19% (1923/10120)
remote: Counting objects: 20% (2024/10120)
remote: Counting objects: 21% (2126/10120)
remote: Counting objects: 22% (2227/10120)
remote: Counting objects: 23% (2328/10120)
remote: Counting objects: 24% (2429/10120)
remote: Counting objects: 25% (2530/10120)
remote: Counting objects: 26% (2632/10120)
remote: Counting objects: 27% (2733/10120)
remote: Counting objects: 28% (2834/10120)
remote: Counting objects: 29% (2935/10120)
remote: Counting objects: 30% (3036/10120)
remote: Counting objects: 31% (3138/10120)
remote: Counting objects: 32% (3239/10120)
remote: Counting objects: 33% (3340/10120)
remote: Counting objects: 34% (3441/10120)
remote: Counting objects: 35% (3542/10120)
remote: Counting objects: 36% (3644/10120)
remote: Counting objects: 37% (3745/10120)
remote: Counting objects: 38% (3846/10120)
remote: Counting objects: 39% (3947/10120)
remote: Counting objects: 40% (4048/10120)
remote: Counting objects: 41% (4150/10120)
remote: Counting objects: 42% (4251/10120)
remote: Counting objects: 43% (4352/10120)
remote: Counting objects: 44% (4453/10120)
remote: Counting objects: 45% (4554/10120)
remote: Counting objects: 46% (4656/10120)
remote: Counting objects: 47% (4757/10120)
remote: Counting objects: 48% (4858/10120)
remote: Counting objects: 49% (4959/10120)
remote: Counting objects: 50% (5060/10120)
remote: Counting objects: 51% (5162/10120)
remote: Counting objects: 52% (5263/10120)
remote: Counting objects: 53% (5364/10120)
remote: Counting objects: 54% (5465/10120)
remote: Counting objects: 55% (5566/10120)
remote: Counting objects: 56% (5668/10120)
remote: Counting objects: 57% (5769/10120)
remote: Counting objects: 58% (5870/10120)
remote: Counting objects: 59% (5971/10120)
remote: Counting objects: 60% (6072/10120)
remote: Counting objects: 61% (6174/10120)
remote: Counting objects: 62% (6275/10120)
remote: Counting objects: 63% (6376/10120)
remote: Counting objects: 64% (6477/10120)
remote: Counting objects: 65% (6578/10120)
remote: Counting objects: 66% (6680/10120)
remote: Counting objects: 67% (6781/10120)
remote: Counting objects: 68% (6882/10120)
remote: Counting objects: 69% (6983/10120)
remote: Counting objects: 70% (7084/10120)
remote: Counting objects: 71% (7186/10120)
remote: Counting objects: 72% (7287/10120)
remote: Counting objects: 73% (7388/10120)
remote: Counting objects: 74% (7489/10120)
remote: Counting objects: 75% (7590/10120)
remote: Counting objects: 76% (7692/10120)
remote: Counting objects: 77% (7793/10120)
remote: Counting objects: 78% (7894/10120)
remote: Counting objects: 79% (7995/10120)
remote: Counting objects: 80% (8096/10120)
remote: Counting objects: 81% (8198/10120)
remote: Counting objects: 82% (8299/10120)
remote: Counting objects: 83% (8400/10120)
remote: Counting objects: 84% (8501/10120)
remote: Counting objects: 85% (8602/10120)
remote: Counting objects: 86% (8704/10120)
remote: Counting objects: 87% (8805/10120)
remote: Counting objects: 88% (8906/10120)
remote: Counting objects: 89% (9007/10120)
remote: Counting objects: 90% (9108/10120)
remote: Counting objects: 91% (9210/10120)
remote: Counting objects: 92% (9311/10120)
remote: Counting objects: 93% (9412/10120)
remote: Counting objects: 94% (9513/10120)
remote: Counting objects: 95% (9614/10120)
remote: Counting objects: 96% (9716/10120)
remote: Counting objects: 97% (9817/10120)
remote: Counting objects: 98% (9918/10120)
remote: Counting objects: 99% (10019/10120)
remote: Counting objects: 100% (10120/10120)
remote: Counting objects: 100% (10120/10120), done.
3.41 s
remote: Compressing objects: 0% (1/2291)
remote: Compressing objects: 1% (23/2291)
remote: Compressing objects: 2% (46/2291)
remote: Compressing objects: 3% (69/2291)
remote: Compressing objects: 4% (92/2291)
remote: Compressing objects: 5% (115/2291)
remote: Compressing objects: 6% (138/2291)
remote: Compressing objects: 7% (161/2291)
remote: Compressing objects: 8% (184/2291)
remote: Compressing objects: 9% (207/2291)
remote: Compressing objects: 10% (230/2291)
remote: Compressing objects: 10% (236/2291)
remote: Compressing objects: 11% (253/2291)
remote: Compressing objects: 12% (275/2291)
remote: Compressing objects: 13% (298/2291)
remote: Compressing objects: 14% (321/2291)
remote: Compressing objects: 15% (344/2291)
remote: Compressing objects: 16% (367/2291)
remote: Compressing objects: 17% (390/2291)
remote: Compressing objects: 18% (413/2291)
remote: Compressing objects: 19% (436/2291)
remote: Compressing objects: 20% (459/2291)
remote: Compressing objects: 21% (482/2291)
remote: Compressing objects: 22% (505/2291)
remote: Compressing objects: 23% (527/2291)
remote: Compressing objects: 23% (530/2291)
remote: Compressing objects: 24% (550/2291)
remote: Compressing objects: 25% (573/2291)
remote: Compressing objects: 26% (596/2291)
remote: Compressing objects: 27% (619/2291)
remote: Compressing objects: 28% (642/2291)
remote: Compressing objects: 29% (665/2291)
remote: Compressing objects: 30% (688/2291)
remote: Compressing objects: 31% (711/2291)
remote: Compressing objects: 32% (734/2291)
remote: Compressing objects: 33% (757/2291)
remote: Compressing objects: 34% (779/2291)
remote: Compressing objects: 35% (802/2291)
remote: Compressing objects: 36% (825/2291)
remote: Compressing objects: 37% (848/2291)
remote: Compressing objects: 38% (871/2291)
remote: Compressing objects: 39% (894/2291)
remote: Compressing objects: 40% (917/2291)
remote: Compressing objects: 41% (940/2291)
remote: Compressing objects: 42% (963/2291)
remote: Compressing objects: 43% (986/2291)
remote: Compressing objects: 44% (1009/2291)
remote: Compressing objects: 45% (1031/2291)
remote: Compressing objects: 46% (1054/2291)
remote: Compressing objects: 47% (1077/2291)
remote: Compressing objects: 48% (1100/2291)
remote: Compressing objects: 49% (1123/2291)
remote: Compressing objects: 50% (1146/2291)
remote: Compressing objects: 51% (1169/2291)
remote: Compressing objects: 52% (1192/2291)
remote: Compressing objects: 53% (1215/2291)
remote: Compressing objects: 54% (1238/2291)
remote: Compressing objects: 55% (1261/2291)
remote: Compressing objects: 56% (1283/2291)
remote: Compressing objects: 57% (1306/2291)
remote: Compressing objects: 58% (1329/2291)
remote: Compressing objects: 59% (1352/2291)
remote: Compressing objects: 60% (1375/2291)
remote: Compressing objects: 61% (1398/2291)
remote: Compressing objects: 62% (1421/2291)
remote: Compressing objects: 63% (1444/2291)
remote: Compressing objects: 64% (1467/2291)
remote: Compressing objects: 65% (1490/2291)
remote: Compressing objects: 66% (1513/2291)
remote: Compressing objects: 67% (1535/2291)
remote: Compressing objects: 68% (1558/2291)
remote: Compressing objects: 69% (1581/2291)
remote: Compressing objects: 70% (1604/2291)
remote: Compressing objects: 71% (1627/2291)
remote: Compressing objects: 72% (1650/2291)
remote: Compressing objects: 73% (1673/2291)
remote: Compressing objects: 74% (1696/2291)
remote: Compressing objects: 75% (1719/2291)
remote: Compressing objects: 76% (1742/2291)
remote: Compressing objects: 77% (1765/2291)
remote: Compressing objects: 78% (1787/2291)
remote: Compressing objects: 79% (1810/2291)
remote: Compressing objects: 80% (1833/2291)
remote: Compressing objects: 81% (1856/2291)
remote: Compressing objects: 82% (1879/2291)
remote: Compressing objects: 83% (1902/2291)
remote: Compressing objects: 84% (1925/2291)
remote: Compressing objects: 85% (1948/2291)
remote: Compressing objects: 86% (1971/2291)
remote: Compressing objects: 87% (1994/2291)
remote: Compressing objects: 88% (2017/2291)
remote: Compressing objects: 89% (2039/2291)
remote: Compressing objects: 90% (2062/2291)
remote: Compressing objects: 91% (2085/2291)
remote: Compressing objects: 92% (2108/2291)
remote: Compressing objects: 93% (2131/2291)
remote: Compressing objects: 94% (2154/2291)
remote: Compressing objects: 95% (2177/2291)
remote: Compressing objects: 96% (2200/2291)
remote: Compressing objects: 97% (2223/2291)
remote: Compressing objects: 98% (2246/2291)
remote: Compressing objects: 99% (2269/2291)
remote: Compressing objects: 100% (2291/2291)
remote: Compressing objects: 100% (2291/2291), done.
16.50 s
Receiving objects: 0% (1/103497)
Receiving objects: 1% (1035/103497)
Receiving objects: 2% (2070/103497)
Receiving objects: 3% (3105/103497)
Receiving objects: 4% (4140/103497)
Receiving objects: 5% (5175/103497), 9.10 MiB | 18.18 MiB/s
Receiving objects: 6% (6210/103497), 9.10 MiB | 18.18 MiB/s
Receiving objects: 7% (7245/103497), 9.10 MiB | 18.18 MiB/s
Receiving objects: 8% (8280/103497), 9.10 MiB | 18.18 MiB/s
Receiving objects: 9% (9315/103497), 9.10 MiB | 18.18 MiB/s
Receiving objects: 10% (10350/103497), 9.10 MiB | 18.18 MiB/s
Receiving objects: 11% (11385/103497), 9.10 MiB | 18.18 MiB/s
Receiving objects: 12% (12420/103497), 9.10 MiB | 18.18 MiB/s
Receiving objects: 13% (13455/103497), 9.10 MiB | 18.18 MiB/s
Receiving objects: 14% (14490/103497), 9.10 MiB | 18.18 MiB/s
Receiving objects: 15% (15525/103497), 9.10 MiB | 18.18 MiB/s
Receiving objects: 16% (16560/103497), 9.10 MiB | 18.18 MiB/s
Receiving objects: 17% (17595/103497), 9.10 MiB | 18.18 MiB/s
Receiving objects: 18% (18630/103497), 9.10 MiB | 18.18 MiB/s
Receiving objects: 19% (19665/103497), 9.10 MiB | 18.18 MiB/s
Receiving objects: 20% (20700/103497), 9.10 MiB | 18.18 MiB/s
Receiving objects: 21% (21735/103497), 9.10 MiB | 18.18 MiB/s
Receiving objects: 22% (22770/103497), 9.10 MiB | 18.18 MiB/s
Receiving objects: 23% (23805/103497), 9.10 MiB | 18.18 MiB/s
Receiving objects: 24% (24840/103497), 9.10 MiB | 18.18 MiB/s
Receiving objects: 24% (25511/103497), 26.29 MiB | 26.28 MiB/s
Receiving objects: 25% (25875/103497), 26.29 MiB | 26.28 MiB/s
Receiving objects: 26% (26910/103497), 26.29 MiB | 26.28 MiB/s
Receiving objects: 27% (27945/103497), 26.29 MiB | 26.28 MiB/s
Receiving objects: 28% (28980/103497), 26.29 MiB | 26.28 MiB/s
Receiving objects: 29% (30015/103497), 26.29 MiB | 26.28 MiB/s
Receiving objects: 30% (31050/103497), 26.29 MiB | 26.28 MiB/s
Receiving objects: 31% (32085/103497), 26.29 MiB | 26.28 MiB/s
Receiving objects: 32% (33120/103497), 26.29 MiB | 26.28 MiB/s
Receiving objects: 33% (34155/103497), 26.29 MiB | 26.28 MiB/s
Receiving objects: 34% (35189/103497), 26.29 MiB | 26.28 MiB/s
Receiving objects: 35% (36224/103497), 26.29 MiB | 26.28 MiB/s
Receiving objects: 36% (37259/103497), 26.29 MiB | 26.28 MiB/s
Receiving objects: 37% (38294/103497), 40.61 MiB | 27.03 MiB/s
Receiving objects: 38% (39329/103497), 40.61 MiB | 27.03 MiB/s
Receiving objects: 39% (40364/103497), 40.61 MiB | 27.03 MiB/s
Receiving objects: 40% (41399/103497), 40.61 MiB | 27.03 MiB/s
Receiving objects: 41% (42434/103497), 40.61 MiB | 27.03 MiB/s
Receiving objects: 42% (43469/103497), 40.61 MiB | 27.03 MiB/s
Receiving objects: 43% (44504/103497), 40.61 MiB | 27.03 MiB/s
Receiving objects: 44% (45539/103497), 40.61 MiB | 27.03 MiB/s
Receiving objects: 44% (46225/103497), 55.02 MiB | 27.44 MiB/s
Receiving objects: 45% (46574/103497), 55.02 MiB | 27.44 MiB/s
Receiving objects: 46% (47609/103497), 55.02 MiB | 27.44 MiB/s
Receiving objects: 47% (48644/103497), 55.02 MiB | 27.44 MiB/s
Receiving objects: 48% (49679/103497), 55.02 MiB | 27.44 MiB/s
Receiving objects: 49% (50714/103497), 69.14 MiB | 27.59 MiB/s
Receiving objects: 50% (51749/103497), 69.14 MiB | 27.59 MiB/s
Receiving objects: 51% (52784/103497), 69.14 MiB | 27.59 MiB/s
Receiving objects: 52% (53819/103497), 69.14 MiB | 27.59 MiB/s
Receiving objects: 53% (54854/103497), 69.14 MiB | 27.59 MiB/s
Receiving objects: 54% (55889/103497), 69.14 MiB | 27.59 MiB/s
Receiving objects: 55% (56924/103497), 69.14 MiB | 27.59 MiB/s
Receiving objects: 55% (57032/103497), 83.48 MiB | 27.77 MiB/s
Receiving objects: 55% (57095/103497), 113.83 MiB | 28.39 MiB/s
Receiving objects: 55% (57222/103497), 129.44 MiB | 28.69 MiB/s
Receiving objects: 56% (57959/103497), 160.04 MiB | 29.61 MiB/s
Receiving objects: 57% (58994/103497), 160.04 MiB | 29.61 MiB/s
Receiving objects: 58% (60029/103497), 160.04 MiB | 29.61 MiB/s
Receiving objects: 59% (61064/103497), 160.04 MiB | 29.61 MiB/s
Receiving objects: 60% (62099/103497), 160.04 MiB | 29.61 MiB/s
Receiving objects: 61% (63134/103497), 160.04 MiB | 29.61 MiB/s
Receiving objects: 61% (63487/103497), 175.13 MiB | 29.79 MiB/s
Receiving objects: 62% (64169/103497), 175.13 MiB | 29.79 MiB/s
Receiving objects: 63% (65204/103497), 175.13 MiB | 29.79 MiB/s
Receiving objects: 64% (66239/103497), 190.34 MiB | 29.98 MiB/s
Receiving objects: 65% (67274/103497), 190.34 MiB | 29.98 MiB/s
Receiving objects: 66% (68309/103497), 190.34 MiB | 29.98 MiB/s
Receiving objects: 67% (69343/103497), 190.34 MiB | 29.98 MiB/s
Receiving objects: 68% (70378/103497), 190.34 MiB | 29.98 MiB/s
Receiving objects: 69% (71413/103497), 190.34 MiB | 29.98 MiB/s
Receiving objects: 70% (72448/103497), 190.34 MiB | 29.98 MiB/s
Receiving objects: 71% (73483/103497), 190.34 MiB | 29.98 MiB/s
Receiving objects: 72% (74518/103497), 190.34 MiB | 29.98 MiB/s
Receiving objects: 73% (75553/103497), 190.34 MiB | 29.98 MiB/s
Receiving objects: 73% (75688/103497), 190.34 MiB | 29.98 MiB/s
Receiving objects: 74% (76588/103497), 205.81 MiB | 30.27 MiB/s
Receiving objects: 75% (77623/103497), 221.27 MiB | 30.51 MiB/s
Receiving objects: 76% (78658/103497), 221.27 MiB | 30.51 MiB/s
Receiving objects: 76% (79581/103497), 236.64 MiB | 30.54 MiB/s
Receiving objects: 77% (79693/103497), 236.64 MiB | 30.54 MiB/s
Receiving objects: 78% (80728/103497), 236.64 MiB | 30.54 MiB/s
Receiving objects: 79% (81763/103497), 236.64 MiB | 30.54 MiB/s
Receiving objects: 80% (82798/103497), 236.64 MiB | 30.54 MiB/s
Receiving objects: 81% (83833/103497), 252.09 MiB | 30.62 MiB/s
Receiving objects: 81% (84182/103497), 267.36 MiB | 30.55 MiB/s
Receiving objects: 81% (84502/103497), 298.14 MiB | 30.60 MiB/s
Receiving objects: 82% (84868/103497), 313.48 MiB | 30.65 MiB/s
Receiving objects: 83% (85903/103497), 313.48 MiB | 30.65 MiB/s
Receiving objects: 84% (86938/103497), 313.48 MiB | 30.65 MiB/s
Receiving objects: 84% (87859/103497), 328.90 MiB | 30.70 MiB/s
Receiving objects: 85% (87973/103497), 328.90 MiB | 30.70 MiB/s
Receiving objects: 86% (89008/103497), 328.90 MiB | 30.70 MiB/s
Receiving objects: 87% (90043/103497), 328.90 MiB | 30.70 MiB/s
Receiving objects: 88% (91078/103497), 344.18 MiB | 30.66 MiB/s
Receiving objects: 88% (91427/103497), 359.63 MiB | 30.65 MiB/s
Receiving objects: 89% (92113/103497), 375.29 MiB | 30.70 MiB/s
Receiving objects: 90% (93148/103497), 375.29 MiB | 30.70 MiB/s
Receiving objects: 91% (94183/103497), 375.29 MiB | 30.70 MiB/s
Receiving objects: 92% (95218/103497), 375.29 MiB | 30.70 MiB/s
Receiving objects: 93% (96253/103497), 375.29 MiB | 30.70 MiB/s
Receiving objects: 94% (97288/103497), 375.29 MiB | 30.70 MiB/s
Receiving objects: 95% (98323/103497), 375.29 MiB | 30.70 MiB/s
Receiving objects: 96% (99358/103497), 375.29 MiB | 30.70 MiB/s
Receiving objects: 97% (100393/103497), 375.29 MiB | 30.70 MiB/s
Receiving objects: 98% (101428/103497), 375.29 MiB | 30.70 MiB/s
Receiving objects: 98% (102172/103497), 375.29 MiB | 30.70 MiB/s
Receiving objects: 99% (102463/103497), 375.29 MiB | 30.70 MiB/s
remote: Total 103497 (delta 8623), reused 8045 (delta 7804), pack-reused 93377 (from 4)
16.50 s
Receiving objects: 100% (103497/103497), 390.51 MiB | 30.65 MiB/s
Receiving objects: 100% (103497/103497), 391.99 MiB | 29.93 MiB/s, done.
19.16 s
Resolving deltas: 0% (0/67811)
Resolving deltas: 1% (679/67811)
Resolving deltas: 2% (1360/67811)
Resolving deltas: 3% (2035/67811)
Resolving deltas: 4% (2713/67811)
Resolving deltas: 5% (3391/67811)
Resolving deltas: 6% (4069/67811)
Resolving deltas: 7% (4747/67811)
Resolving deltas: 8% (5425/67811)
Resolving deltas: 9% (6103/67811)
Resolving deltas: 10% (6782/67811)
Resolving deltas: 11% (7460/67811)
Resolving deltas: 12% (8138/67811)
Resolving deltas: 13% (8816/67811)
Resolving deltas: 14% (9494/67811)
Resolving deltas: 15% (10172/67811)
Resolving deltas: 16% (10850/67811)
Resolving deltas: 17% (11528/67811)
Resolving deltas: 18% (12206/67811)
Resolving deltas: 19% (12885/67811)
Resolving deltas: 20% (13563/67811)
Resolving deltas: 21% (14242/67811)
Resolving deltas: 22% (14919/67811)
Resolving deltas: 23% (15597/67811)
Resolving deltas: 24% (16275/67811)
Resolving deltas: 25% (16953/67811)
Resolving deltas: 26% (17631/67811)
Resolving deltas: 27% (18309/67811)
Resolving deltas: 28% (18988/67811)
Resolving deltas: 29% (19666/67811)
Resolving deltas: 30% (20344/67811)
Resolving deltas: 31% (21022/67811)
Resolving deltas: 32% (21700/67811)
Resolving deltas: 33% (22378/67811)
Resolving deltas: 34% (23056/67811)
Resolving deltas: 35% (23736/67811)
Resolving deltas: 36% (24412/67811)
Resolving deltas: 37% (25091/67811)
Resolving deltas: 38% (25769/67811)
Resolving deltas: 39% (26447/67811)
Resolving deltas: 40% (27125/67811)
Resolving deltas: 41% (27803/67811)
Resolving deltas: 42% (28481/67811)
Resolving deltas: 43% (29159/67811)
Resolving deltas: 44% (29837/67811)
Resolving deltas: 45% (30515/67811)
Resolving deltas: 46% (31194/67811)
Resolving deltas: 47% (31872/67811)
Resolving deltas: 48% (32551/67811)
Resolving deltas: 48% (33097/67811)
Resolving deltas: 49% (33228/67811)
Resolving deltas: 50% (33906/67811)
Resolving deltas: 51% (34584/67811)
Resolving deltas: 52% (35262/67811)
Resolving deltas: 53% (35940/67811)
Resolving deltas: 54% (36618/67811)
Resolving deltas: 55% (37298/67811)
Resolving deltas: 56% (37975/67811)
Resolving deltas: 57% (38653/67811)
Resolving deltas: 58% (39331/67811)
Resolving deltas: 59% (40009/67811)
Resolving deltas: 60% (40687/67811)
Resolving deltas: 61% (41365/67811)
Resolving deltas: 62% (42043/67811)
Resolving deltas: 63% (42721/67811)
Resolving deltas: 64% (43400/67811)
Resolving deltas: 65% (44079/67811)
Resolving deltas: 66% (44756/67811)
Resolving deltas: 67% (45434/67811)
Resolving deltas: 68% (46113/67811)
Resolving deltas: 69% (46790/67811)
Resolving deltas: 70% (47468/67811)
Resolving deltas: 71% (48146/67811)
Resolving deltas: 72% (48824/67811)
Resolving deltas: 73% (49503/67811)
Resolving deltas: 74% (50181/67811)
Resolving deltas: 75% (50859/67811)
Resolving deltas: 76% (51537/67811)
Resolving deltas: 76% (51801/67811)
Resolving deltas: 77% (52215/67811)
Resolving deltas: 78% (52893/67811)
Resolving deltas: 79% (53571/67811)
Resolving deltas: 80% (54249/67811)
Resolving deltas: 81% (54927/67811)
Resolving deltas: 82% (55606/67811)
Resolving deltas: 83% (56284/67811)
Resolving deltas: 84% (56962/67811)
Resolving deltas: 85% (57640/67811)
Resolving deltas: 86% (58318/67811)
Resolving deltas: 87% (58996/67811)
Resolving deltas: 88% (59674/67811)
Resolving deltas: 89% (60352/67811)
Resolving deltas: 90% (61030/67811)
Resolving deltas: 91% (61709/67811)
Resolving deltas: 92% (62387/67811)
Resolving deltas: 93% (63065/67811)
Resolving deltas: 94% (63743/67811)
Resolving deltas: 95% (64421/67811)
Resolving deltas: 96% (65099/67811)
Resolving deltas: 97% (65777/67811)
Resolving deltas: 98% (66455/67811)
Resolving deltas: 99% (67133/67811)
Resolving deltas: 100% (67811/67811)
Resolving deltas: 100% (67811/67811), done.
19.92 s
Fetching commit 13c9bb203f1daef2670356779366ed6afc72bc51 for feynkit ...
19.92 s
$ /nix/store/5vpcfsdx1lcnlb2y4k7xyc74shp5qwbh-git-2.54.0/bin/git fetch origin 13c9bb203f1daef2670356779366ed6afc72bc51
20.65 s
From https://github.com/alphal00p/gammaloop
20.65 s
* branch 13c9bb203f1daef2670356779366ed6afc72bc51 -> FETCH_HEAD
20.67 s
$ /nix/store/61685rbaxmpigwi3z23i33sv3jyfl70q-coreutils-9.11/bin/timeout --kill-after=15s 7200s /nix/store/5vpcfsdx1lcnlb2y4k7xyc74shp5qwbh-git-2.54.0/bin/git -c advice.detachedHead=false checkout 13c9bb203f1daef2670356779366ed6afc72bc51
20.91 s
HEAD is now at 13c9bb203 bundle readable math typography in notebook HTML
20.93 s
$ /nix/store/61685rbaxmpigwi3z23i33sv3jyfl70q-coreutils-9.11/bin/timeout --kill-after=15s 7200s /nix/store/wknkybkzrc16r11vk5vrykh4wmw7a353-nix-2.34.8/bin/nix --extra-experimental-features nix-command --extra-experimental-features flakes --log-format internal-json run .#packages.x86_64-linux.nix-ci-check-gammaloop-nextest-core --print-build-logs
21.16 s
warning: ignoring untrusted flake configuration setting 'extra-substituters'.
21.16 s
Pass '--accept-flake-config' to trust it
21.16 s
warning: ignoring untrusted flake configuration setting 'extra-trusted-public-keys'.
21.16 s
Pass '--accept-flake-config' to trust it
26.06 s
26.28 s
Building /nix/store/bh50v5j3d7zpkjlcdb06wr1mlw3b6s3j-nix-ci-check-gammaloop-nextest-core.drv
26.28 s
[nix-ci-check-gammaloop-nextest-core] structuredAttrs is enabled
26.35 s
[nix-ci-check-gammaloop-nextest-core:post-build] Uploading to the NixCI cache: /nix/store/f4y30knzsqvh6vhfj4d5pwyi33cajxca-nix-ci-check-gammaloop-nextest-core
26.39 s
[nix-ci-check-gammaloop-nextest-core:post-build] warning: 'warn-short-path-literals' is deprecated, use 'lint-short-path-literals = ignore' instead
26.41 s
[nix-ci-check-gammaloop-nextest-core:post-build] copying 1 paths...
26.41 s
[nix-ci-check-gammaloop-nextest-core:post-build] copying path '/nix/store/f4y30knzsqvh6vhfj4d5pwyi33cajxca-nix-ci-check-gammaloop-nextest-core' to 'https://cache.nix-ci.com'...
26.72 s
[nix-ci-check-gammaloop-nextest-core:post-build] warning: 'warn-short-path-literals' is deprecated, use 'lint-short-path-literals = ignore' instead
26.91 s
[nix-ci-check-gammaloop-nextest-core:post-build] copying 0 paths...
26.93 s
Uploaded nix-ci-check-gammaloop-nextest-core in 600ms
26.93 s
Progress: 1 of 2 built
26.94 s
Built nix-ci-check-gammaloop-nextest-core in 655ms
26.94 s
Progress: 2 of 2 built
27.11 s
do you want to allow configuration setting 'extra-substituters' to be set to 'https://cache.nix-ci.com ' (y/N)? do you want to permanently mark this value as untrusted (y/N)? warning: ignoring untrusted flake configuration setting 'extra-substituters'.
27.11 s
Pass '--accept-flake-config' to trust it
27.11 s
evaluating derivation 'gdo you want to allow configuration setting 'extra-trusted-public-keys' to be set to 'nix-ci:g3xV5BDTLtIBZr/A00IU1x0EtKKlb7YLgBN2SgYgM6A= ' (y/N)? do you want to permanently mark this value as untrusted (y/N)? warning: ignoring untrusted flake configuration setting 'extra-trusted-public-keys'.
27.11 s
Pass '--accept-flake-config' to trust it
35.60 s
copying '/nix/store/hc7a
evaluating derivation 'g
copying '/nix/store/hc7a
evaluating derivation 'g
copying '/nix/store/hc7a
evaluating derivation 'g
copying '/nix/store/hc7a
evaluating derivation 'g
copying '/nix/store/hc7a
evaluating derivation 'g
copying '/nix/store/hc7a
evaluating derivation 'g
querying gammaloop-nexte
[0.0 KiB DL] querying ga
[0 /6 built, 4 /0 /4 copied
[0 /5 built, 3 /1 /4 copied
[0 /4 built, 2 /2 /4 copied
[0 /3 built, 1 /3 /4 copied
[0 /2 built, 4 copied (18
[1 /0 /2 built, 4 copied (gammaloop-nextest-binaries-core (post)> Uploading to the NixCI cache: /nix/store/g80wdpac9hkqa5wvvkyxxa90prjv3ifr-gammaloop-nextest-binaries-core
36.06 s
gammaloop-nextest-binaries-core (post)> warning: 'warn-short-path-literals' is deprecated, use 'lint-short-path-literals = ignore' instead
36.12 s
gammaloop-nextest-binaries-core (post)> copying 1 paths...
36.12 s
gammaloop-nextest-binaries-core (post)> copying path '/nix/store/g80wdpac9hkqa5wvvkyxxa90prjv3ifr-gammaloop-nextest-binaries-core' to 'https://cache.nix-ci.com'...
36.83 s
gammaloop-nextest-binaries-core (post)> warning: 'warn-short-path-literals' is deprecated, use 'lint-short-path-literals = ignore' instead
37.20 s
gammaloop-nextest-binaries-core (post)> copying 0 paths...
37.86 s
[1 /3 built, 4 copied (18
[1 /1 /2 built, 4 copied (gammaloop-nextest-core> Extracting 4 binaries (including 2 non-test binaries), 1 build script output directory, and 2 linked paths to /build/source
38.52 s
gammaloop-nextest-core> Extracted 20 files to /build/source in 0.66s
38.56 s
gammaloop-nextest-core> ------------
38.56 s
gammaloop-nextest-core> Nextest run ID 84aed4bd-0764-4040-a4bd-6d29e5e16d75 with nextest profile: ci_gammaloop
38.56 s
gammaloop-nextest-core> Starting 341 tests across 2 binaries (1 test skipped )
39.47 s
gammaloop-nextest-core> ------------
39.47 s
gammaloop-nextest-core> Summary [ 0.909s] 341 tests run: 341 passed , 1 skipped
39.63 s
gammaloop-nextest-core>
39.63 s
gammaloop-nextest-core> ========== nextest test summary ==========
39.63 s
gammaloop-nextest-core> report: target/nextest/ci_gammaloop/junit.xml
39.63 s
gammaloop-nextest-core> tests: 341, failures: 0, errors: 0
39.63 s
gammaloop-nextest-core> No failing testcases found.
39.63 s
gammaloop-nextest-core> =========================================
39.66 s
gammaloop-nextest-core> Extracting 1 binary and 1 linked path to /build/source
39.76 s
gammaloop-nextest-core> Extracted 7 files to /build/source in 0.10s
39.79 s
gammaloop-nextest-core> ------------
39.79 s
gammaloop-nextest-core> Nextest run ID 7c42954f-f861-4c74-9e8d-eff711f12da0 with nextest profile: ci_gammaloop
39.79 s
gammaloop-nextest-core> Starting 19 tests across 1 binary
39.84 s
gammaloop-nextest-core> ------------
39.84 s
gammaloop-nextest-core> Summary [ 0.054s] 19 tests run: 19 passed , 0 skipped
39.89 s
gammaloop-nextest-core>
39.89 s
gammaloop-nextest-core> ========== nextest test summary ==========
39.89 s
gammaloop-nextest-core> report: target/nextest/ci_gammaloop/junit.xml
39.89 s
gammaloop-nextest-core> tests: 19, failures: 0, errors: 0
39.89 s
gammaloop-nextest-core> No failing testcases found.
39.89 s
gammaloop-nextest-core> =========================================
39.92 s
gammaloop-nextest-core> Extracting 1 binary to /build/source
39.97 s
gammaloop-nextest-core> Extracted 4 files to /build/source in 0.05s
40.00 s
gammaloop-nextest-core> ------------
40.00 s
gammaloop-nextest-core> Nextest run ID ff78d43a-ab3f-40b1-bded-f589550660e6 with nextest profile: ci_gammaloop
40.00 s
gammaloop-nextest-core> Starting 0 tests across 1 binary
40.01 s
gammaloop-nextest-core> ------------
40.01 s
gammaloop-nextest-core> Summary [ 0.006s] 0 tests run: 0 passed , 0 skipped
40.06 s
gammaloop-nextest-core>
40.06 s
gammaloop-nextest-core> ========== nextest test summary ==========
40.06 s
gammaloop-nextest-core> report: target/nextest/ci_gammaloop/junit.xml
40.06 s
gammaloop-nextest-core> tests: 0, failures: 0, errors: 0
40.06 s
gammaloop-nextest-core> No failing testcases found.
40.06 s
gammaloop-nextest-core> =========================================
40.09 s
gammaloop-nextest-core> Extracting 4 binaries (including 1 non-test binary), 1 build script output directory, and 2 linked paths to /build/source
40.71 s
gammaloop-nextest-core> Extracted 19 files to /build/source in 0.62s
40.75 s
gammaloop-nextest-core> ------------
40.75 s
gammaloop-nextest-core> Nextest run ID 2e9f4513-5e65-4873-849d-3c09f8bc8380 with nextest profile: ci_gammaloop
40.75 s
gammaloop-nextest-core> Starting 421 tests across 3 binaries (31 tests skipped , including 30 tests via profile.ci_gammaloop.default-filter )
42.42 s
gammaloop-nextest-core> FAIL [ 0.525s] (372/421) gammalooprs utils::test_utils :: normalization
42.42 s
gammaloop-nextest-core> stdout ---
42.42 s
gammaloop-nextest-core>
42.42 s
gammaloop-nextest-core> running 1 test
42.42 s
gammaloop-nextest-core> ━━━━━━━━━━━━━━━━━━━━━━━━━━━━━━━ Snapshot Summary ━━━━━━━━━━━━━━━━━━━━━━━━━━━━━━━
42.42 s
gammaloop-nextest-core> Snapshot: normalization-2
42.42 s
gammaloop-nextest-core> Source: crates/gammalooprs/src/utils/test_utils.rs:44
42.42 s
gammaloop-nextest-core> ────────────────────────────────────────────────────────────────────────────────
42.42 s
gammaloop-nextest-core> Expression: b.to_canonical_string()
42.42 s
gammaloop-nextest-core> ────────────────────────────────────────────────────────────────────────────────
42.42 s
gammaloop-nextest-core> -old snapshot
42.42 s
gammaloop-nextest-core> +new results
42.42 s
gammaloop-nextest-core> ────────────┬───────────────────────────────────────────────────────────────────
42.42 s
gammaloop-nextest-core> 1 │-gammalooprs::{spenso::rank1,spenso::tensor}::Q(1,spenso::{}::cind(1))
42.42 s
gammaloop-nextest-core> 1 │+gammalooprs::{spenso::rank1,spenso::tensor,spenso::tensor-label:q}::Q(1,spenso::{}::cind(1))
42.42 s
gammaloop-nextest-core> ────────────┴───────────────────────────────────────────────────────────────────
42.42 s
gammaloop-nextest-core> To update snapshots run `cargo insta review`
42.42 s
gammaloop-nextest-core> Stopped on the first failure. Run `cargo insta test` to run all snapshots.
42.42 s
gammaloop-nextest-core> test utils::test_utils::normalization ... FAILED
42.42 s
gammaloop-nextest-core>
42.42 s
gammaloop-nextest-core> failures:
42.42 s
gammaloop-nextest-core>
42.42 s
gammaloop-nextest-core> failures:
42.42 s
gammaloop-nextest-core> utils::test_utils::normalization
42.42 s
gammaloop-nextest-core>
42.42 s
gammaloop-nextest-core> test result: FAILED. 0 passed; 1 failed; 0 ignored; 0 measured; 445 filtered out; finished in 0.49s
42.42 s
gammaloop-nextest-core>
42.42 s
gammaloop-nextest-core> stderr ---
42.42 s
gammaloop-nextest-core>
42.42 s
gammaloop-nextest-core> thread 'utils::test_utils::normalization' (2238) panicked at /nix/store/c7lwckzlfrfsdw1ay0aqz4dpc2j7ry8d-vendor-cargo-deps/c19b7c6f923b580ac259164a89f2577984ad5ab09ee9d583b888f934adbbe8d0/insta-1.47.2/src/runtime.rs:719:13:
42.42 s
gammaloop-nextest-core> snapshot assertion for 'normalization-2' failed in line 44
42.42 s
gammaloop-nextest-core> stack backtrace:
42.42 s
gammaloop-nextest-core> 0: __rustc::rust_begin_unwind
42.42 s
gammaloop-nextest-core> 1: core::panicking::panic_fmt
42.42 s
gammaloop-nextest-core> 2: insta::runtime::assert_snapshot
42.42 s
gammaloop-nextest-core> 3: gammalooprs::utils::test_utils::normalization
42.42 s
gammaloop-nextest-core> 4: <gammalooprs::utils::test_utils::normalization::{closure#0} as core::ops::function::FnOnce<()>>::call_once
42.42 s
gammaloop-nextest-core> note: Some details are omitted, run with `RUST_BACKTRACE=full` for a verbose backtrace.
42.42 s
gammaloop-nextest-core>
53.12 s
gammaloop-nextest-core> ------------
53.12 s
gammaloop-nextest-core> Summary [ 12.369s] 421 tests run: 420 passed , 1 failed , 31 skipped
53.12 s
gammaloop-nextest-core> FAIL [ 0.525s] (372/421) gammalooprs utils::test_utils :: normalization
53.12 s
gammaloop-nextest-core> stdout ---
53.12 s
gammaloop-nextest-core>
53.12 s
gammaloop-nextest-core> running 1 test
53.12 s
gammaloop-nextest-core> ━━━━━━━━━━━━━━━━━━━━━━━━━━━━━━━ Snapshot Summary ━━━━━━━━━━━━━━━━━━━━━━━━━━━━━━━
53.12 s
gammaloop-nextest-core> Snapshot: normalization-2
53.12 s
gammaloop-nextest-core> Source: crates/gammalooprs/src/utils/test_utils.rs:44
53.12 s
gammaloop-nextest-core> ────────────────────────────────────────────────────────────────────────────────
53.12 s
gammaloop-nextest-core> Expression: b.to_canonical_string()
53.12 s
gammaloop-nextest-core> ────────────────────────────────────────────────────────────────────────────────
53.12 s
gammaloop-nextest-core> -old snapshot
53.12 s
gammaloop-nextest-core> +new results
53.12 s
gammaloop-nextest-core> ────────────┬───────────────────────────────────────────────────────────────────
53.12 s
gammaloop-nextest-core> 1 │-gammalooprs::{spenso::rank1,spenso::tensor}::Q(1,spenso::{}::cind(1))
53.12 s
gammaloop-nextest-core> 1 │+gammalooprs::{spenso::rank1,spenso::tensor,spenso::tensor-label:q}::Q(1,spenso::{}::cind(1))
53.12 s
gammaloop-nextest-core> ────────────┴───────────────────────────────────────────────────────────────────
53.12 s
gammaloop-nextest-core> To update snapshots run `cargo insta review`
53.12 s
gammaloop-nextest-core> Stopped on the first failure. Run `cargo insta test` to run all snapshots.
53.12 s
gammaloop-nextest-core> test utils::test_utils::normalization ... FAILED
53.12 s
gammaloop-nextest-core>
53.12 s
gammaloop-nextest-core> failures:
53.12 s
gammaloop-nextest-core>
53.12 s
gammaloop-nextest-core> failures:
53.12 s
gammaloop-nextest-core> utils::test_utils::normalization
53.12 s
gammaloop-nextest-core>
53.12 s
gammaloop-nextest-core> test result: FAILED. 0 passed; 1 failed; 0 ignored; 0 measured; 445 filtered out; finished in 0.49s
53.12 s
gammaloop-nextest-core>
53.12 s
gammaloop-nextest-core> stderr ---
53.12 s
gammaloop-nextest-core>
53.12 s
gammaloop-nextest-core> thread 'utils::test_utils::normalization' (2238) panicked at /nix/store/c7lwckzlfrfsdw1ay0aqz4dpc2j7ry8d-vendor-cargo-deps/c19b7c6f923b580ac259164a89f2577984ad5ab09ee9d583b888f934adbbe8d0/insta-1.47.2/src/runtime.rs:719:13:
53.12 s
gammaloop-nextest-core> snapshot assertion for 'normalization-2' failed in line 44
53.12 s
gammaloop-nextest-core> stack backtrace:
53.12 s
gammaloop-nextest-core> 0: __rustc::rust_begin_unwind
53.12 s
gammaloop-nextest-core> 1: core::panicking::panic_fmt
53.12 s
gammaloop-nextest-core> 2: insta::runtime::assert_snapshot
53.12 s
gammaloop-nextest-core> 3: gammalooprs::utils::test_utils::normalization
53.12 s
gammaloop-nextest-core> 4: <gammalooprs::utils::test_utils::normalization::{closure#0} as core::ops::function::FnOnce<()>>::call_once
53.12 s
gammaloop-nextest-core> note: Some details are omitted, run with `RUST_BACKTRACE=full` for a verbose backtrace.
53.12 s
gammaloop-nextest-core>
53.13 s
gammaloop-nextest-core> error : test run failed
53.16 s
gammaloop-nextest-core>
53.16 s
gammaloop-nextest-core> ========== nextest test summary ==========
53.16 s
gammaloop-nextest-core> report: target/nextest/ci_gammaloop/junit.xml
53.16 s
gammaloop-nextest-core> tests: 421, failures: 1, errors: 0
53.16 s
gammaloop-nextest-core>
53.16 s
gammaloop-nextest-core> 1. gammalooprs::utils::test_utils::normalization
53.16 s
gammaloop-nextest-core> failure: test failure with exit code 101
53.16 s
gammaloop-nextest-core> thread 'utils::test_utils::normalization' (2238) panicked at /nix/store/c7lwckzlfrfsdw1ay0aqz4dpc2j7ry8d-vendor-cargo-deps/c19b7c6f923b580ac259164a89f2577984ad5ab09ee9d583b888f934adbbe8d0/insta-1.47.2/src/runtime.rs:719:13:
53.16 s
gammaloop-nextest-core> snapshot assertion for 'normalization-2' failed in line 44
53.16 s
gammaloop-nextest-core> stack backtrace:
53.16 s
gammaloop-nextest-core> 0: __rustc::rust_begin_unwind
53.16 s
gammaloop-nextest-core> 1: core::panicking::panic_fmt
53.16 s
gammaloop-nextest-core> 2: insta::runtime::assert_snapshot
53.16 s
gammaloop-nextest-core> 3: gammalooprs::utils::test_utils::normalization
53.16 s
gammaloop-nextest-core> 4: <gammalooprs::utils::test_utils::normalization::{closure#0} as core::ops::function::FnOnce<()>>::call_once
53.16 s
gammaloop-nextest-core> note: Some details are omitted, run with `RUST_BACKTRACE=full` for a verbose backtrace.
53.16 s
gammaloop-nextest-core> system-out
53.16 s
gammaloop-nextest-core> running 1 test
53.16 s
gammaloop-nextest-core> ━━━━━━━━━━━━━━━━━━━━━━━━━━━━━━━ Snapshot Summary ━━━━━━━━━━━━━━━━━━━━━━━━━━━━━━━
53.16 s
gammaloop-nextest-core> Snapshot: normalization-2
53.16 s
gammaloop-nextest-core> Source: crates/gammalooprs/src/utils/test_utils.rs:44
53.16 s
gammaloop-nextest-core> ────────────────────────────────────────────────────────────────────────────────
53.16 s
gammaloop-nextest-core> Expression: b.to_canonical_string()
53.16 s
gammaloop-nextest-core> ────────────────────────────────────────────────────────────────────────────────
53.16 s
gammaloop-nextest-core> -old snapshot
53.16 s
gammaloop-nextest-core> +new results
53.16 s
gammaloop-nextest-core> ────────────┬───────────────────────────────────────────────────────────────────
53.16 s
gammaloop-nextest-core> 1 │-gammalooprs::{spenso::rank1,spenso::tensor}::Q(1,spenso::{}::cind(1))
53.16 s
gammaloop-nextest-core> 1 │+gammalooprs::{spenso::rank1,spenso::tensor,spenso::tensor-label:q}::Q(1,spenso::{}::cind(1))
53.16 s
gammaloop-nextest-core> ────────────┴───────────────────────────────────────────────────────────────────
53.16 s
gammaloop-nextest-core> To update snapshots run `cargo insta review`
53.16 s
gammaloop-nextest-core> Stopped on the first failure. Run `cargo insta test` to run all snapshots.
53.16 s
gammaloop-nextest-core> test utils::test_utils::normalization ... FAILED
53.16 s
gammaloop-nextest-core>
53.16 s
gammaloop-nextest-core> failures:
53.16 s
gammaloop-nextest-core>
53.16 s
gammaloop-nextest-core> failures:
53.16 s
gammaloop-nextest-core> utils::test_utils::normalization
53.16 s
gammaloop-nextest-core>
53.16 s
gammaloop-nextest-core> test result: FAILED. 0 passed; 1 failed; 0 ignored; 0 measured; 445 filtered out; finished in 0.49s
53.16 s
gammaloop-nextest-core> system-err
53.16 s
gammaloop-nextest-core> thread 'utils::test_utils::normalization' (2238) panicked at /nix/store/c7lwckzlfrfsdw1ay0aqz4dpc2j7ry8d-vendor-cargo-deps/c19b7c6f923b580ac259164a89f2577984ad5ab09ee9d583b888f934adbbe8d0/insta-1.47.2/src/runtime.rs:719:13:
53.16 s
gammaloop-nextest-core> snapshot assertion for 'normalization-2' failed in line 44
53.16 s
gammaloop-nextest-core> stack backtrace:
53.16 s
gammaloop-nextest-core> 0: __rustc::rust_begin_unwind
53.16 s
gammaloop-nextest-core> 1: core::panicking::panic_fmt
53.16 s
gammaloop-nextest-core> 2: insta::runtime::assert_snapshot
53.16 s
gammaloop-nextest-core> 3: gammalooprs::utils::test_utils::normalization
53.16 s
gammaloop-nextest-core> 4: <gammalooprs::utils::test_utils::normalization::{closure#0} as core::ops::function::FnOnce<()>>::call_once
53.16 s
gammaloop-nextest-core> note: Some details are omitted, run with `RUST_BACKTRACE=full` for a verbose backtrace.
53.16 s
gammaloop-nextest-core> =========================================
53.39 s
error: Cannot build '/nix/store/5cl4rmcb98lnglh3nfwyp55040jvcmh7-gammaloop-nextest-core.drv '.
53.39 s
Reason: builder failed with exit code 100 .
53.39 s
Output paths:
53.39 s
/nix/store/dxghgh5qnfky7k3022xcjys81gnbqg4w-gammaloop-nextest-core
53.39 s
Last 176 log lines:
53.39 s
> Extracting 4 binaries (including 2 non-test binaries), 1 build script output directory, and 2 linked paths to /build/source
53.39 s
> Extracted 20 files to /build/source in 0.66s
53.39 s
> ------------
53.39 s
> Nextest run ID 84aed4bd-0764-4040-a4bd-6d29e5e16d75 with nextest profile: ci_gammaloop
53.39 s
> Starting 341 tests across 2 binaries (1 test skipped )
53.39 s
> ------------
53.39 s
> Summary [ 0.909s] 341 tests run: 341 passed , 1 skipped
53.39 s
>
53.39 s
> ========== nextest test summary ==========
53.39 s
> report: target/nextest/ci_gammaloop/junit.xml
53.39 s
> tests: 341, failures: 0, errors: 0
53.39 s
> No failing testcases found.
53.39 s
> =========================================
53.39 s
> Extracting 1 binary and 1 linked path to /build/source
53.39 s
> Extracted 7 files to /build/source in 0.10s
53.39 s
> ------------
53.39 s
> Nextest run ID 7c42954f-f861-4c74-9e8d-eff711f12da0 with nextest profile: ci_gammaloop
53.39 s
> Starting 19 tests across 1 binary
53.39 s
> ------------
53.39 s
> Summary [ 0.054s] 19 tests run: 19 passed , 0 skipped
53.39 s
>
53.39 s
> ========== nextest test summary ==========
53.39 s
> report: target/nextest/ci_gammaloop/junit.xml
53.39 s
> tests: 19, failures: 0, errors: 0
53.39 s
> No failing testcases found.
53.39 s
> =========================================
53.39 s
> Extracting 1 binary to /build/source
53.39 s
> Extracted 4 files to /build/source in 0.05s
53.39 s
> ------------
53.39 s
> Nextest run ID ff78d43a-ab3f-40b1-bded-f589550660e6 with nextest profile: ci_gammaloop
53.39 s
> Starting 0 tests across 1 binary
53.39 s
> ------------
53.39 s
> Summary [ 0.006s] 0 tests run: 0 passed , 0 skipped
53.39 s
>
53.39 s
> ========== nextest test summary ==========
53.39 s
> report: target/nextest/ci_gammaloop/junit.xml
53.39 s
> tests: 0, failures: 0, errors: 0
53.39 s
> No failing testcases found.
53.39 s
> =========================================
53.39 s
> Extracting 4 binaries (including 1 non-test binary), 1 build script output directory, and 2 linked paths to /build/source
53.39 s
> Extracted 19 files to /build/source in 0.62s
53.39 s
> ------------
53.39 s
> Nextest run ID 2e9f4513-5e65-4873-849d-3c09f8bc8380 with nextest profile: ci_gammaloop
53.39 s
> Starting 421 tests across 3 binaries (31 tests skipped , including 30 tests via profile.ci_gammaloop.default-filter )
53.39 s
> FAIL [ 0.525s] (372/421) gammalooprs utils::test_utils :: normalization
53.39 s
> stdout ---
53.39 s
>
53.39 s
> running 1 test
53.39 s
> ━━━━━━━━━━━━━━━━━━━━━━━━━━━━━━━ Snapshot Summary ━━━━━━━━━━━━━━━━━━━━━━━━━━━━━━━
53.39 s
> Snapshot: normalization-2
53.39 s
> Source: crates/gammalooprs/src/utils/test_utils.rs:44
53.39 s
> ────────────────────────────────────────────────────────────────────────────────
53.39 s
> Expression: b.to_canonical_string()
53.39 s
> ────────────────────────────────────────────────────────────────────────────────
53.39 s
> -old snapshot
53.39 s
> +new results
53.39 s
> ────────────┬───────────────────────────────────────────────────────────────────
53.39 s
> 1 │-gammalooprs::{spenso::rank1,spenso::tensor}::Q(1,spenso::{}::cind(1))
53.39 s
> 1 │+gammalooprs::{spenso::rank1,spenso::tensor,spenso::tensor-label:q}::Q(1,spenso::{}::cind(1))
53.39 s
> ────────────┴───────────────────────────────────────────────────────────────────
53.39 s
> To update snapshots run `cargo insta review`
53.39 s
> Stopped on the first failure. Run `cargo insta test` to run all snapshots.
53.39 s
> test utils::test_utils::normalization ... FAILED
53.39 s
>
53.39 s
> failures:
53.39 s
>
53.39 s
> failures:
53.39 s
> utils::test_utils::normalization
53.39 s
>
53.39 s
> test result: FAILED. 0 passed; 1 failed; 0 ignored; 0 measured; 445 filtered out; finished in 0.49s
53.39 s
>
53.39 s
> stderr ---
53.39 s
>
53.39 s
> thread 'utils::test_utils::normalization' (2238) panicked at /nix/store/c7lwckzlfrfsdw1ay0aqz4dpc2j7ry8d-vendor-cargo-deps/c19b7c6f923b580ac259164a89f2577984ad5ab09ee9d583b888f934adbbe8d0/insta-1.47.2/src/runtime.rs:719:13:
53.39 s
> snapshot assertion for 'normalization-2' failed in line 44
53.39 s
> stack backtrace:
53.39 s
> 0: __rustc::rust_begin_unwind
53.39 s
> 1: core::panicking::panic_fmt
53.39 s
> 2: insta::runtime::assert_snapshot
53.39 s
> 3: gammalooprs::utils::test_utils::normalization
53.39 s
> 4: <gammalooprs::utils::test_utils::normalization::{closure#0} as core::ops::function::FnOnce<()>>::call_once
53.39 s
> note: Some details are omitted, run with `RUST_BACKTRACE=full` for a verbose backtrace.
53.39 s
>
53.39 s
> ------------
53.39 s
> Summary [ 12.369s] 421 tests run: 420 passed , 1 failed , 31 skipped
53.39 s
> FAIL [ 0.525s] (372/421) gammalooprs utils::test_utils :: normalization
53.39 s
> stdout ---
53.39 s
>
53.39 s
> running 1 test
53.39 s
> ━━━━━━━━━━━━━━━━━━━━━━━━━━━━━━━ Snapshot Summary ━━━━━━━━━━━━━━━━━━━━━━━━━━━━━━━
53.39 s
> Snapshot: normalization-2
53.39 s
> Source: crates/gammalooprs/src/utils/test_utils.rs:44
53.39 s
> ────────────────────────────────────────────────────────────────────────────────
53.39 s
> Expression: b.to_canonical_string()
53.39 s
> ────────────────────────────────────────────────────────────────────────────────
53.39 s
> -old snapshot
53.39 s
> +new results
53.39 s
> ────────────┬───────────────────────────────────────────────────────────────────
53.39 s
> 1 │-gammalooprs::{spenso::rank1,spenso::tensor}::Q(1,spenso::{}::cind(1))
53.39 s
> 1 │+gammalooprs::{spenso::rank1,spenso::tensor,spenso::tensor-label:q}::Q(1,spenso::{}::cind(1))
53.39 s
> ────────────┴───────────────────────────────────────────────────────────────────
53.39 s
> To update snapshots run `cargo insta review`
53.39 s
> Stopped on the first failure. Run `cargo insta test` to run all snapshots.
53.39 s
> test utils::test_utils::normalization ... FAILED
53.39 s
>
53.39 s
> failures:
53.39 s
>
53.39 s
> failures:
53.39 s
> utils::test_utils::normalization
53.39 s
>
53.39 s
> test result: FAILED. 0 passed; 1 failed; 0 ignored; 0 measured; 445 filtered out; finished in 0.49s
53.39 s
>
53.39 s
> stderr ---
53.39 s
>
53.39 s
> thread 'utils::test_utils::normalization' (2238) panicked at /nix/store/c7lwckzlfrfsdw1ay0aqz4dpc2j7ry8d-vendor-cargo-deps/c19b7c6f923b580ac259164a89f2577984ad5ab09ee9d583b888f934adbbe8d0/insta-1.47.2/src/runtime.rs:719:13:
53.39 s
> snapshot assertion for 'normalization-2' failed in line 44
53.39 s
> stack backtrace:
53.39 s
> 0: __rustc::rust_begin_unwind
53.39 s
> 1: core::panicking::panic_fmt
53.39 s
> 2: insta::runtime::assert_snapshot
53.39 s
> 3: gammalooprs::utils::test_utils::normalization
53.39 s
> 4: <gammalooprs::utils::test_utils::normalization::{closure#0} as core::ops::function::FnOnce<()>>::call_once
53.39 s
> note: Some details are omitted, run with `RUST_BACKTRACE=full` for a verbose backtrace.
53.39 s
>
53.39 s
> error : test run failed
53.39 s
>
53.39 s
> ========== nextest test summary ==========
53.39 s
> report: target/nextest/ci_gammaloop/junit.xml
53.39 s
> tests: 421, failures: 1, errors: 0
53.39 s
>
53.39 s
> 1. gammalooprs::utils::test_utils::normalization
53.39 s
> failure: test failure with exit code 101
53.39 s
> thread 'utils::test_utils::normalization' (2238) panicked at /nix/store/c7lwckzlfrfsdw1ay0aqz4dpc2j7ry8d-vendor-cargo-deps/c19b7c6f923b580ac259164a89f2577984ad5ab09ee9d583b888f934adbbe8d0/insta-1.47.2/src/runtime.rs:719:13:
53.39 s
> snapshot assertion for 'normalization-2' failed in line 44
53.39 s
> stack backtrace:
53.39 s
> 0: __rustc::rust_begin_unwind
53.39 s
> 1: core::panicking::panic_fmt
53.39 s
> 2: insta::runtime::assert_snapshot
53.39 s
> 3: gammalooprs::utils::test_utils::normalization
53.39 s
> 4: <gammalooprs::utils::test_utils::normalization::{closure#0} as core::ops::function::FnOnce<()>>::call_once
53.39 s
> note: Some details are omitted, run with `RUST_BACKTRACE=full` for a verbose backtrace.
53.39 s
> system-out
53.39 s
> running 1 test
53.39 s
> ━━━━━━━━━━━━━━━━━━━━━━━━━━━━━━━ Snapshot Summary ━━━━━━━━━━━━━━━━━━━━━━━━━━━━━━━
53.39 s
> Snapshot: normalization-2
53.39 s
> Source: crates/gammalooprs/src/utils/test_utils.rs:44
53.39 s
> ────────────────────────────────────────────────────────────────────────────────
53.39 s
> Expression: b.to_canonical_string()
53.39 s
> ────────────────────────────────────────────────────────────────────────────────
53.39 s
> -old snapshot
53.39 s
> +new results
53.39 s
> ────────────┬───────────────────────────────────────────────────────────────────
53.39 s
> 1 │-gammalooprs::{spenso::rank1,spenso::tensor}::Q(1,spenso::{}::cind(1))
53.39 s
> 1 │+gammalooprs::{spenso::rank1,spenso::tensor,spenso::tensor-label:q}::Q(1,spenso::{}::cind(1))
53.39 s
> ────────────┴───────────────────────────────────────────────────────────────────
53.39 s
> To update snapshots run `cargo insta review`
53.39 s
> Stopped on the first failure. Run `cargo insta test` to run all snapshots.
53.39 s
> test utils::test_utils::normalization ... FAILED
53.39 s
>
53.39 s
> failures:
53.39 s
>
53.39 s
> failures:
53.39 s
> utils::test_utils::normalization
53.39 s
>
53.39 s
> test result: FAILED. 0 passed; 1 failed; 0 ignored; 0 measured; 445 filtered out; finished in 0.49s
53.39 s
> system-err
53.39 s
> thread 'utils::test_utils::normalization' (2238) panicked at /nix/store/c7lwckzlfrfsdw1ay0aqz4dpc2j7ry8d-vendor-cargo-deps/c19b7c6f923b580ac259164a89f2577984ad5ab09ee9d583b888f934adbbe8d0/insta-1.47.2/src/runtime.rs:719:13:
53.39 s
> snapshot assertion for 'normalization-2' failed in line 44
53.39 s
> stack backtrace:
53.39 s
> 0: __rustc::rust_begin_unwind
53.39 s
> 1: core::panicking::panic_fmt
53.39 s
> 2: insta::runtime::assert_snapshot
53.39 s
> 3: gammalooprs::utils::test_utils::normalization
53.39 s
> 4: <gammalooprs::utils::test_utils::normalization::{closure#0} as core::ops::function::FnOnce<()>>::call_once
53.39 s
> note: Some details are omitted, run with `RUST_BACKTRACE=full` for a verbose backtrace.
53.39 s
> =========================================
53.39 s
For full logs, run:
53.39 s
nix log /nix/store/5cl4rmcb98lnglh3nfwyp55040jvcmh7-gammaloop-nextest-core.drv
53.58 s
[1 built (1 failed ), 4 cRun failed.