0.00 s
$ /nix/store/61685rbaxmpigwi3z23i33sv3jyfl70q-coreutils-9.11/bin/timeout --kill-after=15s 7200s /nix/store/wknkybkzrc16r11vk5vrykh4wmw7a353-nix-2.34.8/bin/nix --extra-experimental-features nix-command --extra-experimental-features flakes flake clone git+https://github.com/alphal00p/gammaloop --dest /tmp/nix-ci-worker/stable-pwd/repo/
0.07 s
Cloning into '/tmp/nix-ci-worker/stable-pwd/repo'...
0.75 s
remote: Enumerating objects: 103497, done.
0.88 s
remote: Counting objects: 0% (1/10120)
remote: Counting objects: 1% (102/10120)
remote: Counting objects: 2% (203/10120)
remote: Counting objects: 3% (304/10120)
remote: Counting objects: 4% (405/10120)
remote: Counting objects: 5% (506/10120)
remote: Counting objects: 6% (608/10120)
remote: Counting objects: 7% (709/10120)
remote: Counting objects: 8% (810/10120)
remote: Counting objects: 9% (911/10120)
remote: Counting objects: 10% (1012/10120)
remote: Counting objects: 11% (1114/10120)
remote: Counting objects: 12% (1215/10120)
remote: Counting objects: 13% (1316/10120)
remote: Counting objects: 14% (1417/10120)
remote: Counting objects: 15% (1518/10120)
remote: Counting objects: 16% (1620/10120)
remote: Counting objects: 17% (1721/10120)
remote: Counting objects: 18% (1822/10120)
remote: Counting objects: 19% (1923/10120)
remote: Counting objects: 20% (2024/10120)
remote: Counting objects: 21% (2126/10120)
remote: Counting objects: 22% (2227/10120)
remote: Counting objects: 23% (2328/10120)
remote: Counting objects: 24% (2429/10120)
remote: Counting objects: 25% (2530/10120)
remote: Counting objects: 26% (2632/10120)
remote: Counting objects: 27% (2733/10120)
remote: Counting objects: 28% (2834/10120)
remote: Counting objects: 29% (2935/10120)
remote: Counting objects: 30% (3036/10120)
remote: Counting objects: 31% (3138/10120)
remote: Counting objects: 32% (3239/10120)
remote: Counting objects: 33% (3340/10120)
remote: Counting objects: 34% (3441/10120)
remote: Counting objects: 35% (3542/10120)
remote: Counting objects: 36% (3644/10120)
remote: Counting objects: 37% (3745/10120)
remote: Counting objects: 38% (3846/10120)
remote: Counting objects: 39% (3947/10120)
remote: Counting objects: 40% (4048/10120)
remote: Counting objects: 41% (4150/10120)
remote: Counting objects: 42% (4251/10120)
remote: Counting objects: 43% (4352/10120)
remote: Counting objects: 44% (4453/10120)
remote: Counting objects: 45% (4554/10120)
remote: Counting objects: 46% (4656/10120)
remote: Counting objects: 47% (4757/10120)
remote: Counting objects: 48% (4858/10120)
remote: Counting objects: 49% (4959/10120)
remote: Counting objects: 50% (5060/10120)
remote: Counting objects: 51% (5162/10120)
remote: Counting objects: 52% (5263/10120)
remote: Counting objects: 53% (5364/10120)
remote: Counting objects: 54% (5465/10120)
remote: Counting objects: 55% (5566/10120)
remote: Counting objects: 56% (5668/10120)
remote: Counting objects: 57% (5769/10120)
remote: Counting objects: 58% (5870/10120)
remote: Counting objects: 59% (5971/10120)
remote: Counting objects: 60% (6072/10120)
remote: Counting objects: 61% (6174/10120)
remote: Counting objects: 62% (6275/10120)
remote: Counting objects: 63% (6376/10120)
remote: Counting objects: 64% (6477/10120)
remote: Counting objects: 65% (6578/10120)
remote: Counting objects: 66% (6680/10120)
remote: Counting objects: 67% (6781/10120)
remote: Counting objects: 68% (6882/10120)
remote: Counting objects: 69% (6983/10120)
remote: Counting objects: 70% (7084/10120)
remote: Counting objects: 71% (7186/10120)
remote: Counting objects: 72% (7287/10120)
remote: Counting objects: 73% (7388/10120)
remote: Counting objects: 74% (7489/10120)
remote: Counting objects: 75% (7590/10120)
remote: Counting objects: 76% (7692/10120)
remote: Counting objects: 77% (7793/10120)
remote: Counting objects: 78% (7894/10120)
remote: Counting objects: 79% (7995/10120)
remote: Counting objects: 80% (8096/10120)
remote: Counting objects: 81% (8198/10120)
remote: Counting objects: 82% (8299/10120)
remote: Counting objects: 83% (8400/10120)
remote: Counting objects: 84% (8501/10120)
remote: Counting objects: 85% (8602/10120)
remote: Counting objects: 86% (8704/10120)
remote: Counting objects: 87% (8805/10120)
remote: Counting objects: 88% (8906/10120)
remote: Counting objects: 89% (9007/10120)
remote: Counting objects: 90% (9108/10120)
remote: Counting objects: 91% (9210/10120)
remote: Counting objects: 92% (9311/10120)
remote: Counting objects: 93% (9412/10120)
remote: Counting objects: 94% (9513/10120)
remote: Counting objects: 95% (9614/10120)
remote: Counting objects: 96% (9716/10120)
remote: Counting objects: 97% (9817/10120)
remote: Counting objects: 98% (9918/10120)
remote: Counting objects: 99% (10019/10120)
remote: Counting objects: 100% (10120/10120)
remote: Counting objects: 100% (10120/10120), done.
3.03 s
remote: Compressing objects: 0% (1/2291)
remote: Compressing objects: 1% (23/2291)
remote: Compressing objects: 2% (46/2291)
remote: Compressing objects: 3% (69/2291)
remote: Compressing objects: 4% (92/2291)
remote: Compressing objects: 5% (115/2291)
remote: Compressing objects: 6% (138/2291)
remote: Compressing objects: 7% (161/2291)
remote: Compressing objects: 8% (184/2291)
remote: Compressing objects: 9% (207/2291)
remote: Compressing objects: 10% (230/2291)
remote: Compressing objects: 10% (237/2291)
remote: Compressing objects: 11% (253/2291)
remote: Compressing objects: 12% (275/2291)
remote: Compressing objects: 13% (298/2291)
remote: Compressing objects: 14% (321/2291)
remote: Compressing objects: 15% (344/2291)
remote: Compressing objects: 16% (367/2291)
remote: Compressing objects: 17% (390/2291)
remote: Compressing objects: 18% (413/2291)
remote: Compressing objects: 19% (436/2291)
remote: Compressing objects: 20% (459/2291)
remote: Compressing objects: 21% (482/2291)
remote: Compressing objects: 22% (505/2291)
remote: Compressing objects: 22% (516/2291)
remote: Compressing objects: 23% (527/2291)
remote: Compressing objects: 24% (550/2291)
remote: Compressing objects: 25% (573/2291)
remote: Compressing objects: 26% (596/2291)
remote: Compressing objects: 27% (619/2291)
remote: Compressing objects: 28% (642/2291)
remote: Compressing objects: 29% (665/2291)
remote: Compressing objects: 30% (688/2291)
remote: Compressing objects: 31% (711/2291)
remote: Compressing objects: 32% (734/2291)
remote: Compressing objects: 33% (757/2291)
remote: Compressing objects: 34% (779/2291)
remote: Compressing objects: 35% (802/2291)
remote: Compressing objects: 36% (825/2291)
remote: Compressing objects: 37% (848/2291)
remote: Compressing objects: 38% (871/2291)
remote: Compressing objects: 39% (894/2291)
remote: Compressing objects: 40% (917/2291)
remote: Compressing objects: 41% (940/2291)
remote: Compressing objects: 42% (963/2291)
remote: Compressing objects: 43% (986/2291)
remote: Compressing objects: 44% (1009/2291)
remote: Compressing objects: 45% (1031/2291)
remote: Compressing objects: 46% (1054/2291)
remote: Compressing objects: 47% (1077/2291)
remote: Compressing objects: 48% (1100/2291)
remote: Compressing objects: 49% (1123/2291)
remote: Compressing objects: 50% (1146/2291)
remote: Compressing objects: 51% (1169/2291)
remote: Compressing objects: 52% (1192/2291)
remote: Compressing objects: 53% (1215/2291)
remote: Compressing objects: 54% (1238/2291)
remote: Compressing objects: 55% (1261/2291)
remote: Compressing objects: 56% (1283/2291)
remote: Compressing objects: 57% (1306/2291)
remote: Compressing objects: 58% (1329/2291)
remote: Compressing objects: 59% (1352/2291)
remote: Compressing objects: 60% (1375/2291)
remote: Compressing objects: 61% (1398/2291)
remote: Compressing objects: 62% (1421/2291)
remote: Compressing objects: 63% (1444/2291)
remote: Compressing objects: 64% (1467/2291)
remote: Compressing objects: 65% (1490/2291)
remote: Compressing objects: 66% (1513/2291)
remote: Compressing objects: 67% (1535/2291)
remote: Compressing objects: 68% (1558/2291)
remote: Compressing objects: 69% (1581/2291)
remote: Compressing objects: 70% (1604/2291)
remote: Compressing objects: 71% (1627/2291)
remote: Compressing objects: 72% (1650/2291)
remote: Compressing objects: 73% (1673/2291)
remote: Compressing objects: 74% (1696/2291)
remote: Compressing objects: 75% (1719/2291)
remote: Compressing objects: 76% (1742/2291)
remote: Compressing objects: 77% (1765/2291)
remote: Compressing objects: 78% (1787/2291)
remote: Compressing objects: 79% (1810/2291)
remote: Compressing objects: 80% (1833/2291)
remote: Compressing objects: 81% (1856/2291)
remote: Compressing objects: 82% (1879/2291)
remote: Compressing objects: 83% (1902/2291)
remote: Compressing objects: 84% (1925/2291)
remote: Compressing objects: 85% (1948/2291)
remote: Compressing objects: 86% (1971/2291)
remote: Compressing objects: 87% (1994/2291)
remote: Compressing objects: 88% (2017/2291)
remote: Compressing objects: 89% (2039/2291)
remote: Compressing objects: 90% (2062/2291)
remote: Compressing objects: 91% (2085/2291)
remote: Compressing objects: 92% (2108/2291)
remote: Compressing objects: 93% (2131/2291)
remote: Compressing objects: 94% (2154/2291)
remote: Compressing objects: 95% (2177/2291)
remote: Compressing objects: 96% (2200/2291)
remote: Compressing objects: 97% (2223/2291)
remote: Compressing objects: 98% (2246/2291)
remote: Compressing objects: 99% (2269/2291)
remote: Compressing objects: 100% (2291/2291)
remote: Compressing objects: 100% (2291/2291), done.
17.00 s
Receiving objects: 0% (1/103497)
Receiving objects: 1% (1035/103497)
Receiving objects: 2% (2070/103497)
Receiving objects: 3% (3105/103497)
Receiving objects: 4% (4140/103497)
Receiving objects: 5% (5175/103497)
Receiving objects: 6% (6210/103497)
Receiving objects: 7% (7245/103497), 12.84 MiB | 25.67 MiB/s
Receiving objects: 8% (8280/103497), 12.84 MiB | 25.67 MiB/s
Receiving objects: 9% (9315/103497), 12.84 MiB | 25.67 MiB/s
Receiving objects: 10% (10350/103497), 12.84 MiB | 25.67 MiB/s
Receiving objects: 11% (11385/103497), 12.84 MiB | 25.67 MiB/s
Receiving objects: 12% (12420/103497), 12.84 MiB | 25.67 MiB/s
Receiving objects: 13% (13455/103497), 12.84 MiB | 25.67 MiB/s
Receiving objects: 14% (14490/103497), 12.84 MiB | 25.67 MiB/s
Receiving objects: 15% (15525/103497), 12.84 MiB | 25.67 MiB/s
Receiving objects: 16% (16560/103497), 12.84 MiB | 25.67 MiB/s
Receiving objects: 17% (17595/103497), 12.84 MiB | 25.67 MiB/s
Receiving objects: 18% (18630/103497), 12.84 MiB | 25.67 MiB/s
Receiving objects: 19% (19665/103497), 12.84 MiB | 25.67 MiB/s
Receiving objects: 20% (20700/103497), 12.84 MiB | 25.67 MiB/s
Receiving objects: 21% (21735/103497), 12.84 MiB | 25.67 MiB/s
Receiving objects: 21% (22631/103497), 25.19 MiB | 25.18 MiB/s
Receiving objects: 22% (22770/103497), 25.19 MiB | 25.18 MiB/s
Receiving objects: 23% (23805/103497), 25.19 MiB | 25.18 MiB/s
Receiving objects: 24% (24840/103497), 25.19 MiB | 25.18 MiB/s
Receiving objects: 25% (25875/103497), 25.19 MiB | 25.18 MiB/s
Receiving objects: 26% (26910/103497), 25.19 MiB | 25.18 MiB/s
Receiving objects: 27% (27945/103497), 25.19 MiB | 25.18 MiB/s
Receiving objects: 28% (28980/103497), 25.19 MiB | 25.18 MiB/s
Receiving objects: 29% (30015/103497), 25.19 MiB | 25.18 MiB/s
Receiving objects: 30% (31050/103497), 25.19 MiB | 25.18 MiB/s
Receiving objects: 31% (32085/103497), 25.19 MiB | 25.18 MiB/s
Receiving objects: 32% (33120/103497), 25.19 MiB | 25.18 MiB/s
Receiving objects: 33% (34155/103497), 25.19 MiB | 25.18 MiB/s
Receiving objects: 34% (35189/103497), 35.54 MiB | 23.68 MiB/s
Receiving objects: 35% (36224/103497), 35.54 MiB | 23.68 MiB/s
Receiving objects: 36% (37259/103497), 35.54 MiB | 23.68 MiB/s
Receiving objects: 37% (38294/103497), 35.54 MiB | 23.68 MiB/s
Receiving objects: 38% (39329/103497), 35.54 MiB | 23.68 MiB/s
Receiving objects: 39% (40364/103497), 35.54 MiB | 23.68 MiB/s
Receiving objects: 40% (41399/103497), 35.54 MiB | 23.68 MiB/s
Receiving objects: 41% (42434/103497), 35.54 MiB | 23.68 MiB/s
Receiving objects: 41% (42573/103497), 50.53 MiB | 25.26 MiB/s
Receiving objects: 42% (43469/103497), 50.53 MiB | 25.26 MiB/s
Receiving objects: 43% (44504/103497), 50.53 MiB | 25.26 MiB/s
Receiving objects: 44% (45539/103497), 50.53 MiB | 25.26 MiB/s
Receiving objects: 45% (46574/103497), 50.53 MiB | 25.26 MiB/s
Receiving objects: 46% (47609/103497), 50.53 MiB | 25.26 MiB/s
Receiving objects: 47% (48644/103497), 50.53 MiB | 25.26 MiB/s
Receiving objects: 48% (49679/103497), 64.61 MiB | 25.76 MiB/s
Receiving objects: 49% (50714/103497), 64.61 MiB | 25.76 MiB/s
Receiving objects: 50% (51749/103497), 64.61 MiB | 25.76 MiB/s
Receiving objects: 51% (52784/103497), 64.61 MiB | 25.76 MiB/s
Receiving objects: 52% (53819/103497), 64.61 MiB | 25.76 MiB/s
Receiving objects: 52% (54041/103497), 64.61 MiB | 25.76 MiB/s
Receiving objects: 53% (54854/103497), 79.11 MiB | 26.30 MiB/s
Receiving objects: 54% (55889/103497), 79.11 MiB | 26.30 MiB/s
Receiving objects: 55% (56924/103497), 79.11 MiB | 26.30 MiB/s
Receiving objects: 55% (57071/103497), 108.16 MiB | 26.96 MiB/s
Receiving objects: 55% (57191/103497), 123.23 MiB | 27.20 MiB/s
Receiving objects: 55% (57530/103497), 152.49 MiB | 28.06 MiB/s
Receiving objects: 56% (57959/103497), 152.49 MiB | 28.06 MiB/s
Receiving objects: 57% (58994/103497), 163.57 MiB | 28.22 MiB/s
Receiving objects: 58% (60029/103497), 163.57 MiB | 28.22 MiB/s
Receiving objects: 59% (61064/103497), 163.57 MiB | 28.22 MiB/s
Receiving objects: 60% (62099/103497), 163.57 MiB | 28.22 MiB/s
Receiving objects: 61% (63134/103497), 163.57 MiB | 28.22 MiB/s
Receiving objects: 62% (64169/103497), 176.12 MiB | 27.68 MiB/s
Receiving objects: 62% (64748/103497), 176.12 MiB | 27.68 MiB/s
Receiving objects: 63% (65204/103497), 176.12 MiB | 27.68 MiB/s
Receiving objects: 64% (66239/103497), 190.18 MiB | 27.72 MiB/s
Receiving objects: 65% (67274/103497), 190.18 MiB | 27.72 MiB/s
Receiving objects: 66% (68309/103497), 190.18 MiB | 27.72 MiB/s
Receiving objects: 67% (69343/103497), 190.18 MiB | 27.72 MiB/s
Receiving objects: 68% (70378/103497), 190.18 MiB | 27.72 MiB/s
Receiving objects: 69% (71413/103497), 190.18 MiB | 27.72 MiB/s
Receiving objects: 70% (72448/103497), 190.18 MiB | 27.72 MiB/s
Receiving objects: 71% (73483/103497), 190.18 MiB | 27.72 MiB/s
Receiving objects: 72% (74518/103497), 190.18 MiB | 27.72 MiB/s
Receiving objects: 73% (75553/103497), 190.18 MiB | 27.72 MiB/s
Receiving objects: 74% (76588/103497), 205.15 MiB | 27.83 MiB/s
Receiving objects: 74% (76687/103497), 205.15 MiB | 27.83 MiB/s
Receiving objects: 75% (77623/103497), 218.96 MiB | 27.75 MiB/s
Receiving objects: 76% (78658/103497), 218.96 MiB | 27.75 MiB/s
Receiving objects: 77% (79693/103497), 233.65 MiB | 27.65 MiB/s
Receiving objects: 78% (80728/103497), 233.65 MiB | 27.65 MiB/s
Receiving objects: 79% (81763/103497), 233.65 MiB | 27.65 MiB/s
Receiving objects: 80% (82798/103497), 233.65 MiB | 27.65 MiB/s
Receiving objects: 80% (83637/103497), 233.65 MiB | 27.65 MiB/s
Receiving objects: 81% (83833/103497), 248.03 MiB | 27.62 MiB/s
Receiving objects: 81% (84334/103497), 262.64 MiB | 27.36 MiB/s
Receiving objects: 81% (84515/103497), 308.07 MiB | 29.01 MiB/s
Receiving objects: 82% (84868/103497), 308.07 MiB | 29.01 MiB/s
Receiving objects: 83% (85903/103497), 308.07 MiB | 29.01 MiB/s
Receiving objects: 84% (86938/103497), 322.25 MiB | 29.03 MiB/s
Receiving objects: 84% (87969/103497), 322.25 MiB | 29.03 MiB/s
Receiving objects: 85% (87973/103497), 322.25 MiB | 29.03 MiB/s
Receiving objects: 86% (89008/103497), 336.88 MiB | 28.96 MiB/s
Receiving objects: 87% (90043/103497), 336.88 MiB | 28.96 MiB/s
Receiving objects: 88% (91078/103497), 336.88 MiB | 28.96 MiB/s
Receiving objects: 88% (91430/103497), 351.65 MiB | 29.10 MiB/s
Receiving objects: 89% (92113/103497), 366.76 MiB | 29.26 MiB/s
Receiving objects: 90% (93148/103497), 381.85 MiB | 29.30 MiB/s
Receiving objects: 91% (94183/103497), 381.85 MiB | 29.30 MiB/s
Receiving objects: 92% (95218/103497), 381.85 MiB | 29.30 MiB/s
Receiving objects: 93% (96253/103497), 381.85 MiB | 29.30 MiB/s
Receiving objects: 94% (97288/103497), 381.85 MiB | 29.30 MiB/s
Receiving objects: 95% (98323/103497), 381.85 MiB | 29.30 MiB/s
Receiving objects: 96% (99358/103497), 381.85 MiB | 29.30 MiB/s
Receiving objects: 97% (100393/103497), 381.85 MiB | 29.30 MiB/s
Receiving objects: 98% (101428/103497), 381.85 MiB | 29.30 MiB/s
Receiving objects: 99% (102463/103497), 381.85 MiB | 29.30 MiB/s
remote: Total 103497 (delta 8623), reused 8045 (delta 7804), pack-reused 93377 (from 4)
17.00 s
Receiving objects: 100% (103497/103497), 381.85 MiB | 29.30 MiB/s
Receiving objects: 100% (103497/103497), 391.99 MiB | 28.06 MiB/s, done.
18.18 s
Resolving deltas: 0% (0/67811)
Resolving deltas: 1% (680/67811)
Resolving deltas: 2% (1357/67811)
Resolving deltas: 3% (2035/67811)
Resolving deltas: 4% (2713/67811)
Resolving deltas: 5% (3392/67811)
Resolving deltas: 6% (4072/67811)
Resolving deltas: 7% (4747/67811)
Resolving deltas: 8% (5425/67811)
Resolving deltas: 9% (6103/67811)
Resolving deltas: 10% (6782/67811)
Resolving deltas: 11% (7460/67811)
Resolving deltas: 12% (8138/67811)
Resolving deltas: 13% (8817/67811)
Resolving deltas: 14% (9494/67811)
Resolving deltas: 15% (10172/67811)
Resolving deltas: 16% (10850/67811)
Resolving deltas: 17% (11528/67811)
Resolving deltas: 18% (12206/67811)
Resolving deltas: 19% (12887/67811)
Resolving deltas: 20% (13563/67811)
Resolving deltas: 21% (14241/67811)
Resolving deltas: 22% (14919/67811)
Resolving deltas: 23% (15598/67811)
Resolving deltas: 24% (16275/67811)
Resolving deltas: 25% (16953/67811)
Resolving deltas: 26% (17631/67811)
Resolving deltas: 27% (18313/67811)
Resolving deltas: 28% (18988/67811)
Resolving deltas: 29% (19666/67811)
Resolving deltas: 30% (20345/67811)
Resolving deltas: 31% (21022/67811)
Resolving deltas: 32% (21700/67811)
Resolving deltas: 33% (22378/67811)
Resolving deltas: 34% (23056/67811)
Resolving deltas: 35% (23735/67811)
Resolving deltas: 36% (24414/67811)
Resolving deltas: 37% (25092/67811)
Resolving deltas: 38% (25770/67811)
Resolving deltas: 39% (26447/67811)
Resolving deltas: 40% (27125/67811)
Resolving deltas: 41% (27803/67811)
Resolving deltas: 42% (28481/67811)
Resolving deltas: 43% (29159/67811)
Resolving deltas: 44% (29837/67811)
Resolving deltas: 45% (30515/67811)
Resolving deltas: 46% (31194/67811)
Resolving deltas: 47% (31872/67811)
Resolving deltas: 48% (32550/67811)
Resolving deltas: 49% (33228/67811)
Resolving deltas: 50% (33908/67811)
Resolving deltas: 51% (34584/67811)
Resolving deltas: 52% (35262/67811)
Resolving deltas: 53% (35940/67811)
Resolving deltas: 54% (36618/67811)
Resolving deltas: 55% (37297/67811)
Resolving deltas: 56% (37975/67811)
Resolving deltas: 57% (38653/67811)
Resolving deltas: 58% (39331/67811)
Resolving deltas: 59% (40009/67811)
Resolving deltas: 60% (40687/67811)
Resolving deltas: 61% (41365/67811)
Resolving deltas: 62% (42043/67811)
Resolving deltas: 63% (42721/67811)
Resolving deltas: 64% (43400/67811)
Resolving deltas: 65% (44078/67811)
Resolving deltas: 66% (44756/67811)
Resolving deltas: 67% (45434/67811)
Resolving deltas: 68% (46112/67811)
Resolving deltas: 69% (46790/67811)
Resolving deltas: 70% (47468/67811)
Resolving deltas: 71% (48146/67811)
Resolving deltas: 72% (48824/67811)
Resolving deltas: 73% (49503/67811)
Resolving deltas: 74% (50181/67811)
Resolving deltas: 75% (50859/67811)
Resolving deltas: 76% (51537/67811)
Resolving deltas: 77% (52215/67811)
Resolving deltas: 78% (52893/67811)
Resolving deltas: 79% (53571/67811)
Resolving deltas: 80% (54249/67811)
Resolving deltas: 81% (54927/67811)
Resolving deltas: 82% (55606/67811)
Resolving deltas: 82% (56072/67811)
Resolving deltas: 83% (56284/67811)
Resolving deltas: 84% (56962/67811)
Resolving deltas: 85% (57640/67811)
Resolving deltas: 86% (58318/67811)
Resolving deltas: 87% (58997/67811)
Resolving deltas: 88% (59674/67811)
Resolving deltas: 89% (60352/67811)
Resolving deltas: 90% (61030/67811)
Resolving deltas: 91% (61709/67811)
Resolving deltas: 92% (62387/67811)
Resolving deltas: 93% (63065/67811)
Resolving deltas: 94% (63745/67811)
Resolving deltas: 95% (64421/67811)
Resolving deltas: 96% (65099/67811)
Resolving deltas: 97% (65777/67811)
Resolving deltas: 98% (66456/67811)
Resolving deltas: 99% (67133/67811)
Resolving deltas: 100% (67811/67811)
Resolving deltas: 100% (67811/67811), done.
18.79 s
Fetching commit 13c9bb203f1daef2670356779366ed6afc72bc51 for feynkit ...
18.79 s
$ /nix/store/5vpcfsdx1lcnlb2y4k7xyc74shp5qwbh-git-2.54.0/bin/git fetch origin 13c9bb203f1daef2670356779366ed6afc72bc51
19.21 s
From https://github.com/alphal00p/gammaloop
19.21 s
* branch 13c9bb203f1daef2670356779366ed6afc72bc51 -> FETCH_HEAD
19.22 s
$ /nix/store/61685rbaxmpigwi3z23i33sv3jyfl70q-coreutils-9.11/bin/timeout --kill-after=15s 7200s /nix/store/5vpcfsdx1lcnlb2y4k7xyc74shp5qwbh-git-2.54.0/bin/git -c advice.detachedHead=false checkout 13c9bb203f1daef2670356779366ed6afc72bc51
19.33 s
HEAD is now at 13c9bb203 bundle readable math typography in notebook HTML
19.33 s
$ /nix/store/61685rbaxmpigwi3z23i33sv3jyfl70q-coreutils-9.11/bin/timeout --kill-after=15s 7200s /nix/store/wknkybkzrc16r11vk5vrykh4wmw7a353-nix-2.34.8/bin/nix --extra-experimental-features nix-command --extra-experimental-features flakes --log-format internal-json run .#packages.x86_64-linux.nix-ci-check-gammaloop-nextest-core --print-build-logs
19.43 s
warning: ignoring untrusted flake configuration setting 'extra-substituters'.
19.43 s
Pass '--accept-flake-config' to trust it
19.43 s
warning: ignoring untrusted flake configuration setting 'extra-trusted-public-keys'.
19.43 s
Pass '--accept-flake-config' to trust it
24.02 s
24.09 s
Downloading cached nix-ci-check-gammaloop-nextest-core from https://cache.nix-ci.com
24.10 s
Downloaded cached nix-ci-check-gammaloop-nextest-core (1128 B) in 7ms
24.10 s
Progress: 0 of 1 built, 1 of 1 downloaded from cache
24.20 s
do you want to allow configuration setting 'extra-substituters' to be set to 'https://cache.nix-ci.com ' (y/N)? do you want to permanently mark this value as untrusted (y/N)? warning: ignoring untrusted flake configuration setting 'extra-substituters'.
24.20 s
Pass '--accept-flake-config' to trust it
24.20 s
evaluating derivation 'gdo you want to allow configuration setting 'extra-trusted-public-keys' to be set to 'nix-ci:g3xV5BDTLtIBZr/A00IU1x0EtKKlb7YLgBN2SgYgM6A= ' (y/N)? do you want to permanently mark this value as untrusted (y/N)? warning: ignoring untrusted flake configuration setting 'extra-trusted-public-keys'.
24.20 s
Pass '--accept-flake-config' to trust it
29.78 s
copying '/nix/store/hc7a
evaluating derivation 'g
copying '/nix/store/hc7a
evaluating derivation 'g
copying '/nix/store/hc7a
evaluating derivation 'g
copying '/nix/store/hc7a
evaluating derivation 'g
copying '/nix/store/hc7a
evaluating derivation 'g
querying info about miss
querying gammaloop-nexte
[0 /6 built, 4 /0 /4 copied
[0 /5 built, 3 /1 /4 copied
[0 /4 built, 2 /2 /4 copied
[0 /3 built, 1 /3 /4 copied
[0 /2 built, 4 copied (18
[1 /0 /2 built, 4 copied (gammaloop-nextest-binaries-core (post)> Uploading to the NixCI cache: /nix/store/g80wdpac9hkqa5wvvkyxxa90prjv3ifr-gammaloop-nextest-binaries-core
29.82 s
gammaloop-nextest-binaries-core (post)> warning: 'warn-short-path-literals' is deprecated, use 'lint-short-path-literals = ignore' instead
29.84 s
gammaloop-nextest-binaries-core (post)> copying 0 paths...
29.88 s
gammaloop-nextest-binaries-core (post)> warning: 'warn-short-path-literals' is deprecated, use 'lint-short-path-literals = ignore' instead
30.01 s
gammaloop-nextest-binaries-core (post)> copying 0 paths...
30.33 s
[1 /3 built, 4 copied (18
[1 /1 /2 built, 4 copied (gammaloop-nextest-core> Extracting 4 binaries (including 2 non-test binaries), 1 build script output directory, and 2 linked paths to /build/source
30.79 s
gammaloop-nextest-core> Extracted 20 files to /build/source in 0.46s
30.80 s
gammaloop-nextest-core> ------------
30.80 s
gammaloop-nextest-core> Nextest run ID b9f1d35e-9298-46f0-b406-e2cd72e74f95 with nextest profile: ci_gammaloop
30.80 s
gammaloop-nextest-core> Starting 341 tests across 2 binaries (1 test skipped )
31.17 s
gammaloop-nextest-core> ------------
31.17 s
gammaloop-nextest-core> Summary [ 0.369s] 341 tests run: 341 passed , 1 skipped
31.20 s
gammaloop-nextest-core>
31.20 s
gammaloop-nextest-core> ========== nextest test summary ==========
31.20 s
gammaloop-nextest-core> report: target/nextest/ci_gammaloop/junit.xml
31.20 s
gammaloop-nextest-core> tests: 341, failures: 0, errors: 0
31.20 s
gammaloop-nextest-core> No failing testcases found.
31.20 s
gammaloop-nextest-core> =========================================
31.21 s
gammaloop-nextest-core> Extracting 1 binary and 1 linked path to /build/source
31.28 s
gammaloop-nextest-core> Extracted 7 files to /build/source in 0.07s
31.28 s
gammaloop-nextest-core> ------------
31.28 s
gammaloop-nextest-core> Nextest run ID ec4e418f-958b-4ced-bd74-358e75ddd8ff with nextest profile: ci_gammaloop
31.28 s
gammaloop-nextest-core> Starting 19 tests across 1 binary
31.29 s
gammaloop-nextest-core> ------------
31.29 s
gammaloop-nextest-core> Summary [ 0.009s] 19 tests run: 19 passed , 0 skipped
31.32 s
gammaloop-nextest-core>
31.32 s
gammaloop-nextest-core> ========== nextest test summary ==========
31.32 s
gammaloop-nextest-core> report: target/nextest/ci_gammaloop/junit.xml
31.32 s
gammaloop-nextest-core> tests: 19, failures: 0, errors: 0
31.32 s
gammaloop-nextest-core> No failing testcases found.
31.32 s
gammaloop-nextest-core> =========================================
31.33 s
gammaloop-nextest-core> Extracting 1 binary to /build/source
31.36 s
gammaloop-nextest-core> Extracted 4 files to /build/source in 0.03s
31.37 s
gammaloop-nextest-core> ------------
31.37 s
gammaloop-nextest-core> Nextest run ID 387bba5c-27ab-41c7-b27b-bf0873d55362 with nextest profile: ci_gammaloop
31.37 s
gammaloop-nextest-core> Starting 0 tests across 1 binary
31.37 s
gammaloop-nextest-core> ------------
31.37 s
gammaloop-nextest-core> Summary [ 0.000s] 0 tests run: 0 passed , 0 skipped
31.40 s
gammaloop-nextest-core>
31.40 s
gammaloop-nextest-core> ========== nextest test summary ==========
31.40 s
gammaloop-nextest-core> report: target/nextest/ci_gammaloop/junit.xml
31.40 s
gammaloop-nextest-core> tests: 0, failures: 0, errors: 0
31.40 s
gammaloop-nextest-core> No failing testcases found.
31.40 s
gammaloop-nextest-core> =========================================
31.41 s
gammaloop-nextest-core> Extracting 4 binaries (including 1 non-test binary), 1 build script output directory, and 2 linked paths to /build/source
31.87 s
gammaloop-nextest-core> Extracted 19 files to /build/source in 0.46s
31.88 s
gammaloop-nextest-core> ------------
31.88 s
gammaloop-nextest-core> Nextest run ID a74d6932-b4d3-4b2d-9d4a-72c19298d93c with nextest profile: ci_gammaloop
31.88 s
gammaloop-nextest-core> Starting 421 tests across 3 binaries (31 tests skipped , including 30 tests via profile.ci_gammaloop.default-filter )
32.37 s
gammaloop-nextest-core> FAIL [ 0.056s] (369/421) gammalooprs utils::test_utils :: normalization
32.37 s
gammaloop-nextest-core> stdout ---
32.37 s
gammaloop-nextest-core>
32.37 s
gammaloop-nextest-core> running 1 test
32.37 s
gammaloop-nextest-core> ━━━━━━━━━━━━━━━━━━━━━━━━━━━━━━━ Snapshot Summary ━━━━━━━━━━━━━━━━━━━━━━━━━━━━━━━
32.37 s
gammaloop-nextest-core> Snapshot: normalization-2
32.37 s
gammaloop-nextest-core> Source: crates/gammalooprs/src/utils/test_utils.rs:44
32.37 s
gammaloop-nextest-core> ────────────────────────────────────────────────────────────────────────────────
32.37 s
gammaloop-nextest-core> Expression: b.to_canonical_string()
32.37 s
gammaloop-nextest-core> ────────────────────────────────────────────────────────────────────────────────
32.37 s
gammaloop-nextest-core> -old snapshot
32.37 s
gammaloop-nextest-core> +new results
32.37 s
gammaloop-nextest-core> ────────────┬───────────────────────────────────────────────────────────────────
32.37 s
gammaloop-nextest-core> 1 │-gammalooprs::{spenso::rank1,spenso::tensor}::Q(1,spenso::{}::cind(1))
32.37 s
gammaloop-nextest-core> 1 │+gammalooprs::{spenso::rank1,spenso::tensor,spenso::tensor-label:q}::Q(1,spenso::{}::cind(1))
32.37 s
gammaloop-nextest-core> ────────────┴───────────────────────────────────────────────────────────────────
32.37 s
gammaloop-nextest-core> To update snapshots run `cargo insta review`
32.37 s
gammaloop-nextest-core> Stopped on the first failure. Run `cargo insta test` to run all snapshots.
32.37 s
gammaloop-nextest-core> test utils::test_utils::normalization ... FAILED
32.37 s
gammaloop-nextest-core>
32.37 s
gammaloop-nextest-core> failures:
32.37 s
gammaloop-nextest-core>
32.37 s
gammaloop-nextest-core> failures:
32.37 s
gammaloop-nextest-core> utils::test_utils::normalization
32.37 s
gammaloop-nextest-core>
32.37 s
gammaloop-nextest-core> test result: FAILED. 0 passed; 1 failed; 0 ignored; 0 measured; 445 filtered out; finished in 0.05s
32.37 s
gammaloop-nextest-core>
32.37 s
gammaloop-nextest-core> stderr ---
32.37 s
gammaloop-nextest-core>
32.37 s
gammaloop-nextest-core> thread 'utils::test_utils::normalization' (2240) panicked at /nix/store/c7lwckzlfrfsdw1ay0aqz4dpc2j7ry8d-vendor-cargo-deps/c19b7c6f923b580ac259164a89f2577984ad5ab09ee9d583b888f934adbbe8d0/insta-1.47.2/src/runtime.rs:719:13:
32.37 s
gammaloop-nextest-core> snapshot assertion for 'normalization-2' failed in line 44
32.37 s
gammaloop-nextest-core> stack backtrace:
32.37 s
gammaloop-nextest-core> 0: __rustc::rust_begin_unwind
32.37 s
gammaloop-nextest-core> 1: core::panicking::panic_fmt
32.37 s
gammaloop-nextest-core> 2: insta::runtime::assert_snapshot
32.37 s
gammaloop-nextest-core> 3: gammalooprs::utils::test_utils::normalization
32.37 s
gammaloop-nextest-core> 4: <gammalooprs::utils::test_utils::normalization::{closure#0} as core::ops::function::FnOnce<()>>::call_once
32.37 s
gammaloop-nextest-core> note: Some details are omitted, run with `RUST_BACKTRACE=full` for a verbose backtrace.
32.37 s
gammaloop-nextest-core>
37.83 s
gammaloop-nextest-core> ------------
37.83 s
gammaloop-nextest-core> Summary [ 5.949s] 421 tests run: 420 passed , 1 failed , 31 skipped
37.83 s
gammaloop-nextest-core> FAIL [ 0.056s] (369/421) gammalooprs utils::test_utils :: normalization
37.83 s
gammaloop-nextest-core> stdout ---
37.83 s
gammaloop-nextest-core>
37.83 s
gammaloop-nextest-core> running 1 test
37.83 s
gammaloop-nextest-core> ━━━━━━━━━━━━━━━━━━━━━━━━━━━━━━━ Snapshot Summary ━━━━━━━━━━━━━━━━━━━━━━━━━━━━━━━
37.83 s
gammaloop-nextest-core> Snapshot: normalization-2
37.83 s
gammaloop-nextest-core> Source: crates/gammalooprs/src/utils/test_utils.rs:44
37.83 s
gammaloop-nextest-core> ────────────────────────────────────────────────────────────────────────────────
37.83 s
gammaloop-nextest-core> Expression: b.to_canonical_string()
37.83 s
gammaloop-nextest-core> ────────────────────────────────────────────────────────────────────────────────
37.83 s
gammaloop-nextest-core> -old snapshot
37.83 s
gammaloop-nextest-core> +new results
37.83 s
gammaloop-nextest-core> ────────────┬───────────────────────────────────────────────────────────────────
37.83 s
gammaloop-nextest-core> 1 │-gammalooprs::{spenso::rank1,spenso::tensor}::Q(1,spenso::{}::cind(1))
37.83 s
gammaloop-nextest-core> 1 │+gammalooprs::{spenso::rank1,spenso::tensor,spenso::tensor-label:q}::Q(1,spenso::{}::cind(1))
37.83 s
gammaloop-nextest-core> ────────────┴───────────────────────────────────────────────────────────────────
37.83 s
gammaloop-nextest-core> To update snapshots run `cargo insta review`
37.83 s
gammaloop-nextest-core> Stopped on the first failure. Run `cargo insta test` to run all snapshots.
37.83 s
gammaloop-nextest-core> test utils::test_utils::normalization ... FAILED
37.83 s
gammaloop-nextest-core>
37.83 s
gammaloop-nextest-core> failures:
37.83 s
gammaloop-nextest-core>
37.83 s
gammaloop-nextest-core> failures:
37.83 s
gammaloop-nextest-core> utils::test_utils::normalization
37.83 s
gammaloop-nextest-core>
37.83 s
gammaloop-nextest-core> test result: FAILED. 0 passed; 1 failed; 0 ignored; 0 measured; 445 filtered out; finished in 0.05s
37.83 s
gammaloop-nextest-core>
37.83 s
gammaloop-nextest-core> stderr ---
37.83 s
gammaloop-nextest-core>
37.83 s
gammaloop-nextest-core> thread 'utils::test_utils::normalization' (2240) panicked at /nix/store/c7lwckzlfrfsdw1ay0aqz4dpc2j7ry8d-vendor-cargo-deps/c19b7c6f923b580ac259164a89f2577984ad5ab09ee9d583b888f934adbbe8d0/insta-1.47.2/src/runtime.rs:719:13:
37.83 s
gammaloop-nextest-core> snapshot assertion for 'normalization-2' failed in line 44
37.83 s
gammaloop-nextest-core> stack backtrace:
37.83 s
gammaloop-nextest-core> 0: __rustc::rust_begin_unwind
37.83 s
gammaloop-nextest-core> 1: core::panicking::panic_fmt
37.83 s
gammaloop-nextest-core> 2: insta::runtime::assert_snapshot
37.83 s
gammaloop-nextest-core> 3: gammalooprs::utils::test_utils::normalization
37.83 s
gammaloop-nextest-core> 4: <gammalooprs::utils::test_utils::normalization::{closure#0} as core::ops::function::FnOnce<()>>::call_once
37.83 s
gammaloop-nextest-core> note: Some details are omitted, run with `RUST_BACKTRACE=full` for a verbose backtrace.
37.83 s
gammaloop-nextest-core>
37.83 s
gammaloop-nextest-core> error : test run failed
37.86 s
gammaloop-nextest-core>
37.86 s
gammaloop-nextest-core> ========== nextest test summary ==========
37.86 s
gammaloop-nextest-core> report: target/nextest/ci_gammaloop/junit.xml
37.86 s
gammaloop-nextest-core> tests: 421, failures: 1, errors: 0
37.86 s
gammaloop-nextest-core>
37.86 s
gammaloop-nextest-core> 1. gammalooprs::utils::test_utils::normalization
37.86 s
gammaloop-nextest-core> failure: test failure with exit code 101
37.86 s
gammaloop-nextest-core> thread 'utils::test_utils::normalization' (2240) panicked at /nix/store/c7lwckzlfrfsdw1ay0aqz4dpc2j7ry8d-vendor-cargo-deps/c19b7c6f923b580ac259164a89f2577984ad5ab09ee9d583b888f934adbbe8d0/insta-1.47.2/src/runtime.rs:719:13:
37.86 s
gammaloop-nextest-core> snapshot assertion for 'normalization-2' failed in line 44
37.86 s
gammaloop-nextest-core> stack backtrace:
37.86 s
gammaloop-nextest-core> 0: __rustc::rust_begin_unwind
37.86 s
gammaloop-nextest-core> 1: core::panicking::panic_fmt
37.86 s
gammaloop-nextest-core> 2: insta::runtime::assert_snapshot
37.86 s
gammaloop-nextest-core> 3: gammalooprs::utils::test_utils::normalization
37.86 s
gammaloop-nextest-core> 4: <gammalooprs::utils::test_utils::normalization::{closure#0} as core::ops::function::FnOnce<()>>::call_once
37.86 s
gammaloop-nextest-core> note: Some details are omitted, run with `RUST_BACKTRACE=full` for a verbose backtrace.
37.86 s
gammaloop-nextest-core> system-out
37.86 s
gammaloop-nextest-core> running 1 test
37.86 s
gammaloop-nextest-core> ━━━━━━━━━━━━━━━━━━━━━━━━━━━━━━━ Snapshot Summary ━━━━━━━━━━━━━━━━━━━━━━━━━━━━━━━
37.86 s
gammaloop-nextest-core> Snapshot: normalization-2
37.86 s
gammaloop-nextest-core> Source: crates/gammalooprs/src/utils/test_utils.rs:44
37.86 s
gammaloop-nextest-core> ────────────────────────────────────────────────────────────────────────────────
37.86 s
gammaloop-nextest-core> Expression: b.to_canonical_string()
37.86 s
gammaloop-nextest-core> ────────────────────────────────────────────────────────────────────────────────
37.86 s
gammaloop-nextest-core> -old snapshot
37.86 s
gammaloop-nextest-core> +new results
37.86 s
gammaloop-nextest-core> ────────────┬───────────────────────────────────────────────────────────────────
37.86 s
gammaloop-nextest-core> 1 │-gammalooprs::{spenso::rank1,spenso::tensor}::Q(1,spenso::{}::cind(1))
37.86 s
gammaloop-nextest-core> 1 │+gammalooprs::{spenso::rank1,spenso::tensor,spenso::tensor-label:q}::Q(1,spenso::{}::cind(1))
37.86 s
gammaloop-nextest-core> ────────────┴───────────────────────────────────────────────────────────────────
37.86 s
gammaloop-nextest-core> To update snapshots run `cargo insta review`
37.86 s
gammaloop-nextest-core> Stopped on the first failure. Run `cargo insta test` to run all snapshots.
37.86 s
gammaloop-nextest-core> test utils::test_utils::normalization ... FAILED
37.86 s
gammaloop-nextest-core>
37.86 s
gammaloop-nextest-core> failures:
37.86 s
gammaloop-nextest-core>
37.86 s
gammaloop-nextest-core> failures:
37.86 s
gammaloop-nextest-core> utils::test_utils::normalization
37.86 s
gammaloop-nextest-core>
37.86 s
gammaloop-nextest-core> test result: FAILED. 0 passed; 1 failed; 0 ignored; 0 measured; 445 filtered out; finished in 0.05s
37.86 s
gammaloop-nextest-core> system-err
37.86 s
gammaloop-nextest-core> thread 'utils::test_utils::normalization' (2240) panicked at /nix/store/c7lwckzlfrfsdw1ay0aqz4dpc2j7ry8d-vendor-cargo-deps/c19b7c6f923b580ac259164a89f2577984ad5ab09ee9d583b888f934adbbe8d0/insta-1.47.2/src/runtime.rs:719:13:
37.86 s
gammaloop-nextest-core> snapshot assertion for 'normalization-2' failed in line 44
37.86 s
gammaloop-nextest-core> stack backtrace:
37.86 s
gammaloop-nextest-core> 0: __rustc::rust_begin_unwind
37.86 s
gammaloop-nextest-core> 1: core::panicking::panic_fmt
37.86 s
gammaloop-nextest-core> 2: insta::runtime::assert_snapshot
37.86 s
gammaloop-nextest-core> 3: gammalooprs::utils::test_utils::normalization
37.86 s
gammaloop-nextest-core> 4: <gammalooprs::utils::test_utils::normalization::{closure#0} as core::ops::function::FnOnce<()>>::call_once
37.86 s
gammaloop-nextest-core> note: Some details are omitted, run with `RUST_BACKTRACE=full` for a verbose backtrace.
37.86 s
gammaloop-nextest-core> =========================================
38.00 s
[1 built (1 failed ), 4 cerror: Cannot build '/nix/store/5cl4rmcb98lnglh3nfwyp55040jvcmh7-gammaloop-nextest-core.drv '.
38.00 s
Reason: builder failed with exit code 100 .
38.00 s
Output paths:
38.00 s
/nix/store/dxghgh5qnfky7k3022xcjys81gnbqg4w-gammaloop-nextest-core
38.00 s
Last 176 log lines:
38.00 s
> Extracting 4 binaries (including 2 non-test binaries), 1 build script output directory, and 2 linked paths to /build/source
38.00 s
> Extracted 20 files to /build/source in 0.46s
38.00 s
> ------------
38.00 s
> Nextest run ID b9f1d35e-9298-46f0-b406-e2cd72e74f95 with nextest profile: ci_gammaloop
38.00 s
> Starting 341 tests across 2 binaries (1 test skipped )
38.00 s
> ------------
38.00 s
> Summary [ 0.369s] 341 tests run: 341 passed , 1 skipped
38.00 s
>
38.00 s
> ========== nextest test summary ==========
38.00 s
> report: target/nextest/ci_gammaloop/junit.xml
38.00 s
> tests: 341, failures: 0, errors: 0
38.00 s
> No failing testcases found.
38.00 s
> =========================================
38.00 s
> Extracting 1 binary and 1 linked path to /build/source
38.00 s
> Extracted 7 files to /build/source in 0.07s
38.00 s
> ------------
38.00 s
> Nextest run ID ec4e418f-958b-4ced-bd74-358e75ddd8ff with nextest profile: ci_gammaloop
38.00 s
> Starting 19 tests across 1 binary
38.00 s
> ------------
38.00 s
> Summary [ 0.009s] 19 tests run: 19 passed , 0 skipped
38.00 s
>
38.00 s
> ========== nextest test summary ==========
38.00 s
> report: target/nextest/ci_gammaloop/junit.xml
38.00 s
> tests: 19, failures: 0, errors: 0
38.00 s
> No failing testcases found.
38.00 s
> =========================================
38.00 s
> Extracting 1 binary to /build/source
38.00 s
> Extracted 4 files to /build/source in 0.03s
38.00 s
> ------------
38.00 s
> Nextest run ID 387bba5c-27ab-41c7-b27b-bf0873d55362 with nextest profile: ci_gammaloop
38.00 s
> Starting 0 tests across 1 binary
38.00 s
> ------------
38.00 s
> Summary [ 0.000s] 0 tests run: 0 passed , 0 skipped
38.00 s
>
38.00 s
> ========== nextest test summary ==========
38.00 s
> report: target/nextest/ci_gammaloop/junit.xml
38.00 s
> tests: 0, failures: 0, errors: 0
38.00 s
> No failing testcases found.
38.00 s
> =========================================
38.00 s
> Extracting 4 binaries (including 1 non-test binary), 1 build script output directory, and 2 linked paths to /build/source
38.00 s
> Extracted 19 files to /build/source in 0.46s
38.00 s
> ------------
38.00 s
> Nextest run ID a74d6932-b4d3-4b2d-9d4a-72c19298d93c with nextest profile: ci_gammaloop
38.00 s
> Starting 421 tests across 3 binaries (31 tests skipped , including 30 tests via profile.ci_gammaloop.default-filter )
38.00 s
> FAIL [ 0.056s] (369/421) gammalooprs utils::test_utils :: normalization
38.00 s
> stdout ---
38.00 s
>
38.00 s
> running 1 test
38.00 s
> ━━━━━━━━━━━━━━━━━━━━━━━━━━━━━━━ Snapshot Summary ━━━━━━━━━━━━━━━━━━━━━━━━━━━━━━━
38.00 s
> Snapshot: normalization-2
38.00 s
> Source: crates/gammalooprs/src/utils/test_utils.rs:44
38.00 s
> ────────────────────────────────────────────────────────────────────────────────
38.00 s
> Expression: b.to_canonical_string()
38.00 s
> ────────────────────────────────────────────────────────────────────────────────
38.00 s
> -old snapshot
38.00 s
> +new results
38.00 s
> ────────────┬───────────────────────────────────────────────────────────────────
38.00 s
> 1 │-gammalooprs::{spenso::rank1,spenso::tensor}::Q(1,spenso::{}::cind(1))
38.00 s
> 1 │+gammalooprs::{spenso::rank1,spenso::tensor,spenso::tensor-label:q}::Q(1,spenso::{}::cind(1))
38.00 s
> ────────────┴───────────────────────────────────────────────────────────────────
38.00 s
> To update snapshots run `cargo insta review`
38.00 s
> Stopped on the first failure. Run `cargo insta test` to run all snapshots.
38.00 s
> test utils::test_utils::normalization ... FAILED
38.00 s
>
38.00 s
> failures:
38.00 s
>
38.00 s
> failures:
38.00 s
> utils::test_utils::normalization
38.00 s
>
38.00 s
> test result: FAILED. 0 passed; 1 failed; 0 ignored; 0 measured; 445 filtered out; finished in 0.05s
38.00 s
>
38.00 s
> stderr ---
38.00 s
>
38.00 s
> thread 'utils::test_utils::normalization' (2240) panicked at /nix/store/c7lwckzlfrfsdw1ay0aqz4dpc2j7ry8d-vendor-cargo-deps/c19b7c6f923b580ac259164a89f2577984ad5ab09ee9d583b888f934adbbe8d0/insta-1.47.2/src/runtime.rs:719:13:
38.00 s
> snapshot assertion for 'normalization-2' failed in line 44
38.00 s
> stack backtrace:
38.00 s
> 0: __rustc::rust_begin_unwind
38.00 s
> 1: core::panicking::panic_fmt
38.00 s
> 2: insta::runtime::assert_snapshot
38.00 s
> 3: gammalooprs::utils::test_utils::normalization
38.00 s
> 4: <gammalooprs::utils::test_utils::normalization::{closure#0} as core::ops::function::FnOnce<()>>::call_once
38.00 s
> note: Some details are omitted, run with `RUST_BACKTRACE=full` for a verbose backtrace.
38.00 s
>
38.00 s
> ------------
38.00 s
> Summary [ 5.949s] 421 tests run: 420 passed , 1 failed , 31 skipped
38.00 s
> FAIL [ 0.056s] (369/421) gammalooprs utils::test_utils :: normalization
38.00 s
> stdout ---
38.00 s
>
38.00 s
> running 1 test
38.00 s
> ━━━━━━━━━━━━━━━━━━━━━━━━━━━━━━━ Snapshot Summary ━━━━━━━━━━━━━━━━━━━━━━━━━━━━━━━
38.00 s
> Snapshot: normalization-2
38.00 s
> Source: crates/gammalooprs/src/utils/test_utils.rs:44
38.00 s
> ────────────────────────────────────────────────────────────────────────────────
38.00 s
> Expression: b.to_canonical_string()
38.00 s
> ────────────────────────────────────────────────────────────────────────────────
38.00 s
> -old snapshot
38.00 s
> +new results
38.00 s
> ────────────┬───────────────────────────────────────────────────────────────────
38.00 s
> 1 │-gammalooprs::{spenso::rank1,spenso::tensor}::Q(1,spenso::{}::cind(1))
38.00 s
> 1 │+gammalooprs::{spenso::rank1,spenso::tensor,spenso::tensor-label:q}::Q(1,spenso::{}::cind(1))
38.00 s
> ────────────┴───────────────────────────────────────────────────────────────────
38.00 s
> To update snapshots run `cargo insta review`
38.00 s
> Stopped on the first failure. Run `cargo insta test` to run all snapshots.
38.00 s
> test utils::test_utils::normalization ... FAILED
38.00 s
>
38.00 s
> failures:
38.00 s
>
38.00 s
> failures:
38.00 s
> utils::test_utils::normalization
38.00 s
>
38.00 s
> test result: FAILED. 0 passed; 1 failed; 0 ignored; 0 measured; 445 filtered out; finished in 0.05s
38.00 s
>
38.00 s
> stderr ---
38.00 s
>
38.00 s
> thread 'utils::test_utils::normalization' (2240) panicked at /nix/store/c7lwckzlfrfsdw1ay0aqz4dpc2j7ry8d-vendor-cargo-deps/c19b7c6f923b580ac259164a89f2577984ad5ab09ee9d583b888f934adbbe8d0/insta-1.47.2/src/runtime.rs:719:13:
38.00 s
> snapshot assertion for 'normalization-2' failed in line 44
38.00 s
> stack backtrace:
38.00 s
> 0: __rustc::rust_begin_unwind
38.00 s
> 1: core::panicking::panic_fmt
38.00 s
> 2: insta::runtime::assert_snapshot
38.00 s
> 3: gammalooprs::utils::test_utils::normalization
38.00 s
> 4: <gammalooprs::utils::test_utils::normalization::{closure#0} as core::ops::function::FnOnce<()>>::call_once
38.00 s
> note: Some details are omitted, run with `RUST_BACKTRACE=full` for a verbose backtrace.
38.00 s
>
38.00 s
> error : test run failed
38.00 s
>
38.00 s
> ========== nextest test summary ==========
38.00 s
> report: target/nextest/ci_gammaloop/junit.xml
38.00 s
> tests: 421, failures: 1, errors: 0
38.00 s
>
38.00 s
> 1. gammalooprs::utils::test_utils::normalization
38.00 s
> failure: test failure with exit code 101
38.00 s
> thread 'utils::test_utils::normalization' (2240) panicked at /nix/store/c7lwckzlfrfsdw1ay0aqz4dpc2j7ry8d-vendor-cargo-deps/c19b7c6f923b580ac259164a89f2577984ad5ab09ee9d583b888f934adbbe8d0/insta-1.47.2/src/runtime.rs:719:13:
38.00 s
> snapshot assertion for 'normalization-2' failed in line 44
38.00 s
> stack backtrace:
38.00 s
> 0: __rustc::rust_begin_unwind
38.00 s
> 1: core::panicking::panic_fmt
38.00 s
> 2: insta::runtime::assert_snapshot
38.00 s
> 3: gammalooprs::utils::test_utils::normalization
38.00 s
> 4: <gammalooprs::utils::test_utils::normalization::{closure#0} as core::ops::function::FnOnce<()>>::call_once
38.00 s
> note: Some details are omitted, run with `RUST_BACKTRACE=full` for a verbose backtrace.
38.00 s
> system-out
38.00 s
> running 1 test
38.00 s
> ━━━━━━━━━━━━━━━━━━━━━━━━━━━━━━━ Snapshot Summary ━━━━━━━━━━━━━━━━━━━━━━━━━━━━━━━
38.00 s
> Snapshot: normalization-2
38.00 s
> Source: crates/gammalooprs/src/utils/test_utils.rs:44
38.00 s
> ────────────────────────────────────────────────────────────────────────────────
38.00 s
> Expression: b.to_canonical_string()
38.00 s
> ────────────────────────────────────────────────────────────────────────────────
38.00 s
> -old snapshot
38.00 s
> +new results
38.00 s
> ────────────┬───────────────────────────────────────────────────────────────────
38.00 s
> 1 │-gammalooprs::{spenso::rank1,spenso::tensor}::Q(1,spenso::{}::cind(1))
38.00 s
> 1 │+gammalooprs::{spenso::rank1,spenso::tensor,spenso::tensor-label:q}::Q(1,spenso::{}::cind(1))
38.00 s
> ────────────┴───────────────────────────────────────────────────────────────────
38.00 s
> To update snapshots run `cargo insta review`
38.00 s
> Stopped on the first failure. Run `cargo insta test` to run all snapshots.
38.00 s
> test utils::test_utils::normalization ... FAILED
38.00 s
>
38.00 s
> failures:
38.00 s
>
38.00 s
> failures:
38.00 s
> utils::test_utils::normalization
38.00 s
>
38.00 s
> test result: FAILED. 0 passed; 1 failed; 0 ignored; 0 measured; 445 filtered out; finished in 0.05s
38.00 s
> system-err
38.00 s
> thread 'utils::test_utils::normalization' (2240) panicked at /nix/store/c7lwckzlfrfsdw1ay0aqz4dpc2j7ry8d-vendor-cargo-deps/c19b7c6f923b580ac259164a89f2577984ad5ab09ee9d583b888f934adbbe8d0/insta-1.47.2/src/runtime.rs:719:13:
38.00 s
> snapshot assertion for 'normalization-2' failed in line 44
38.00 s
> stack backtrace:
38.00 s
> 0: __rustc::rust_begin_unwind
38.00 s
> 1: core::panicking::panic_fmt
38.00 s
> 2: insta::runtime::assert_snapshot
38.00 s
> 3: gammalooprs::utils::test_utils::normalization
38.00 s
> 4: <gammalooprs::utils::test_utils::normalization::{closure#0} as core::ops::function::FnOnce<()>>::call_once
38.00 s
> note: Some details are omitted, run with `RUST_BACKTRACE=full` for a verbose backtrace.
38.00 s
> =========================================
38.00 s
For full logs, run:
38.00 s
nix log /nix/store/5cl4rmcb98lnglh3nfwyp55040jvcmh7-gammaloop-nextest-core.drv
38.15 s
Run failed.