test packages.x86_64-linux.nix-ci-check-gammaloop-nextest-feynkit

Reproduce this run
Original Run
  1. 0.00 s $ /nix/store/61685rbaxmpigwi3z23i33sv3jyfl70q-coreutils-9.11/bin/timeout --kill-after=15s 7200s /nix/store/wknkybkzrc16r11vk5vrykh4wmw7a353-nix-2.34.8/bin/nix --extra-experimental-features nix-command --extra-experimental-features flakes flake clone git+https://github.com/alphal00p/gammaloop --dest /tmp/nix-ci-worker/stable-pwd/repo/
  2. 0.09 s Cloning into '/tmp/nix-ci-worker/stable-pwd/repo'...
  3. 0.80 s remote: Enumerating objects: 103497, done.
  4. 0.93 s remote: Counting objects: 0% (1/10211) remote: Counting objects: 1% (103/10211) remote: Counting objects: 2% (205/10211) remote: Counting objects: 3% (307/10211) remote: Counting objects: 4% (409/10211) remote: Counting objects: 5% (511/10211) remote: Counting objects: 6% (613/10211) remote: Counting objects: 7% (715/10211) remote: Counting objects: 8% (817/10211) remote: Counting objects: 9% (919/10211) remote: Counting objects: 10% (1022/10211) remote: Counting objects: 11% (1124/10211) remote: Counting objects: 12% (1226/10211) remote: Counting objects: 13% (1328/10211) remote: Counting objects: 14% (1430/10211) remote: Counting objects: 15% (1532/10211) remote: Counting objects: 16% (1634/10211) remote: Counting objects: 17% (1736/10211) remote: Counting objects: 18% (1838/10211) remote: Counting objects: 19% (1941/10211) remote: Counting objects: 20% (2043/10211) remote: Counting objects: 21% (2145/10211) remote: Counting objects: 22% (2247/10211) remote: Counting objects: 23% (2349/10211) remote: Counting objects: 24% (2451/10211) remote: Counting objects: 25% (2553/10211) remote: Counting objects: 26% (2655/10211) remote: Counting objects: 27% (2757/10211) remote: Counting objects: 28% (2860/10211) remote: Counting objects: 29% (2962/10211) remote: Counting objects: 30% (3064/10211) remote: Counting objects: 31% (3166/10211) remote: Counting objects: 32% (3268/10211) remote: Counting objects: 33% (3370/10211) remote: Counting objects: 34% (3472/10211) remote: Counting objects: 35% (3574/10211) remote: Counting objects: 36% (3676/10211) remote: Counting objects: 37% (3779/10211) remote: Counting objects: 38% (3881/10211) remote: Counting objects: 39% (3983/10211) remote: Counting objects: 40% (4085/10211) remote: Counting objects: 41% (4187/10211) remote: Counting objects: 42% (4289/10211) remote: Counting objects: 43% (4391/10211) remote: Counting objects: 44% (4493/10211) remote: Counting objects: 45% (4595/10211) remote: Counting objects: 46% (4698/10211) remote: Counting objects: 47% (4800/10211) remote: Counting objects: 48% (4902/10211) remote: Counting objects: 49% (5004/10211) remote: Counting objects: 50% (5106/10211) remote: Counting objects: 51% (5208/10211) remote: Counting objects: 52% (5310/10211) remote: Counting objects: 53% (5412/10211) remote: Counting objects: 54% (5514/10211) remote: Counting objects: 55% (5617/10211) remote: Counting objects: 56% (5719/10211) remote: Counting objects: 57% (5821/10211) remote: Counting objects: 58% (5923/10211) remote: Counting objects: 59% (6025/10211) remote: Counting objects: 60% (6127/10211) remote: Counting objects: 61% (6229/10211) remote: Counting objects: 62% (6331/10211) remote: Counting objects: 63% (6433/10211) remote: Counting objects: 64% (6536/10211) remote: Counting objects: 65% (6638/10211) remote: Counting objects: 66% (6740/10211) remote: Counting objects: 67% (6842/10211) remote: Counting objects: 68% (6944/10211) remote: Counting objects: 69% (7046/10211) remote: Counting objects: 70% (7148/10211) remote: Counting objects: 71% (7250/10211) remote: Counting objects: 72% (7352/10211) remote: Counting objects: 73% (7455/10211) remote: Counting objects: 74% (7557/10211) remote: Counting objects: 75% (7659/10211) remote: Counting objects: 76% (7761/10211) remote: Counting objects: 77% (7863/10211) remote: Counting objects: 78% (7965/10211) remote: Counting objects: 79% (8067/10211) remote: Counting objects: 80% (8169/10211) remote: Counting objects: 81% (8271/10211) remote: Counting objects: 82% (8374/10211) remote: Counting objects: 83% (8476/10211) remote: Counting objects: 84% (8578/10211) remote: Counting objects: 85% (8680/10211) remote: Counting objects: 86% (8782/10211) remote: Counting objects: 87% (8884/10211) remote: Counting objects: 88% (8986/10211) remote: Counting objects: 89% (9088/10211) remote: Counting objects: 90% (9190/10211) remote: Counting objects: 91% (9293/10211) remote: Counting objects: 92% (9395/10211) remote: Counting objects: 93% (9497/10211) remote: Counting objects: 94% (9599/10211) remote: Counting objects: 95% (9701/10211) remote: Counting objects: 96% (9803/10211) remote: Counting objects: 97% (9905/10211) remote: Counting objects: 98% (10007/10211) remote: Counting objects: 99% (10109/10211) remote: Counting objects: 100% (10211/10211) remote: Counting objects: 100% (10211/10211), done.
  5. 3.06 s remote: Compressing objects: 0% (1/2329) remote: Compressing objects: 1% (24/2329) remote: Compressing objects: 2% (47/2329) remote: Compressing objects: 3% (70/2329) remote: Compressing objects: 4% (94/2329) remote: Compressing objects: 5% (117/2329) remote: Compressing objects: 6% (140/2329) remote: Compressing objects: 7% (164/2329) remote: Compressing objects: 8% (187/2329) remote: Compressing objects: 9% (210/2329) remote: Compressing objects: 10% (233/2329) remote: Compressing objects: 10% (239/2329) remote: Compressing objects: 11% (257/2329) remote: Compressing objects: 12% (280/2329) remote: Compressing objects: 13% (303/2329) remote: Compressing objects: 14% (327/2329) remote: Compressing objects: 15% (350/2329) remote: Compressing objects: 16% (373/2329) remote: Compressing objects: 17% (396/2329) remote: Compressing objects: 18% (420/2329) remote: Compressing objects: 19% (443/2329) remote: Compressing objects: 20% (466/2329) remote: Compressing objects: 21% (490/2329) remote: Compressing objects: 22% (513/2329) remote: Compressing objects: 23% (536/2329) remote: Compressing objects: 23% (547/2329) remote: Compressing objects: 24% (559/2329) remote: Compressing objects: 25% (583/2329) remote: Compressing objects: 26% (606/2329) remote: Compressing objects: 27% (629/2329) remote: Compressing objects: 28% (653/2329) remote: Compressing objects: 29% (676/2329) remote: Compressing objects: 30% (699/2329) remote: Compressing objects: 31% (722/2329) remote: Compressing objects: 32% (746/2329) remote: Compressing objects: 33% (769/2329) remote: Compressing objects: 34% (792/2329) remote: Compressing objects: 35% (816/2329) remote: Compressing objects: 36% (839/2329) remote: Compressing objects: 37% (862/2329) remote: Compressing objects: 38% (886/2329) remote: Compressing objects: 39% (909/2329) remote: Compressing objects: 40% (932/2329) remote: Compressing objects: 41% (955/2329) remote: Compressing objects: 42% (979/2329) remote: Compressing objects: 43% (1002/2329) remote: Compressing objects: 44% (1025/2329) remote: Compressing objects: 45% (1049/2329) remote: Compressing objects: 46% (1072/2329) remote: Compressing objects: 47% (1095/2329) remote: Compressing objects: 48% (1118/2329) remote: Compressing objects: 49% (1142/2329) remote: Compressing objects: 50% (1165/2329) remote: Compressing objects: 51% (1188/2329) remote: Compressing objects: 52% (1212/2329) remote: Compressing objects: 53% (1235/2329) remote: Compressing objects: 54% (1258/2329) remote: Compressing objects: 55% (1281/2329) remote: Compressing objects: 56% (1305/2329) remote: Compressing objects: 57% (1328/2329) remote: Compressing objects: 58% (1351/2329) remote: Compressing objects: 59% (1375/2329) remote: Compressing objects: 60% (1398/2329) remote: Compressing objects: 61% (1421/2329) remote: Compressing objects: 62% (1444/2329) remote: Compressing objects: 63% (1468/2329) remote: Compressing objects: 64% (1491/2329) remote: Compressing objects: 65% (1514/2329) remote: Compressing objects: 66% (1538/2329) remote: Compressing objects: 67% (1561/2329) remote: Compressing objects: 68% (1584/2329) remote: Compressing objects: 69% (1608/2329) remote: Compressing objects: 70% (1631/2329) remote: Compressing objects: 71% (1654/2329) remote: Compressing objects: 72% (1677/2329) remote: Compressing objects: 73% (1701/2329) remote: Compressing objects: 74% (1724/2329) remote: Compressing objects: 75% (1747/2329) remote: Compressing objects: 76% (1771/2329) remote: Compressing objects: 77% (1794/2329) remote: Compressing objects: 78% (1817/2329) remote: Compressing objects: 79% (1840/2329) remote: Compressing objects: 80% (1864/2329) remote: Compressing objects: 81% (1887/2329) remote: Compressing objects: 82% (1910/2329) remote: Compressing objects: 83% (1934/2329) remote: Compressing objects: 84% (1957/2329) remote: Compressing objects: 85% (1980/2329) remote: Compressing objects: 86% (2003/2329) remote: Compressing objects: 87% (2027/2329) remote: Compressing objects: 88% (2050/2329) remote: Compressing objects: 89% (2073/2329) remote: Compressing objects: 90% (2097/2329) remote: Compressing objects: 91% (2120/2329) remote: Compressing objects: 92% (2143/2329) remote: Compressing objects: 93% (2166/2329) remote: Compressing objects: 94% (2190/2329) remote: Compressing objects: 95% (2213/2329) remote: Compressing objects: 96% (2236/2329) remote: Compressing objects: 97% (2260/2329) remote: Compressing objects: 98% (2283/2329) remote: Compressing objects: 99% (2306/2329) remote: Compressing objects: 100% (2329/2329) remote: Compressing objects: 100% (2329/2329), done.
  6. 16.32 s Receiving objects: 0% (1/103497) Receiving objects: 1% (1035/103497) Receiving objects: 2% (2070/103497) Receiving objects: 3% (3105/103497) Receiving objects: 4% (4140/103497) Receiving objects: 5% (5175/103497) Receiving objects: 6% (6210/103497) Receiving objects: 7% (7245/103497), 12.09 MiB | 24.16 MiB/s Receiving objects: 8% (8280/103497), 12.09 MiB | 24.16 MiB/s Receiving objects: 9% (9315/103497), 12.09 MiB | 24.16 MiB/s Receiving objects: 10% (10350/103497), 12.09 MiB | 24.16 MiB/s Receiving objects: 11% (11385/103497), 12.09 MiB | 24.16 MiB/s Receiving objects: 12% (12420/103497), 12.09 MiB | 24.16 MiB/s Receiving objects: 13% (13455/103497), 12.09 MiB | 24.16 MiB/s Receiving objects: 14% (14490/103497), 12.09 MiB | 24.16 MiB/s Receiving objects: 15% (15525/103497), 12.09 MiB | 24.16 MiB/s Receiving objects: 16% (16560/103497), 12.09 MiB | 24.16 MiB/s Receiving objects: 17% (17595/103497), 12.09 MiB | 24.16 MiB/s Receiving objects: 18% (18630/103497), 12.09 MiB | 24.16 MiB/s Receiving objects: 19% (19665/103497), 12.09 MiB | 24.16 MiB/s Receiving objects: 20% (20700/103497), 12.09 MiB | 24.16 MiB/s Receiving objects: 21% (21735/103497), 12.09 MiB | 24.16 MiB/s Receiving objects: 22% (22770/103497), 12.09 MiB | 24.16 MiB/s Receiving objects: 23% (23805/103497), 12.09 MiB | 24.16 MiB/s Receiving objects: 24% (24840/103497), 12.09 MiB | 24.16 MiB/s Receiving objects: 25% (25875/103497), 12.09 MiB | 24.16 MiB/s Receiving objects: 26% (26910/103497), 12.09 MiB | 24.16 MiB/s Receiving objects: 27% (27945/103497), 12.09 MiB | 24.16 MiB/s Receiving objects: 28% (28980/103497), 12.09 MiB | 24.16 MiB/s Receiving objects: 29% (30015/103497), 12.09 MiB | 24.16 MiB/s Receiving objects: 30% (31050/103497), 12.09 MiB | 24.16 MiB/s Receiving objects: 30% (31426/103497), 27.65 MiB | 26.86 MiB/s Receiving objects: 31% (32085/103497), 27.65 MiB | 26.86 MiB/s Receiving objects: 32% (33120/103497), 27.65 MiB | 26.86 MiB/s Receiving objects: 33% (34155/103497), 27.65 MiB | 26.86 MiB/s Receiving objects: 34% (35189/103497), 27.65 MiB | 26.86 MiB/s Receiving objects: 35% (36224/103497), 27.65 MiB | 26.86 MiB/s Receiving objects: 36% (37259/103497), 27.65 MiB | 26.86 MiB/s Receiving objects: 37% (38294/103497), 43.01 MiB | 27.82 MiB/s Receiving objects: 38% (39329/103497), 43.01 MiB | 27.82 MiB/s Receiving objects: 39% (40364/103497), 43.01 MiB | 27.82 MiB/s Receiving objects: 40% (41399/103497), 43.01 MiB | 27.82 MiB/s Receiving objects: 41% (42434/103497), 43.01 MiB | 27.82 MiB/s Receiving objects: 42% (43469/103497), 43.01 MiB | 27.82 MiB/s Receiving objects: 43% (44504/103497), 43.01 MiB | 27.82 MiB/s Receiving objects: 44% (45539/103497), 43.01 MiB | 27.82 MiB/s Receiving objects: 44% (46450/103497), 58.65 MiB | 28.45 MiB/s Receiving objects: 45% (46574/103497), 58.65 MiB | 28.45 MiB/s Receiving objects: 46% (47609/103497), 58.65 MiB | 28.45 MiB/s Receiving objects: 47% (48644/103497), 58.65 MiB | 28.45 MiB/s Receiving objects: 48% (49679/103497), 58.65 MiB | 28.45 MiB/s Receiving objects: 49% (50714/103497), 58.65 MiB | 28.45 MiB/s Receiving objects: 50% (51749/103497), 73.46 MiB | 28.50 MiB/s Receiving objects: 51% (52784/103497), 73.46 MiB | 28.50 MiB/s Receiving objects: 52% (53819/103497), 73.46 MiB | 28.50 MiB/s Receiving objects: 53% (54854/103497), 73.46 MiB | 28.50 MiB/s Receiving objects: 54% (55889/103497), 73.46 MiB | 28.50 MiB/s Receiving objects: 55% (56924/103497), 73.46 MiB | 28.50 MiB/s Receiving objects: 55% (57512/103497), 73.46 MiB | 28.50 MiB/s Receiving objects: 56% (57959/103497), 88.77 MiB | 28.69 MiB/s Receiving objects: 57% (58994/103497), 88.77 MiB | 28.69 MiB/s Receiving objects: 58% (60029/103497), 88.77 MiB | 28.69 MiB/s Receiving objects: 59% (61064/103497), 104.28 MiB | 28.89 MiB/s Receiving objects: 60% (62099/103497), 104.28 MiB | 28.89 MiB/s Receiving objects: 61% (63134/103497), 104.28 MiB | 28.89 MiB/s Receiving objects: 61% (63681/103497), 104.28 MiB | 28.89 MiB/s Receiving objects: 62% (64169/103497), 134.84 MiB | 29.05 MiB/s Receiving objects: 62% (64233/103497), 134.84 MiB | 29.05 MiB/s Receiving objects: 63% (65204/103497), 150.04 MiB | 29.62 MiB/s Receiving objects: 63% (66032/103497), 180.83 MiB | 29.69 MiB/s Receiving objects: 63% (66060/103497), 211.70 MiB | 29.77 MiB/s Receiving objects: 63% (66172/103497), 227.15 MiB | 29.82 MiB/s Receiving objects: 64% (66239/103497), 242.54 MiB | 29.79 MiB/s Receiving objects: 64% (66276/103497), 258.00 MiB | 29.80 MiB/s Receiving objects: 65% (67274/103497), 288.69 MiB | 29.87 MiB/s Receiving objects: 65% (67422/103497), 288.69 MiB | 29.87 MiB/s Receiving objects: 66% (68309/103497), 288.69 MiB | 29.87 MiB/s Receiving objects: 67% (69343/103497), 288.69 MiB | 29.87 MiB/s Receiving objects: 68% (70378/103497), 288.69 MiB | 29.87 MiB/s Receiving objects: 69% (71413/103497), 288.69 MiB | 29.87 MiB/s Receiving objects: 70% (72448/103497), 304.22 MiB | 29.90 MiB/s Receiving objects: 71% (73483/103497), 304.22 MiB | 29.90 MiB/s Receiving objects: 72% (74518/103497), 319.72 MiB | 29.91 MiB/s Receiving objects: 73% (75553/103497), 319.72 MiB | 29.91 MiB/s Receiving objects: 74% (76588/103497), 319.72 MiB | 29.91 MiB/s Receiving objects: 75% (77623/103497), 319.72 MiB | 29.91 MiB/s Receiving objects: 76% (78658/103497), 319.72 MiB | 29.91 MiB/s Receiving objects: 76% (79439/103497), 319.72 MiB | 29.91 MiB/s Receiving objects: 77% (79693/103497), 319.72 MiB | 29.91 MiB/s Receiving objects: 78% (80728/103497), 319.72 MiB | 29.91 MiB/s Receiving objects: 79% (81763/103497), 319.72 MiB | 29.91 MiB/s Receiving objects: 80% (82798/103497), 319.72 MiB | 29.91 MiB/s Receiving objects: 81% (83833/103497), 319.72 MiB | 29.91 MiB/s Receiving objects: 82% (84868/103497), 335.22 MiB | 29.93 MiB/s Receiving objects: 83% (85903/103497), 350.77 MiB | 29.94 MiB/s Receiving objects: 83% (85956/103497), 350.77 MiB | 29.94 MiB/s Receiving objects: 84% (86938/103497), 350.77 MiB | 29.94 MiB/s Receiving objects: 85% (87973/103497), 350.77 MiB | 29.94 MiB/s Receiving objects: 86% (89008/103497), 366.07 MiB | 29.90 MiB/s Receiving objects: 87% (90043/103497), 366.07 MiB | 29.90 MiB/s Receiving objects: 88% (91078/103497), 366.07 MiB | 29.90 MiB/s Receiving objects: 89% (92113/103497), 366.07 MiB | 29.90 MiB/s Receiving objects: 90% (93148/103497), 381.47 MiB | 29.90 MiB/s Receiving objects: 91% (94183/103497), 381.47 MiB | 29.90 MiB/s Receiving objects: 91% (95110/103497), 381.47 MiB | 29.90 MiB/s Receiving objects: 92% (95218/103497), 381.47 MiB | 29.90 MiB/s Receiving objects: 93% (96253/103497), 381.47 MiB | 29.90 MiB/s Receiving objects: 94% (97288/103497), 381.47 MiB | 29.90 MiB/s Receiving objects: 95% (98323/103497), 381.47 MiB | 29.90 MiB/s Receiving objects: 96% (99358/103497), 381.47 MiB | 29.90 MiB/s Receiving objects: 97% (100393/103497), 381.47 MiB | 29.90 MiB/s Receiving objects: 98% (101428/103497), 381.47 MiB | 29.90 MiB/s Receiving objects: 99% (102463/103497), 381.47 MiB | 29.90 MiB/s remote: Total 103497 (delta 8689), reused 8098 (delta 7857), pack-reused 93286 (from 4)
  7. 16.32 s Receiving objects: 100% (103497/103497), 381.47 MiB | 29.90 MiB/s Receiving objects: 100% (103497/103497), 392.00 MiB | 29.57 MiB/s, done.
  8. 19.80 s Resolving deltas: 0% (0/67791) Resolving deltas: 1% (678/67791) Resolving deltas: 2% (1356/67791) Resolving deltas: 3% (2035/67791) Resolving deltas: 4% (2712/67791) Resolving deltas: 5% (3390/67791) Resolving deltas: 6% (4068/67791) Resolving deltas: 7% (4748/67791) Resolving deltas: 8% (5424/67791) Resolving deltas: 9% (6104/67791) Resolving deltas: 10% (6780/67791) Resolving deltas: 11% (7458/67791) Resolving deltas: 12% (8135/67791) Resolving deltas: 13% (8813/67791) Resolving deltas: 14% (9491/67791) Resolving deltas: 15% (10169/67791) Resolving deltas: 16% (10847/67791) Resolving deltas: 17% (11525/67791) Resolving deltas: 18% (12203/67791) Resolving deltas: 19% (12882/67791) Resolving deltas: 20% (13560/67791) Resolving deltas: 21% (14237/67791) Resolving deltas: 22% (14915/67791) Resolving deltas: 23% (15592/67791) Resolving deltas: 24% (16270/67791) Resolving deltas: 25% (16948/67791) Resolving deltas: 26% (17627/67791) Resolving deltas: 27% (18304/67791) Resolving deltas: 28% (18982/67791) Resolving deltas: 29% (19660/67791) Resolving deltas: 30% (20338/67791) Resolving deltas: 31% (21016/67791) Resolving deltas: 32% (21694/67791) Resolving deltas: 33% (22372/67791) Resolving deltas: 34% (23049/67791) Resolving deltas: 35% (23727/67791) Resolving deltas: 36% (24405/67791) Resolving deltas: 37% (25083/67791) Resolving deltas: 38% (25761/67791) Resolving deltas: 39% (26439/67791) Resolving deltas: 40% (27117/67791) Resolving deltas: 41% (27795/67791) Resolving deltas: 42% (28473/67791) Resolving deltas: 43% (29151/67791) Resolving deltas: 44% (29830/67791) Resolving deltas: 45% (30506/67791) Resolving deltas: 46% (31184/67791) Resolving deltas: 47% (31862/67791) Resolving deltas: 47% (32350/67791) Resolving deltas: 48% (32540/67791) Resolving deltas: 49% (33218/67791) Resolving deltas: 50% (33896/67791) Resolving deltas: 51% (34574/67791) Resolving deltas: 52% (35252/67791) Resolving deltas: 53% (35930/67791) Resolving deltas: 54% (36608/67791) Resolving deltas: 55% (37286/67791) Resolving deltas: 56% (37963/67791) Resolving deltas: 57% (38642/67791) Resolving deltas: 58% (39319/67791) Resolving deltas: 59% (39997/67791) Resolving deltas: 60% (40675/67791) Resolving deltas: 61% (41353/67791) Resolving deltas: 62% (42031/67791) Resolving deltas: 63% (42711/67791) Resolving deltas: 64% (43387/67791) Resolving deltas: 64% (43705/67791) Resolving deltas: 65% (44065/67791) Resolving deltas: 66% (44743/67791) Resolving deltas: 67% (45420/67791) Resolving deltas: 68% (46098/67791) Resolving deltas: 69% (46776/67791) Resolving deltas: 70% (47454/67791) Resolving deltas: 71% (48132/67791) Resolving deltas: 72% (48810/67791) Resolving deltas: 73% (49488/67791) Resolving deltas: 74% (50166/67791) Resolving deltas: 75% (50844/67791) Resolving deltas: 76% (51522/67791) Resolving deltas: 77% (52200/67791) Resolving deltas: 78% (52877/67791) Resolving deltas: 79% (53555/67791) Resolving deltas: 80% (54233/67791) Resolving deltas: 81% (54911/67791) Resolving deltas: 82% (55589/67791) Resolving deltas: 83% (56267/67791) Resolving deltas: 84% (56945/67791) Resolving deltas: 84% (57181/67791) Resolving deltas: 85% (57623/67791) Resolving deltas: 86% (58301/67791) Resolving deltas: 87% (58979/67791) Resolving deltas: 88% (59657/67791) Resolving deltas: 89% (60334/67791) Resolving deltas: 90% (61014/67791) Resolving deltas: 91% (61690/67791) Resolving deltas: 92% (62368/67791) Resolving deltas: 93% (63046/67791) Resolving deltas: 94% (63724/67791) Resolving deltas: 95% (64402/67791) Resolving deltas: 96% (65080/67791) Resolving deltas: 97% (65758/67791) Resolving deltas: 98% (66436/67791) Resolving deltas: 99% (67114/67791) Resolving deltas: 100% (67791/67791) Resolving deltas: 100% (67791/67791), done.
  9. 21.14 s Fetching commit 13c9bb203f1daef2670356779366ed6afc72bc51 for feynkit ...
  10. 21.14 s $ /nix/store/5vpcfsdx1lcnlb2y4k7xyc74shp5qwbh-git-2.54.0/bin/git fetch origin 13c9bb203f1daef2670356779366ed6afc72bc51
  11. 21.64 s From https://github.com/alphal00p/gammaloop
  12. 21.64 s * branch 13c9bb203f1daef2670356779366ed6afc72bc51 -> FETCH_HEAD
  13. 21.66 s $ /nix/store/61685rbaxmpigwi3z23i33sv3jyfl70q-coreutils-9.11/bin/timeout --kill-after=15s 7200s /nix/store/5vpcfsdx1lcnlb2y4k7xyc74shp5qwbh-git-2.54.0/bin/git -c advice.detachedHead=false checkout 13c9bb203f1daef2670356779366ed6afc72bc51
  14. 21.97 s HEAD is now at 13c9bb203 bundle readable math typography in notebook HTML
  15. 21.98 s $ /nix/store/61685rbaxmpigwi3z23i33sv3jyfl70q-coreutils-9.11/bin/timeout --kill-after=15s 7200s /nix/store/wknkybkzrc16r11vk5vrykh4wmw7a353-nix-2.34.8/bin/nix --extra-experimental-features nix-command --extra-experimental-features flakes --log-format internal-json run .#packages.x86_64-linux.nix-ci-check-gammaloop-nextest-feynkit --print-build-logs
  16. 22.14 s warning: ignoring untrusted flake configuration setting 'extra-substituters'.
  17. 22.14 s Pass '--accept-flake-config' to trust it
  18. 22.14 s warning: ignoring untrusted flake configuration setting 'extra-trusted-public-keys'.
  19. 22.14 s Pass '--accept-flake-config' to trust it
  20. 32.37 s
  21. 32.50 s Downloading cached nix-ci-check-gammaloop-nextest-feynkit from https://cache.nix-ci.com
  22. 32.52 s Downloaded cached nix-ci-check-gammaloop-nextest-feynkit (1128 B) in 13ms
  23. 32.52 s Progress: 0 of 1 built, 1 of 1 downloaded from cache
  24. 32.85 s evaluating derivation 'gdo you want to allow configuration setting 'extra-substituters' to be set to 'https://cache.nix-ci.com' (y/N)? do you want to permanently mark this value as untrusted (y/N)? warning: ignoring untrusted flake configuration setting 'extra-substituters'.
  25. 32.85 s Pass '--accept-flake-config' to trust it
  26. 32.85 s do you want to allow configuration setting 'extra-trusted-public-keys' to be set to 'nix-ci:g3xV5BDTLtIBZr/A00IU1x0EtKKlb7YLgBN2SgYgM6A=' (y/N)? do you want to permanently mark this value as untrusted (y/N)? warning: ignoring untrusted flake configuration setting 'extra-trusted-public-keys'.
  27. 32.85 s Pass '--accept-flake-config' to trust it
  28. 43.76 s copying '/nix/store/hc7a evaluating derivation 'g copying '/nix/store/hc7a evaluating derivation 'g copying '/nix/store/hc7a evaluating derivation 'g copying '/nix/store/hc7a evaluating derivation 'g copying '/nix/store/hc7a evaluating derivation 'g copying '/nix/store/hc7a evaluating derivation 'g copying '/nix/store/hc7a evaluating derivation 'g copying '/nix/store/hc7a evaluating derivation 'g copying '/nix/store/hc7a evaluating derivation 'g copying '/nix/store/hc7a evaluating derivation 'g copying '/nix/store/hc7a evaluating derivation 'g copying '/nix/store/hc7a evaluating derivation 'g copying '/nix/store/hc7a evaluating derivation 'g copying '/nix/store/hc7a evaluating derivation 'g copying '/nix/store/hc7a evaluating derivation 'g copying '/nix/store/hc7a evaluating derivation 'g querying gammaloop-nexte [0/12 built, 9/0/10 copi [0/11 built, 9/1/10 copi [0/10 built, 8/2/10 copi [0/8 built, 6/4/10 copie [0/6 built, 4/6/10 copie [0/5 built, 3/7/10 copie [0/4 built, 2/8/10 copie [0/3 built, 1/9/10 copie [0/2 built, 10 copied (2 [1/0/2 built, 10 copied gammaloop-nextest-binaries-feynkit (post)> Uploading to the NixCI cache: /nix/store/cwypprmc25zbc5d8xl0a0af4ns7lvcq3-gammaloop-nextest-binaries-feynkit
  29. 43.82 s gammaloop-nextest-binaries-feynkit (post)> warning: 'warn-short-path-literals' is deprecated, use 'lint-short-path-literals = ignore' instead
  30. 43.86 s gammaloop-nextest-binaries-feynkit (post)> copying 0 paths...
  31. 43.93 s gammaloop-nextest-binaries-feynkit (post)> warning: 'warn-short-path-literals' is deprecated, use 'lint-short-path-literals = ignore' instead
  32. 44.17 s gammaloop-nextest-binaries-feynkit (post)> copying 0 paths...
  33. 44.61 s [1/3 built, 10 copied (2 [1/1/2 built, 10 copied gammaloop-nextest-feynkit> Extracting 1 binary and 2 linked paths to /build/source
  34. 44.72 s gammaloop-nextest-feynkit> Extracted 15 files to /build/source in 0.10s
  35. 44.73 s gammaloop-nextest-feynkit> ------------
  36. 44.73 s gammaloop-nextest-feynkit> Nextest run ID 24c49a1b-6b0b-47d1-9fa8-50d23df080ba with nextest profile: ci_gammaloop
  37. 44.73 s gammaloop-nextest-feynkit> Starting 1 test across 1 binary
  38. 44.74 s gammaloop-nextest-feynkit> ------------
  39. 44.74 s gammaloop-nextest-feynkit> Summary [ 0.006s] 1 test run: 1 passed, 0 skipped
  40. 44.79 s gammaloop-nextest-feynkit>
  41. 44.79 s gammaloop-nextest-feynkit> ========== nextest test summary ==========
  42. 44.79 s gammaloop-nextest-feynkit> report: target/nextest/ci_gammaloop/junit.xml
  43. 44.79 s gammaloop-nextest-feynkit> tests: 1, failures: 0, errors: 0
  44. 44.79 s gammaloop-nextest-feynkit> No failing testcases found.
  45. 44.79 s gammaloop-nextest-feynkit> =========================================
  46. 44.81 s gammaloop-nextest-feynkit> Extracting 1 binary and 2 linked paths to /build/source
  47. 44.92 s gammaloop-nextest-feynkit> Extracted 15 files to /build/source in 0.11s
  48. 44.93 s gammaloop-nextest-feynkit> ------------
  49. 44.93 s gammaloop-nextest-feynkit> Nextest run ID 51226e65-c827-4f6a-b889-684f4274a771 with nextest profile: ci_gammaloop
  50. 44.93 s gammaloop-nextest-feynkit> Starting 33 tests across 1 binary
  51. 44.95 s gammaloop-nextest-feynkit> ------------
  52. 44.95 s gammaloop-nextest-feynkit> Summary [ 0.026s] 33 tests run: 33 passed, 0 skipped
  53. 45.00 s gammaloop-nextest-feynkit>
  54. 45.00 s gammaloop-nextest-feynkit> ========== nextest test summary ==========
  55. 45.00 s gammaloop-nextest-feynkit> report: target/nextest/ci_gammaloop/junit.xml
  56. 45.00 s gammaloop-nextest-feynkit> tests: 33, failures: 0, errors: 0
  57. 45.00 s gammaloop-nextest-feynkit> No failing testcases found.
  58. 45.00 s gammaloop-nextest-feynkit> =========================================
  59. 45.02 s gammaloop-nextest-feynkit> Extracting 2 binaries and 2 linked paths to /build/source
  60. 45.22 s gammaloop-nextest-feynkit> Extracted 16 files to /build/source in 0.21s
  61. 45.24 s gammaloop-nextest-feynkit> ------------
  62. 45.24 s gammaloop-nextest-feynkit> Nextest run ID 45f48df2-582f-4a67-a1ef-69da1c898d8f with nextest profile: ci_gammaloop
  63. 45.24 s gammaloop-nextest-feynkit> Starting 60 tests across 2 binaries
  64. 45.30 s gammaloop-nextest-feynkit> ------------
  65. 45.30 s gammaloop-nextest-feynkit> Summary [ 0.064s] 60 tests run: 60 passed, 0 skipped
  66. 45.35 s gammaloop-nextest-feynkit>
  67. 45.35 s gammaloop-nextest-feynkit> ========== nextest test summary ==========
  68. 45.35 s gammaloop-nextest-feynkit> report: target/nextest/ci_gammaloop/junit.xml
  69. 45.35 s gammaloop-nextest-feynkit> tests: 60, failures: 0, errors: 0
  70. 45.35 s gammaloop-nextest-feynkit> No failing testcases found.
  71. 45.35 s gammaloop-nextest-feynkit> =========================================
  72. 45.37 s gammaloop-nextest-feynkit> Extracting 1 binary and 2 linked paths to /build/source
  73. 45.48 s gammaloop-nextest-feynkit> Extracted 15 files to /build/source in 0.11s
  74. 45.49 s gammaloop-nextest-feynkit> ------------
  75. 45.49 s gammaloop-nextest-feynkit> Nextest run ID 797d7e99-59e0-4b2b-b1bb-31d1145052a9 with nextest profile: ci_gammaloop
  76. 45.49 s gammaloop-nextest-feynkit> Starting 28 tests across 1 binary
  77. 45.52 s gammaloop-nextest-feynkit> ------------
  78. 45.52 s gammaloop-nextest-feynkit> Summary [ 0.023s] 28 tests run: 28 passed, 0 skipped
  79. 45.56 s gammaloop-nextest-feynkit>
  80. 45.56 s gammaloop-nextest-feynkit> ========== nextest test summary ==========
  81. 45.56 s gammaloop-nextest-feynkit> report: target/nextest/ci_gammaloop/junit.xml
  82. 45.56 s gammaloop-nextest-feynkit> tests: 28, failures: 0, errors: 0
  83. 45.56 s gammaloop-nextest-feynkit> No failing testcases found.
  84. 45.56 s gammaloop-nextest-feynkit> =========================================
  85. 45.58 s gammaloop-nextest-feynkit> Extracting 1 binary and 1 linked path to /build/source
  86. 45.68 s gammaloop-nextest-feynkit> Extracted 7 files to /build/source in 0.10s
  87. 45.69 s gammaloop-nextest-feynkit> ------------
  88. 45.69 s gammaloop-nextest-feynkit> Nextest run ID d76d331b-439a-4e81-bd5d-de403fae2bf6 with nextest profile: ci_gammaloop
  89. 45.69 s gammaloop-nextest-feynkit> Starting 21 tests across 1 binary
  90. 45.70 s gammaloop-nextest-feynkit> ------------
  91. 45.70 s gammaloop-nextest-feynkit> Summary [ 0.014s] 21 tests run: 21 passed, 0 skipped
  92. 45.75 s gammaloop-nextest-feynkit>
  93. 45.75 s gammaloop-nextest-feynkit> ========== nextest test summary ==========
  94. 45.75 s gammaloop-nextest-feynkit> report: target/nextest/ci_gammaloop/junit.xml
  95. 45.75 s gammaloop-nextest-feynkit> tests: 21, failures: 0, errors: 0
  96. 45.75 s gammaloop-nextest-feynkit> No failing testcases found.
  97. 45.75 s gammaloop-nextest-feynkit> =========================================
  98. 45.77 s gammaloop-nextest-feynkit> Extracting 2 binaries and 2 linked paths to /build/source
  99. 45.96 s gammaloop-nextest-feynkit> Extracted 16 files to /build/source in 0.19s
  100. 45.97 s gammaloop-nextest-feynkit> ------------
  101. 45.97 s gammaloop-nextest-feynkit> Nextest run ID 32862799-8bb4-4903-b2f2-ff744dd8ba83 with nextest profile: ci_gammaloop
  102. 45.97 s gammaloop-nextest-feynkit> Starting 14 tests across 2 binaries
  103. 45.99 s gammaloop-nextest-feynkit> ------------
  104. 45.99 s gammaloop-nextest-feynkit> Summary [ 0.016s] 14 tests run: 14 passed, 0 skipped
  105. 46.03 s gammaloop-nextest-feynkit>
  106. 46.03 s gammaloop-nextest-feynkit> ========== nextest test summary ==========
  107. 46.03 s gammaloop-nextest-feynkit> report: target/nextest/ci_gammaloop/junit.xml
  108. 46.03 s gammaloop-nextest-feynkit> tests: 14, failures: 0, errors: 0
  109. 46.03 s gammaloop-nextest-feynkit> No failing testcases found.
  110. 46.03 s gammaloop-nextest-feynkit> =========================================
  111. 46.05 s gammaloop-nextest-feynkit> Extracting 5 binaries (including 3 non-test binaries) and 2 linked paths to /build/source
  112. 46.71 s gammaloop-nextest-feynkit> Extracted 22 files to /build/source in 0.66s
  113. 46.74 s gammaloop-nextest-feynkit> ------------
  114. 46.74 s gammaloop-nextest-feynkit> Nextest run ID 0a35b51b-388a-49ff-9843-babdf5d63f54 with nextest profile: ci_gammaloop
  115. 46.74 s gammaloop-nextest-feynkit> Starting 15 tests across 2 binaries
  116. 46.83 s gammaloop-nextest-feynkit> FAIL [ 0.097s] (10/15) feynkit-py tests::standalone_python_pipeline_covers_generation_graphs_cff_and_kinematics
  117. 46.83 s gammaloop-nextest-feynkit> stdout ---
  118. 46.83 s gammaloop-nextest-feynkit>
  119. 46.83 s gammaloop-nextest-feynkit> running 1 test
  120. 46.83 s gammaloop-nextest-feynkit> test tests::standalone_python_pipeline_covers_generation_graphs_cff_and_kinematics ... FAILED
  121. 46.83 s gammaloop-nextest-feynkit>
  122. 46.83 s gammaloop-nextest-feynkit> failures:
  123. 46.83 s gammaloop-nextest-feynkit>
  124. 46.83 s gammaloop-nextest-feynkit> failures:
  125. 46.83 s gammaloop-nextest-feynkit> tests::standalone_python_pipeline_covers_generation_graphs_cff_and_kinematics
  126. 46.83 s gammaloop-nextest-feynkit>
  127. 46.83 s gammaloop-nextest-feynkit> test result: FAILED. 0 passed; 1 failed; 0 ignored; 0 measured; 13 filtered out; finished in 0.08s
  128. 46.83 s gammaloop-nextest-feynkit>
  129. 46.83 s gammaloop-nextest-feynkit> stderr ---
  130. 46.83 s gammaloop-nextest-feynkit>
  131. 46.83 s gammaloop-nextest-feynkit> thread 'tests::standalone_python_pipeline_covers_generation_graphs_cff_and_kinematics' (916) panicked at crates/feynkit-py/src/lib.rs:453:57:
  132. 46.83 s gammaloop-nextest-feynkit> called `Result::unwrap()` on an `Err` value: PyErr { type: <class 'AssertionError'>, value: AssertionError(), traceback: Some("Traceback (most recent call last):\n File \"<string>\", line 39, in <module>\n") }
  133. 46.83 s gammaloop-nextest-feynkit> stack backtrace:
  134. 46.83 s gammaloop-nextest-feynkit> 0: __rustc::rust_begin_unwind
  135. 46.83 s gammaloop-nextest-feynkit> 1: core::panicking::panic_fmt
  136. 46.83 s gammaloop-nextest-feynkit> 2: core::result::unwrap_failed
  137. 46.83 s gammaloop-nextest-feynkit> 3: feynkit_py::tests::standalone_python_pipeline_covers_generation_graphs_cff_and_kinematics
  138. 46.83 s gammaloop-nextest-feynkit> 4: <feynkit_py::tests::standalone_python_pipeline_covers_generation_graphs_cff_and_kinematics::{closure#0} as core::ops::function::FnOnce<()>>::call_once
  139. 46.83 s gammaloop-nextest-feynkit> note: Some details are omitted, run with `RUST_BACKTRACE=full` for a verbose backtrace.
  140. 46.83 s gammaloop-nextest-feynkit>
  141. 47.40 s gammaloop-nextest-feynkit> ------------
  142. 47.40 s gammaloop-nextest-feynkit> Summary [ 0.669s] 15 tests run: 14 passed, 1 failed, 0 skipped
  143. 47.40 s gammaloop-nextest-feynkit> FAIL [ 0.097s] (10/15) feynkit-py tests::standalone_python_pipeline_covers_generation_graphs_cff_and_kinematics
  144. 47.40 s gammaloop-nextest-feynkit> stdout ---
  145. 47.40 s gammaloop-nextest-feynkit>
  146. 47.40 s gammaloop-nextest-feynkit> running 1 test
  147. 47.40 s gammaloop-nextest-feynkit> test tests::standalone_python_pipeline_covers_generation_graphs_cff_and_kinematics ... FAILED
  148. 47.40 s gammaloop-nextest-feynkit>
  149. 47.40 s gammaloop-nextest-feynkit> failures:
  150. 47.40 s gammaloop-nextest-feynkit>
  151. 47.40 s gammaloop-nextest-feynkit> failures:
  152. 47.40 s gammaloop-nextest-feynkit> tests::standalone_python_pipeline_covers_generation_graphs_cff_and_kinematics
  153. 47.40 s gammaloop-nextest-feynkit>
  154. 47.40 s gammaloop-nextest-feynkit> test result: FAILED. 0 passed; 1 failed; 0 ignored; 0 measured; 13 filtered out; finished in 0.08s
  155. 47.40 s gammaloop-nextest-feynkit>
  156. 47.40 s gammaloop-nextest-feynkit> stderr ---
  157. 47.40 s gammaloop-nextest-feynkit>
  158. 47.40 s gammaloop-nextest-feynkit> thread 'tests::standalone_python_pipeline_covers_generation_graphs_cff_and_kinematics' (916) panicked at crates/feynkit-py/src/lib.rs:453:57:
  159. 47.40 s gammaloop-nextest-feynkit> called `Result::unwrap()` on an `Err` value: PyErr { type: <class 'AssertionError'>, value: AssertionError(), traceback: Some("Traceback (most recent call last):\n File \"<string>\", line 39, in <module>\n") }
  160. 47.40 s gammaloop-nextest-feynkit> stack backtrace:
  161. 47.40 s gammaloop-nextest-feynkit> 0: __rustc::rust_begin_unwind
  162. 47.40 s gammaloop-nextest-feynkit> 1: core::panicking::panic_fmt
  163. 47.40 s gammaloop-nextest-feynkit> 2: core::result::unwrap_failed
  164. 47.40 s gammaloop-nextest-feynkit> 3: feynkit_py::tests::standalone_python_pipeline_covers_generation_graphs_cff_and_kinematics
  165. 47.40 s gammaloop-nextest-feynkit> 4: <feynkit_py::tests::standalone_python_pipeline_covers_generation_graphs_cff_and_kinematics::{closure#0} as core::ops::function::FnOnce<()>>::call_once
  166. 47.40 s gammaloop-nextest-feynkit> note: Some details are omitted, run with `RUST_BACKTRACE=full` for a verbose backtrace.
  167. 47.40 s gammaloop-nextest-feynkit>
  168. 47.41 s gammaloop-nextest-feynkit> error: test run failed
  169. 47.44 s gammaloop-nextest-feynkit>
  170. 47.45 s gammaloop-nextest-feynkit> ========== nextest test summary ==========
  171. 47.45 s gammaloop-nextest-feynkit> report: target/nextest/ci_gammaloop/junit.xml
  172. 47.45 s gammaloop-nextest-feynkit> tests: 15, failures: 1, errors: 0
  173. 47.45 s gammaloop-nextest-feynkit>
  174. 47.45 s gammaloop-nextest-feynkit> 1. feynkit-py::tests::standalone_python_pipeline_covers_generation_graphs_cff_and_kinematics
  175. 47.45 s gammaloop-nextest-feynkit> failure: test failure with exit code 101
  176. 47.45 s gammaloop-nextest-feynkit> thread 'tests::standalone_python_pipeline_covers_generation_graphs_cff_and_kinematics' (916) panicked at crates/feynkit-py/src/lib.rs:453:57:
  177. 47.45 s gammaloop-nextest-feynkit> called `Result::unwrap()` on an `Err` value: PyErr { type: <class 'AssertionError'>, value: AssertionError(), traceback: Some("Traceback (most recent call last):\n File \"<string>\", line 39, in <module>\n") }
  178. 47.45 s gammaloop-nextest-feynkit> stack backtrace:
  179. 47.45 s gammaloop-nextest-feynkit> 0: __rustc::rust_begin_unwind
  180. 47.45 s gammaloop-nextest-feynkit> 1: core::panicking::panic_fmt
  181. 47.45 s gammaloop-nextest-feynkit> 2: core::result::unwrap_failed
  182. 47.45 s gammaloop-nextest-feynkit> 3: feynkit_py::tests::standalone_python_pipeline_covers_generation_graphs_cff_and_kinematics
  183. 47.45 s gammaloop-nextest-feynkit> 4: <feynkit_py::tests::standalone_python_pipeline_covers_generation_graphs_cff_and_kinematics::{closure#0} as core::ops::function::FnOnce<()>>::call_once
  184. 47.45 s gammaloop-nextest-feynkit> note: Some details are omitted, run with `RUST_BACKTRACE=full` for a verbose backtrace.
  185. 47.45 s gammaloop-nextest-feynkit> system-out
  186. 47.45 s gammaloop-nextest-feynkit> running 1 test
  187. 47.45 s gammaloop-nextest-feynkit> test tests::standalone_python_pipeline_covers_generation_graphs_cff_and_kinematics ... FAILED
  188. 47.45 s gammaloop-nextest-feynkit>
  189. 47.45 s gammaloop-nextest-feynkit> failures:
  190. 47.45 s gammaloop-nextest-feynkit>
  191. 47.45 s gammaloop-nextest-feynkit> failures:
  192. 47.45 s gammaloop-nextest-feynkit> tests::standalone_python_pipeline_covers_generation_graphs_cff_and_kinematics
  193. 47.45 s gammaloop-nextest-feynkit>
  194. 47.45 s gammaloop-nextest-feynkit> test result: FAILED. 0 passed; 1 failed; 0 ignored; 0 measured; 13 filtered out; finished in 0.08s
  195. 47.45 s gammaloop-nextest-feynkit> system-err
  196. 47.45 s gammaloop-nextest-feynkit> thread 'tests::standalone_python_pipeline_covers_generation_graphs_cff_and_kinematics' (916) panicked at crates/feynkit-py/src/lib.rs:453:57:
  197. 47.45 s gammaloop-nextest-feynkit> called `Result::unwrap()` on an `Err` value: PyErr { type: <class 'AssertionError'>, value: AssertionError(), traceback: Some("Traceback (most recent call last):\n File \"<string>\", line 39, in <module>\n") }
  198. 47.45 s gammaloop-nextest-feynkit> stack backtrace:
  199. 47.45 s gammaloop-nextest-feynkit> 0: __rustc::rust_begin_unwind
  200. 47.45 s gammaloop-nextest-feynkit> 1: core::panicking::panic_fmt
  201. 47.45 s gammaloop-nextest-feynkit> 2: core::result::unwrap_failed
  202. 47.45 s gammaloop-nextest-feynkit> 3: feynkit_py::tests::standalone_python_pipeline_covers_generation_graphs_cff_and_kinematics
  203. 47.45 s gammaloop-nextest-feynkit> 4: <feynkit_py::tests::standalone_python_pipeline_covers_generation_graphs_cff_and_kinematics::{closure#0} as core::ops::function::FnOnce<()>>::call_once
  204. 47.45 s gammaloop-nextest-feynkit> note: Some details are omitted, run with `RUST_BACKTRACE=full` for a verbose backtrace.
  205. 47.45 s gammaloop-nextest-feynkit> =========================================
  206. 47.46 s gammaloop-nextest-feynkit> Extracting 1 binary and 2 linked paths to /build/source
  207. 47.59 s gammaloop-nextest-feynkit> Extracted 15 files to /build/source in 0.13s
  208. 47.60 s gammaloop-nextest-feynkit> ------------
  209. 47.60 s gammaloop-nextest-feynkit> Nextest run ID 54f6b803-35f3-4290-9626-a66fc44d809f with nextest profile: ci_gammaloop
  210. 47.60 s gammaloop-nextest-feynkit> Starting 45 tests across 1 binary (1 test skipped)
  211. 47.75 s gammaloop-nextest-feynkit> ------------
  212. 47.75 s gammaloop-nextest-feynkit> Summary [ 0.149s] 45 tests run: 45 passed, 1 skipped
  213. 47.80 s gammaloop-nextest-feynkit>
  214. 47.80 s gammaloop-nextest-feynkit> ========== nextest test summary ==========
  215. 47.80 s gammaloop-nextest-feynkit> report: target/nextest/ci_gammaloop/junit.xml
  216. 47.80 s gammaloop-nextest-feynkit> tests: 45, failures: 0, errors: 0
  217. 47.80 s gammaloop-nextest-feynkit> No failing testcases found.
  218. 47.80 s gammaloop-nextest-feynkit> =========================================
  219. 47.82 s gammaloop-nextest-feynkit> Extracting 1 binary and 2 linked paths to /build/source
  220. 47.90 s gammaloop-nextest-feynkit> Extracted 15 files to /build/source in 0.09s
  221. 47.92 s gammaloop-nextest-feynkit> ------------
  222. 47.92 s gammaloop-nextest-feynkit> Nextest run ID 70337ed7-8bda-4a6f-b9b0-90027a838c92 with nextest profile: ci_gammaloop
  223. 47.92 s gammaloop-nextest-feynkit> Starting 2 tests across 1 binary
  224. 47.94 s gammaloop-nextest-feynkit> ------------
  225. 47.94 s gammaloop-nextest-feynkit> Summary [ 0.021s] 2 tests run: 2 passed, 0 skipped
  226. 47.98 s gammaloop-nextest-feynkit>
  227. 47.98 s gammaloop-nextest-feynkit> ========== nextest test summary ==========
  228. 47.98 s gammaloop-nextest-feynkit> report: target/nextest/ci_gammaloop/junit.xml
  229. 47.98 s gammaloop-nextest-feynkit> tests: 2, failures: 0, errors: 0
  230. 47.98 s gammaloop-nextest-feynkit> No failing testcases found.
  231. 47.98 s gammaloop-nextest-feynkit> =========================================
  232. 48.16 s error: Cannot build '/nix/store/dwwmanmi1lvgs469z8hddfgkfic9634b-gammaloop-nextest-feynkit.drv'.
  233. 48.16 s Reason: builder failed with exit code 100.
  234. 48.16 s Output paths:
  235. 48.16 s /nix/store/sdmnbgpsxmzrrshnwqaah05cnlysjsjj-gammaloop-nextest-feynkit
  236. 48.16 s Last 199 log lines:
  237. 48.16 s > Extracting 1 binary and 2 linked paths to /build/source
  238. 48.16 s > Extracted 15 files to /build/source in 0.10s
  239. 48.16 s > ------------
  240. 48.16 s > Nextest run ID 24c49a1b-6b0b-47d1-9fa8-50d23df080ba with nextest profile: ci_gammaloop
  241. 48.16 s > Starting 1 test across 1 binary
  242. 48.16 s > ------------
  243. 48.16 s > Summary [ 0.006s] 1 test run: 1 passed, 0 skipped
  244. 48.16 s >
  245. 48.16 s > ========== nextest test summary ==========
  246. 48.16 s > report: target/nextest/ci_gammaloop/junit.xml
  247. 48.16 s > tests: 1, failures: 0, errors: 0
  248. 48.16 s > No failing testcases found.
  249. 48.16 s > =========================================
  250. 48.16 s > Extracting 1 binary and 2 linked paths to /build/source
  251. 48.16 s > Extracted 15 files to /build/source in 0.11s
  252. 48.16 s > ------------
  253. 48.16 s > Nextest run ID 51226e65-c827-4f6a-b889-684f4274a771 with nextest profile: ci_gammaloop
  254. 48.16 s > Starting 33 tests across 1 binary
  255. 48.16 s > ------------
  256. 48.16 s > Summary [ 0.026s] 33 tests run: 33 passed, 0 skipped
  257. 48.16 s >
  258. 48.16 s > ========== nextest test summary ==========
  259. 48.16 s > report: target/nextest/ci_gammaloop/junit.xml
  260. 48.16 s > tests: 33, failures: 0, errors: 0
  261. 48.16 s > No failing testcases found.
  262. 48.16 s > =========================================
  263. 48.16 s > Extracting 2 binaries and 2 linked paths to /build/source
  264. 48.16 s > Extracted 16 files to /build/source in 0.21s
  265. 48.16 s > ------------
  266. 48.16 s > Nextest run ID 45f48df2-582f-4a67-a1ef-69da1c898d8f with nextest profile: ci_gammaloop
  267. 48.16 s > Starting 60 tests across 2 binaries
  268. 48.16 s > ------------
  269. 48.16 s > Summary [ 0.064s] 60 tests run: 60 passed, 0 skipped
  270. 48.16 s >
  271. 48.16 s > ========== nextest test summary ==========
  272. 48.16 s > report: target/nextest/ci_gammaloop/junit.xml
  273. 48.16 s > tests: 60, failures: 0, errors: 0
  274. 48.16 s > No failing testcases found.
  275. 48.16 s > =========================================
  276. 48.16 s > Extracting 1 binary and 2 linked paths to /build/source
  277. 48.16 s > Extracted 15 files to /build/source in 0.11s
  278. 48.16 s > ------------
  279. 48.16 s > Nextest run ID 797d7e99-59e0-4b2b-b1bb-31d1145052a9 with nextest profile: ci_gammaloop
  280. 48.16 s > Starting 28 tests across 1 binary
  281. 48.16 s > ------------
  282. 48.16 s > Summary [ 0.023s] 28 tests run: 28 passed, 0 skipped
  283. 48.16 s >
  284. 48.16 s > ========== nextest test summary ==========
  285. 48.16 s > report: target/nextest/ci_gammaloop/junit.xml
  286. 48.16 s > tests: 28, failures: 0, errors: 0
  287. 48.16 s > No failing testcases found.
  288. 48.16 s > =========================================
  289. 48.16 s > Extracting 1 binary and 1 linked path to /build/source
  290. 48.16 s > Extracted 7 files to /build/source in 0.10s
  291. 48.16 s > ------------
  292. 48.16 s > Nextest run ID d76d331b-439a-4e81-bd5d-de403fae2bf6 with nextest profile: ci_gammaloop
  293. 48.16 s > Starting 21 tests across 1 binary
  294. 48.16 s > ------------
  295. 48.16 s > Summary [ 0.014s] 21 tests run: 21 passed, 0 skipped
  296. 48.16 s >
  297. 48.16 s > ========== nextest test summary ==========
  298. 48.16 s > report: target/nextest/ci_gammaloop/junit.xml
  299. 48.16 s > tests: 21, failures: 0, errors: 0
  300. 48.16 s > No failing testcases found.
  301. 48.16 s > =========================================
  302. 48.16 s > Extracting 2 binaries and 2 linked paths to /build/source
  303. 48.16 s > Extracted 16 files to /build/source in 0.19s
  304. 48.16 s > ------------
  305. 48.16 s > Nextest run ID 32862799-8bb4-4903-b2f2-ff744dd8ba83 with nextest profile: ci_gammaloop
  306. 48.16 s > Starting 14 tests across 2 binaries
  307. 48.16 s > ------------
  308. 48.16 s > Summary [ 0.016s] 14 tests run: 14 passed, 0 skipped
  309. 48.16 s >
  310. 48.16 s > ========== nextest test summary ==========
  311. 48.16 s > report: target/nextest/ci_gammaloop/junit.xml
  312. 48.16 s > tests: 14, failures: 0, errors: 0
  313. 48.16 s > No failing testcases found.
  314. 48.16 s > =========================================
  315. 48.16 s > Extracting 5 binaries (including 3 non-test binaries) and 2 linked paths to /build/source
  316. 48.16 s > Extracted 22 files to /build/source in 0.66s
  317. 48.16 s > ------------
  318. 48.16 s > Nextest run ID 0a35b51b-388a-49ff-9843-babdf5d63f54 with nextest profile: ci_gammaloop
  319. 48.16 s > Starting 15 tests across 2 binaries
  320. 48.16 s > FAIL [ 0.097s] (10/15) feynkit-py tests::standalone_python_pipeline_covers_generation_graphs_cff_and_kinematics
  321. 48.16 s > stdout ---
  322. 48.16 s >
  323. 48.16 s > running 1 test
  324. 48.16 s > test tests::standalone_python_pipeline_covers_generation_graphs_cff_and_kinematics ... FAILED
  325. 48.16 s >
  326. 48.16 s > failures:
  327. 48.16 s >
  328. 48.16 s > failures:
  329. 48.16 s > tests::standalone_python_pipeline_covers_generation_graphs_cff_and_kinematics
  330. 48.16 s >
  331. 48.16 s > test result: FAILED. 0 passed; 1 failed; 0 ignored; 0 measured; 13 filtered out; finished in 0.08s
  332. 48.16 s >
  333. 48.16 s > stderr ---
  334. 48.16 s >
  335. 48.16 s > thread 'tests::standalone_python_pipeline_covers_generation_graphs_cff_and_kinematics' (916) panicked at crates/feynkit-py/src/lib.rs:453:57:
  336. 48.16 s > called `Result::unwrap()` on an `Err` value: PyErr { type: <class 'AssertionError'>, value: AssertionError(), traceback: Some("Traceback (most recent call last):\n File \"<string>\", line 39, in <module>\n") }
  337. 48.16 s > stack backtrace:
  338. 48.16 s > 0: __rustc::rust_begin_unwind
  339. 48.16 s > 1: core::panicking::panic_fmt
  340. 48.16 s > 2: core::result::unwrap_failed
  341. 48.16 s > 3: feynkit_py::tests::standalone_python_pipeline_covers_generation_graphs_cff_and_kinematics
  342. 48.16 s > 4: <feynkit_py::tests::standalone_python_pipeline_covers_generation_graphs_cff_and_kinematics::{closure#0} as core::ops::function::FnOnce<()>>::call_once
  343. 48.16 s > note: Some details are omitted, run with `RUST_BACKTRACE=full` for a verbose backtrace.
  344. 48.16 s >
  345. 48.16 s > ------------
  346. 48.16 s > Summary [ 0.669s] 15 tests run: 14 passed, 1 failed, 0 skipped
  347. 48.16 s > FAIL [ 0.097s] (10/15) feynkit-py tests::standalone_python_pipeline_covers_generation_graphs_cff_and_kinematics
  348. 48.16 s > stdout ---
  349. 48.16 s >
  350. 48.16 s > running 1 test
  351. 48.16 s > test tests::standalone_python_pipeline_covers_generation_graphs_cff_and_kinematics ... FAILED
  352. 48.16 s >
  353. 48.16 s > failures:
  354. 48.16 s >
  355. 48.16 s > failures:
  356. 48.16 s > tests::standalone_python_pipeline_covers_generation_graphs_cff_and_kinematics
  357. 48.16 s >
  358. 48.16 s > test result: FAILED. 0 passed; 1 failed; 0 ignored; 0 measured; 13 filtered out; finished in 0.08s
  359. 48.16 s >
  360. 48.16 s > stderr ---
  361. 48.16 s >
  362. 48.16 s > thread 'tests::standalone_python_pipeline_covers_generation_graphs_cff_and_kinematics' (916) panicked at crates/feynkit-py/src/lib.rs:453:57:
  363. 48.16 s > called `Result::unwrap()` on an `Err` value: PyErr { type: <class 'AssertionError'>, value: AssertionError(), traceback: Some("Traceback (most recent call last):\n File \"<string>\", line 39, in <module>\n") }
  364. 48.16 s > stack backtrace:
  365. 48.16 s > 0: __rustc::rust_begin_unwind
  366. 48.16 s > 1: core::panicking::panic_fmt
  367. 48.16 s > 2: core::result::unwrap_failed
  368. 48.16 s > 3: feynkit_py::tests::standalone_python_pipeline_covers_generation_graphs_cff_and_kinematics
  369. 48.16 s > 4: <feynkit_py::tests::standalone_python_pipeline_covers_generation_graphs_cff_and_kinematics::{closure#0} as core::ops::function::FnOnce<()>>::call_once
  370. 48.16 s > note: Some details are omitted, run with `RUST_BACKTRACE=full` for a verbose backtrace.
  371. 48.16 s >
  372. 48.16 s > error: test run failed
  373. 48.16 s >
  374. 48.16 s > ========== nextest test summary ==========
  375. 48.16 s > report: target/nextest/ci_gammaloop/junit.xml
  376. 48.16 s > tests: 15, failures: 1, errors: 0
  377. 48.16 s >
  378. 48.16 s > 1. feynkit-py::tests::standalone_python_pipeline_covers_generation_graphs_cff_and_kinematics
  379. 48.16 s > failure: test failure with exit code 101
  380. 48.16 s > thread 'tests::standalone_python_pipeline_covers_generation_graphs_cff_and_kinematics' (916) panicked at crates/feynkit-py/src/lib.rs:453:57:
  381. 48.16 s > called `Result::unwrap()` on an `Err` value: PyErr { type: <class 'AssertionError'>, value: AssertionError(), traceback: Some("Traceback (most recent call last):\n File \"<string>\", line 39, in <module>\n") }
  382. 48.16 s > stack backtrace:
  383. 48.16 s > 0: __rustc::rust_begin_unwind
  384. 48.16 s > 1: core::panicking::panic_fmt
  385. 48.16 s > 2: core::result::unwrap_failed
  386. 48.16 s > 3: feynkit_py::tests::standalone_python_pipeline_covers_generation_graphs_cff_and_kinematics
  387. 48.16 s > 4: <feynkit_py::tests::standalone_python_pipeline_covers_generation_graphs_cff_and_kinematics::{closure#0} as core::ops::function::FnOnce<()>>::call_once
  388. 48.16 s > note: Some details are omitted, run with `RUST_BACKTRACE=full` for a verbose backtrace.
  389. 48.16 s > system-out
  390. 48.16 s > running 1 test
  391. 48.16 s > test tests::standalone_python_pipeline_covers_generation_graphs_cff_and_kinematics ... FAILED
  392. 48.16 s >
  393. 48.16 s > failures:
  394. 48.16 s >
  395. 48.16 s > failures:
  396. 48.16 s > tests::standalone_python_pipeline_covers_generation_graphs_cff_and_kinematics
  397. 48.16 s >
  398. 48.16 s > test result: FAILED. 0 passed; 1 failed; 0 ignored; 0 measured; 13 filtered out; finished in 0.08s
  399. 48.16 s > system-err
  400. 48.16 s > thread 'tests::standalone_python_pipeline_covers_generation_graphs_cff_and_kinematics' (916) panicked at crates/feynkit-py/src/lib.rs:453:57:
  401. 48.16 s > called `Result::unwrap()` on an `Err` value: PyErr { type: <class 'AssertionError'>, value: AssertionError(), traceback: Some("Traceback (most recent call last):\n File \"<string>\", line 39, in <module>\n") }
  402. 48.16 s > stack backtrace:
  403. 48.16 s > 0: __rustc::rust_begin_unwind
  404. 48.16 s > 1: core::panicking::panic_fmt
  405. 48.16 s > 2: core::result::unwrap_failed
  406. 48.16 s > 3: feynkit_py::tests::standalone_python_pipeline_covers_generation_graphs_cff_and_kinematics
  407. 48.16 s > 4: <feynkit_py::tests::standalone_python_pipeline_covers_generation_graphs_cff_and_kinematics::{closure#0} as core::ops::function::FnOnce<()>>::call_once
  408. 48.16 s > note: Some details are omitted, run with `RUST_BACKTRACE=full` for a verbose backtrace.
  409. 48.16 s > =========================================
  410. 48.16 s > Extracting 1 binary and 2 linked paths to /build/source
  411. 48.16 s > Extracted 15 files to /build/source in 0.13s
  412. 48.16 s > ------------
  413. 48.16 s > Nextest run ID 54f6b803-35f3-4290-9626-a66fc44d809f with nextest profile: ci_gammaloop
  414. 48.16 s > Starting 45 tests across 1 binary (1 test skipped)
  415. 48.16 s > ------------
  416. 48.16 s > Summary [ 0.149s] 45 tests run: 45 passed, 1 skipped
  417. 48.16 s >
  418. 48.16 s > ========== nextest test summary ==========
  419. 48.16 s > report: target/nextest/ci_gammaloop/junit.xml
  420. 48.16 s > tests: 45, failures: 0, errors: 0
  421. 48.16 s > No failing testcases found.
  422. 48.16 s > =========================================
  423. 48.16 s > Extracting 1 binary and 2 linked paths to /build/source
  424. 48.16 s > Extracted 15 files to /build/source in 0.09s
  425. 48.16 s > ------------
  426. 48.16 s > Nextest run ID 70337ed7-8bda-4a6f-b9b0-90027a838c92 with nextest profile: ci_gammaloop
  427. 48.16 s > Starting 2 tests across 1 binary
  428. 48.16 s > ------------
  429. 48.16 s > Summary [ 0.021s] 2 tests run: 2 passed, 0 skipped
  430. 48.16 s >
  431. 48.16 s > ========== nextest test summary ==========
  432. 48.16 s > report: target/nextest/ci_gammaloop/junit.xml
  433. 48.16 s > tests: 2, failures: 0, errors: 0
  434. 48.16 s > No failing testcases found.
  435. 48.16 s > =========================================
  436. 48.16 s For full logs, run:
  437. 48.16 s nix log /nix/store/dwwmanmi1lvgs469z8hddfgkfic9634b-gammaloop-nextest-feynkit.drv
  438. 48.37 s [1 built (1 failed), 10 Run failed.