1. 0.00 s $ /nix/store/61685rbaxmpigwi3z23i33sv3jyfl70q-coreutils-9.11/bin/timeout --kill-after=15s 7200s /nix/store/wknkybkzrc16r11vk5vrykh4wmw7a353-nix-2.34.8/bin/nix --extra-experimental-features nix-command --extra-experimental-features flakes flake clone git+https://github.com/alphal00p/gammaloop --dest /tmp/nix-ci-worker/stable-pwd/repo/
  2. 0.08 s Cloning into '/tmp/nix-ci-worker/stable-pwd/repo'...
  3. 0.76 s remote: Enumerating objects: 103497, done.
  4. 0.88 s remote: Counting objects: 0% (1/10120) remote: Counting objects: 1% (102/10120) remote: Counting objects: 2% (203/10120) remote: Counting objects: 3% (304/10120) remote: Counting objects: 4% (405/10120) remote: Counting objects: 5% (506/10120) remote: Counting objects: 6% (608/10120) remote: Counting objects: 7% (709/10120) remote: Counting objects: 8% (810/10120) remote: Counting objects: 9% (911/10120) remote: Counting objects: 10% (1012/10120) remote: Counting objects: 11% (1114/10120) remote: Counting objects: 12% (1215/10120) remote: Counting objects: 13% (1316/10120) remote: Counting objects: 14% (1417/10120) remote: Counting objects: 15% (1518/10120) remote: Counting objects: 16% (1620/10120) remote: Counting objects: 17% (1721/10120) remote: Counting objects: 18% (1822/10120) remote: Counting objects: 19% (1923/10120) remote: Counting objects: 20% (2024/10120) remote: Counting objects: 21% (2126/10120) remote: Counting objects: 22% (2227/10120) remote: Counting objects: 23% (2328/10120) remote: Counting objects: 24% (2429/10120) remote: Counting objects: 25% (2530/10120) remote: Counting objects: 26% (2632/10120) remote: Counting objects: 27% (2733/10120) remote: Counting objects: 28% (2834/10120) remote: Counting objects: 29% (2935/10120) remote: Counting objects: 30% (3036/10120) remote: Counting objects: 31% (3138/10120) remote: Counting objects: 32% (3239/10120) remote: Counting objects: 33% (3340/10120) remote: Counting objects: 34% (3441/10120) remote: Counting objects: 35% (3542/10120) remote: Counting objects: 36% (3644/10120) remote: Counting objects: 37% (3745/10120) remote: Counting objects: 38% (3846/10120) remote: Counting objects: 39% (3947/10120) remote: Counting objects: 40% (4048/10120) remote: Counting objects: 41% (4150/10120) remote: Counting objects: 42% (4251/10120) remote: Counting objects: 43% (4352/10120) remote: Counting objects: 44% (4453/10120) remote: Counting objects: 45% (4554/10120) remote: Counting objects: 46% (4656/10120) remote: Counting objects: 47% (4757/10120) remote: Counting objects: 48% (4858/10120) remote: Counting objects: 49% (4959/10120) remote: Counting objects: 50% (5060/10120) remote: Counting objects: 51% (5162/10120) remote: Counting objects: 52% (5263/10120) remote: Counting objects: 53% (5364/10120) remote: Counting objects: 54% (5465/10120) remote: Counting objects: 55% (5566/10120) remote: Counting objects: 56% (5668/10120) remote: Counting objects: 57% (5769/10120) remote: Counting objects: 58% (5870/10120) remote: Counting objects: 59% (5971/10120) remote: Counting objects: 60% (6072/10120) remote: Counting objects: 61% (6174/10120) remote: Counting objects: 62% (6275/10120) remote: Counting objects: 63% (6376/10120) remote: Counting objects: 64% (6477/10120) remote: Counting objects: 65% (6578/10120) remote: Counting objects: 66% (6680/10120) remote: Counting objects: 67% (6781/10120) remote: Counting objects: 68% (6882/10120) remote: Counting objects: 69% (6983/10120) remote: Counting objects: 70% (7084/10120) remote: Counting objects: 71% (7186/10120) remote: Counting objects: 72% (7287/10120) remote: Counting objects: 73% (7388/10120) remote: Counting objects: 74% (7489/10120) remote: Counting objects: 75% (7590/10120) remote: Counting objects: 76% (7692/10120) remote: Counting objects: 77% (7793/10120) remote: Counting objects: 78% (7894/10120) remote: Counting objects: 79% (7995/10120) remote: Counting objects: 80% (8096/10120) remote: Counting objects: 81% (8198/10120) remote: Counting objects: 82% (8299/10120) remote: Counting objects: 83% (8400/10120) remote: Counting objects: 84% (8501/10120) remote: Counting objects: 85% (8602/10120) remote: Counting objects: 86% (8704/10120) remote: Counting objects: 87% (8805/10120) remote: Counting objects: 88% (8906/10120) remote: Counting objects: 89% (9007/10120) remote: Counting objects: 90% (9108/10120) remote: Counting objects: 91% (9210/10120) remote: Counting objects: 92% (9311/10120) remote: Counting objects: 93% (9412/10120) remote: Counting objects: 94% (9513/10120) remote: Counting objects: 95% (9614/10120) remote: Counting objects: 96% (9716/10120) remote: Counting objects: 97% (9817/10120) remote: Counting objects: 98% (9918/10120) remote: Counting objects: 99% (10019/10120) remote: Counting objects: 100% (10120/10120) remote: Counting objects: 100% (10120/10120), done.
  5. 3.01 s remote: Compressing objects: 0% (1/2291) remote: Compressing objects: 1% (23/2291) remote: Compressing objects: 2% (46/2291) remote: Compressing objects: 3% (69/2291) remote: Compressing objects: 4% (92/2291) remote: Compressing objects: 5% (115/2291) remote: Compressing objects: 6% (138/2291) remote: Compressing objects: 7% (161/2291) remote: Compressing objects: 8% (184/2291) remote: Compressing objects: 9% (207/2291) remote: Compressing objects: 10% (230/2291) remote: Compressing objects: 10% (238/2291) remote: Compressing objects: 11% (253/2291) remote: Compressing objects: 12% (275/2291) remote: Compressing objects: 13% (298/2291) remote: Compressing objects: 14% (321/2291) remote: Compressing objects: 15% (344/2291) remote: Compressing objects: 16% (367/2291) remote: Compressing objects: 17% (390/2291) remote: Compressing objects: 18% (413/2291) remote: Compressing objects: 19% (436/2291) remote: Compressing objects: 20% (459/2291) remote: Compressing objects: 21% (482/2291) remote: Compressing objects: 22% (505/2291) remote: Compressing objects: 23% (527/2291) remote: Compressing objects: 23% (545/2291) remote: Compressing objects: 24% (550/2291) remote: Compressing objects: 25% (573/2291) remote: Compressing objects: 26% (596/2291) remote: Compressing objects: 27% (619/2291) remote: Compressing objects: 28% (642/2291) remote: Compressing objects: 29% (665/2291) remote: Compressing objects: 30% (688/2291) remote: Compressing objects: 31% (711/2291) remote: Compressing objects: 32% (734/2291) remote: Compressing objects: 33% (757/2291) remote: Compressing objects: 34% (779/2291) remote: Compressing objects: 35% (802/2291) remote: Compressing objects: 36% (825/2291) remote: Compressing objects: 37% (848/2291) remote: Compressing objects: 38% (871/2291) remote: Compressing objects: 39% (894/2291) remote: Compressing objects: 40% (917/2291) remote: Compressing objects: 41% (940/2291) remote: Compressing objects: 42% (963/2291) remote: Compressing objects: 43% (986/2291) remote: Compressing objects: 44% (1009/2291) remote: Compressing objects: 45% (1031/2291) remote: Compressing objects: 46% (1054/2291) remote: Compressing objects: 47% (1077/2291) remote: Compressing objects: 48% (1100/2291) remote: Compressing objects: 49% (1123/2291) remote: Compressing objects: 50% (1146/2291) remote: Compressing objects: 51% (1169/2291) remote: Compressing objects: 52% (1192/2291) remote: Compressing objects: 53% (1215/2291) remote: Compressing objects: 54% (1238/2291) remote: Compressing objects: 55% (1261/2291) remote: Compressing objects: 56% (1283/2291) remote: Compressing objects: 57% (1306/2291) remote: Compressing objects: 58% (1329/2291) remote: Compressing objects: 59% (1352/2291) remote: Compressing objects: 60% (1375/2291) remote: Compressing objects: 61% (1398/2291) remote: Compressing objects: 62% (1421/2291) remote: Compressing objects: 63% (1444/2291) remote: Compressing objects: 64% (1467/2291) remote: Compressing objects: 65% (1490/2291) remote: Compressing objects: 66% (1513/2291) remote: Compressing objects: 67% (1535/2291) remote: Compressing objects: 68% (1558/2291) remote: Compressing objects: 69% (1581/2291) remote: Compressing objects: 70% (1604/2291) remote: Compressing objects: 71% (1627/2291) remote: Compressing objects: 72% (1650/2291) remote: Compressing objects: 73% (1673/2291) remote: Compressing objects: 74% (1696/2291) remote: Compressing objects: 75% (1719/2291) remote: Compressing objects: 76% (1742/2291) remote: Compressing objects: 77% (1765/2291) remote: Compressing objects: 78% (1787/2291) remote: Compressing objects: 79% (1810/2291) remote: Compressing objects: 80% (1833/2291) remote: Compressing objects: 81% (1856/2291) remote: Compressing objects: 82% (1879/2291) remote: Compressing objects: 83% (1902/2291) remote: Compressing objects: 84% (1925/2291) remote: Compressing objects: 85% (1948/2291) remote: Compressing objects: 86% (1971/2291) remote: Compressing objects: 87% (1994/2291) remote: Compressing objects: 88% (2017/2291) remote: Compressing objects: 89% (2039/2291) remote: Compressing objects: 90% (2062/2291) remote: Compressing objects: 91% (2085/2291) remote: Compressing objects: 92% (2108/2291) remote: Compressing objects: 93% (2131/2291) remote: Compressing objects: 94% (2154/2291) remote: Compressing objects: 95% (2177/2291) remote: Compressing objects: 96% (2200/2291) remote: Compressing objects: 97% (2223/2291) remote: Compressing objects: 98% (2246/2291) remote: Compressing objects: 99% (2269/2291) remote: Compressing objects: 100% (2291/2291) remote: Compressing objects: 100% (2291/2291), done.
  6. 15.04 s Receiving objects: 0% (1/103497) Receiving objects: 1% (1035/103497) Receiving objects: 2% (2070/103497) Receiving objects: 3% (3105/103497) Receiving objects: 4% (4140/103497) Receiving objects: 5% (5175/103497) Receiving objects: 6% (6210/103497) Receiving objects: 7% (7245/103497), 13.61 MiB | 27.19 MiB/s Receiving objects: 8% (8280/103497), 13.61 MiB | 27.19 MiB/s Receiving objects: 9% (9315/103497), 13.61 MiB | 27.19 MiB/s Receiving objects: 10% (10350/103497), 13.61 MiB | 27.19 MiB/s Receiving objects: 11% (11385/103497), 13.61 MiB | 27.19 MiB/s Receiving objects: 12% (12420/103497), 13.61 MiB | 27.19 MiB/s Receiving objects: 13% (13455/103497), 13.61 MiB | 27.19 MiB/s Receiving objects: 14% (14490/103497), 13.61 MiB | 27.19 MiB/s Receiving objects: 15% (15525/103497), 13.61 MiB | 27.19 MiB/s Receiving objects: 16% (16560/103497), 13.61 MiB | 27.19 MiB/s Receiving objects: 17% (17595/103497), 13.61 MiB | 27.19 MiB/s Receiving objects: 18% (18630/103497), 13.61 MiB | 27.19 MiB/s Receiving objects: 19% (19665/103497), 13.61 MiB | 27.19 MiB/s Receiving objects: 20% (20700/103497), 13.61 MiB | 27.19 MiB/s Receiving objects: 21% (21735/103497), 13.61 MiB | 27.19 MiB/s Receiving objects: 22% (22770/103497), 13.61 MiB | 27.19 MiB/s Receiving objects: 23% (23805/103497), 13.61 MiB | 27.19 MiB/s Receiving objects: 24% (24840/103497), 13.61 MiB | 27.19 MiB/s Receiving objects: 25% (25875/103497), 13.61 MiB | 27.19 MiB/s Receiving objects: 26% (26910/103497), 13.61 MiB | 27.19 MiB/s Receiving objects: 27% (27945/103497), 13.61 MiB | 27.19 MiB/s Receiving objects: 28% (28980/103497), 13.61 MiB | 27.19 MiB/s Receiving objects: 29% (30015/103497), 13.61 MiB | 27.19 MiB/s Receiving objects: 30% (31050/103497), 13.61 MiB | 27.19 MiB/s Receiving objects: 31% (32085/103497), 13.61 MiB | 27.19 MiB/s Receiving objects: 32% (33120/103497), 13.61 MiB | 27.19 MiB/s Receiving objects: 32% (33554/103497), 13.61 MiB | 27.19 MiB/s Receiving objects: 33% (34155/103497), 31.46 MiB | 31.45 MiB/s Receiving objects: 34% (35189/103497), 31.46 MiB | 31.45 MiB/s Receiving objects: 35% (36224/103497), 31.46 MiB | 31.45 MiB/s Receiving objects: 36% (37259/103497), 31.46 MiB | 31.45 MiB/s Receiving objects: 37% (38294/103497), 31.46 MiB | 31.45 MiB/s Receiving objects: 38% (39329/103497), 31.46 MiB | 31.45 MiB/s Receiving objects: 39% (40364/103497), 31.46 MiB | 31.45 MiB/s Receiving objects: 40% (41399/103497), 48.85 MiB | 32.56 MiB/s Receiving objects: 41% (42434/103497), 48.85 MiB | 32.56 MiB/s Receiving objects: 42% (43469/103497), 48.85 MiB | 32.56 MiB/s Receiving objects: 43% (44504/103497), 48.85 MiB | 32.56 MiB/s Receiving objects: 44% (45539/103497), 48.85 MiB | 32.56 MiB/s Receiving objects: 45% (46574/103497), 48.85 MiB | 32.56 MiB/s Receiving objects: 46% (47609/103497), 48.85 MiB | 32.56 MiB/s Receiving objects: 47% (48644/103497), 48.85 MiB | 32.56 MiB/s Receiving objects: 47% (48736/103497), 64.61 MiB | 32.17 MiB/s Receiving objects: 48% (49679/103497), 64.61 MiB | 32.17 MiB/s Receiving objects: 49% (50714/103497), 64.61 MiB | 32.17 MiB/s Receiving objects: 50% (51749/103497), 64.61 MiB | 32.17 MiB/s Receiving objects: 51% (52784/103497), 64.61 MiB | 32.17 MiB/s Receiving objects: 52% (53819/103497), 64.61 MiB | 32.17 MiB/s Receiving objects: 53% (54854/103497), 64.61 MiB | 32.17 MiB/s Receiving objects: 54% (55889/103497), 80.91 MiB | 32.26 MiB/s Receiving objects: 55% (56924/103497), 80.91 MiB | 32.26 MiB/s Receiving objects: 55% (57067/103497), 97.93 MiB | 32.27 MiB/s Receiving objects: 55% (57158/103497), 114.75 MiB | 32.35 MiB/s Receiving objects: 55% (57530/103497), 147.98 MiB | 32.36 MiB/s Receiving objects: 56% (57959/103497), 147.98 MiB | 32.36 MiB/s Receiving objects: 57% (58994/103497), 164.29 MiB | 32.86 MiB/s Receiving objects: 58% (60029/103497), 164.29 MiB | 32.86 MiB/s Receiving objects: 59% (61064/103497), 164.29 MiB | 32.86 MiB/s Receiving objects: 60% (62099/103497), 164.29 MiB | 32.86 MiB/s Receiving objects: 61% (63134/103497), 164.29 MiB | 32.86 MiB/s Receiving objects: 62% (64169/103497), 164.29 MiB | 32.86 MiB/s Receiving objects: 63% (65204/103497), 180.80 MiB | 32.56 MiB/s Receiving objects: 64% (66239/103497), 180.80 MiB | 32.56 MiB/s Receiving objects: 65% (67274/103497), 180.80 MiB | 32.56 MiB/s Receiving objects: 66% (68309/103497), 180.80 MiB | 32.56 MiB/s Receiving objects: 67% (69343/103497), 180.80 MiB | 32.56 MiB/s Receiving objects: 68% (70378/103497), 180.80 MiB | 32.56 MiB/s Receiving objects: 68% (70433/103497), 180.80 MiB | 32.56 MiB/s Receiving objects: 69% (71413/103497), 180.80 MiB | 32.56 MiB/s Receiving objects: 70% (72448/103497), 180.80 MiB | 32.56 MiB/s Receiving objects: 71% (73483/103497), 180.80 MiB | 32.56 MiB/s Receiving objects: 72% (74518/103497), 198.05 MiB | 32.34 MiB/s Receiving objects: 73% (75553/103497), 198.05 MiB | 32.34 MiB/s Receiving objects: 74% (76588/103497), 198.05 MiB | 32.34 MiB/s Receiving objects: 74% (76987/103497), 214.70 MiB | 32.51 MiB/s Receiving objects: 75% (77623/103497), 231.26 MiB | 32.56 MiB/s Receiving objects: 76% (78658/103497), 231.26 MiB | 32.56 MiB/s Receiving objects: 77% (79693/103497), 231.26 MiB | 32.56 MiB/s Receiving objects: 78% (80728/103497), 231.26 MiB | 32.56 MiB/s Receiving objects: 79% (81763/103497), 231.26 MiB | 32.56 MiB/s Receiving objects: 80% (82798/103497), 231.26 MiB | 32.56 MiB/s Receiving objects: 81% (83833/103497), 248.08 MiB | 32.71 MiB/s Receiving objects: 81% (84182/103497), 263.58 MiB | 32.50 MiB/s Receiving objects: 81% (84502/103497), 297.61 MiB | 32.77 MiB/s Receiving objects: 82% (84868/103497), 313.97 MiB | 32.88 MiB/s Receiving objects: 83% (85903/103497), 313.97 MiB | 32.88 MiB/s Receiving objects: 84% (86938/103497), 313.97 MiB | 32.88 MiB/s Receiving objects: 84% (86939/103497), 313.97 MiB | 32.88 MiB/s Receiving objects: 85% (87973/103497), 329.73 MiB | 32.72 MiB/s Receiving objects: 86% (89008/103497), 329.73 MiB | 32.72 MiB/s Receiving objects: 87% (90043/103497), 329.73 MiB | 32.72 MiB/s Receiving objects: 88% (91078/103497), 329.73 MiB | 32.72 MiB/s Receiving objects: 88% (91428/103497), 346.24 MiB | 32.67 MiB/s Receiving objects: 89% (92113/103497), 380.39 MiB | 32.96 MiB/s Receiving objects: 90% (93148/103497), 380.39 MiB | 32.96 MiB/s Receiving objects: 91% (94183/103497), 380.39 MiB | 32.96 MiB/s Receiving objects: 92% (95218/103497), 380.39 MiB | 32.96 MiB/s Receiving objects: 93% (96253/103497), 380.39 MiB | 32.96 MiB/s Receiving objects: 94% (97288/103497), 380.39 MiB | 32.96 MiB/s Receiving objects: 95% (98323/103497), 380.39 MiB | 32.96 MiB/s Receiving objects: 96% (99358/103497), 380.39 MiB | 32.96 MiB/s Receiving objects: 97% (100393/103497), 380.39 MiB | 32.96 MiB/s Receiving objects: 98% (101428/103497), 380.39 MiB | 32.96 MiB/s Receiving objects: 99% (102463/103497), 380.39 MiB | 32.96 MiB/s Receiving objects: 99% (102470/103497), 380.39 MiB | 32.96 MiB/s remote: Total 103497 (delta 8623), reused 8045 (delta 7804), pack-reused 93377 (from 4)
  7. 15.04 s Receiving objects: 100% (103497/103497), 380.39 MiB | 32.96 MiB/s Receiving objects: 100% (103497/103497), 391.99 MiB | 32.60 MiB/s, done.
  8. 16.28 s Resolving deltas: 0% (0/67811) Resolving deltas: 1% (679/67811) Resolving deltas: 2% (1357/67811) Resolving deltas: 3% (2035/67811) Resolving deltas: 4% (2713/67811) Resolving deltas: 5% (3393/67811) Resolving deltas: 6% (4069/67811) Resolving deltas: 7% (4747/67811) Resolving deltas: 8% (5425/67811) Resolving deltas: 9% (6103/67811) Resolving deltas: 10% (6782/67811) Resolving deltas: 11% (7460/67811) Resolving deltas: 12% (8138/67811) Resolving deltas: 13% (8816/67811) Resolving deltas: 14% (9494/67811) Resolving deltas: 15% (10172/67811) Resolving deltas: 16% (10850/67811) Resolving deltas: 17% (11528/67811) Resolving deltas: 18% (12206/67811) Resolving deltas: 19% (12885/67811) Resolving deltas: 20% (13563/67811) Resolving deltas: 21% (14241/67811) Resolving deltas: 22% (14919/67811) Resolving deltas: 23% (15597/67811) Resolving deltas: 24% (16275/67811) Resolving deltas: 25% (16953/67811) Resolving deltas: 26% (17631/67811) Resolving deltas: 27% (18309/67811) Resolving deltas: 28% (18988/67811) Resolving deltas: 29% (19666/67811) Resolving deltas: 30% (20344/67811) Resolving deltas: 31% (21022/67811) Resolving deltas: 32% (21700/67811) Resolving deltas: 33% (22379/67811) Resolving deltas: 34% (23057/67811) Resolving deltas: 35% (23734/67811) Resolving deltas: 36% (24413/67811) Resolving deltas: 37% (25091/67811) Resolving deltas: 38% (25769/67811) Resolving deltas: 39% (26447/67811) Resolving deltas: 40% (27126/67811) Resolving deltas: 41% (27803/67811) Resolving deltas: 42% (28481/67811) Resolving deltas: 43% (29159/67811) Resolving deltas: 44% (29837/67811) Resolving deltas: 45% (30515/67811) Resolving deltas: 46% (31195/67811) Resolving deltas: 47% (31872/67811) Resolving deltas: 48% (32550/67811) Resolving deltas: 49% (33228/67811) Resolving deltas: 50% (33906/67811) Resolving deltas: 51% (34584/67811) Resolving deltas: 52% (35262/67811) Resolving deltas: 53% (35940/67811) Resolving deltas: 54% (36618/67811) Resolving deltas: 55% (37297/67811) Resolving deltas: 56% (37975/67811) Resolving deltas: 57% (38653/67811) Resolving deltas: 58% (39331/67811) Resolving deltas: 59% (40011/67811) Resolving deltas: 60% (40687/67811) Resolving deltas: 61% (41365/67811) Resolving deltas: 62% (42043/67811) Resolving deltas: 63% (42722/67811) Resolving deltas: 64% (43400/67811) Resolving deltas: 65% (44078/67811) Resolving deltas: 66% (44757/67811) Resolving deltas: 67% (45435/67811) Resolving deltas: 68% (46112/67811) Resolving deltas: 69% (46790/67811) Resolving deltas: 70% (47468/67811) Resolving deltas: 71% (48146/67811) Resolving deltas: 72% (48824/67811) Resolving deltas: 73% (49503/67811) Resolving deltas: 74% (50181/67811) Resolving deltas: 75% (50859/67811) Resolving deltas: 76% (51537/67811) Resolving deltas: 77% (52217/67811) Resolving deltas: 78% (52896/67811) Resolving deltas: 79% (53572/67811) Resolving deltas: 80% (54252/67811) Resolving deltas: 80% (54432/67811) Resolving deltas: 81% (54927/67811) Resolving deltas: 82% (55606/67811) Resolving deltas: 83% (56284/67811) Resolving deltas: 84% (56962/67811) Resolving deltas: 85% (57640/67811) Resolving deltas: 86% (58318/67811) Resolving deltas: 87% (58996/67811) Resolving deltas: 88% (59674/67811) Resolving deltas: 89% (60353/67811) Resolving deltas: 90% (61030/67811) Resolving deltas: 91% (61709/67811) Resolving deltas: 92% (62387/67811) Resolving deltas: 93% (63065/67811) Resolving deltas: 94% (63743/67811) Resolving deltas: 95% (64422/67811) Resolving deltas: 96% (65099/67811) Resolving deltas: 97% (65777/67811) Resolving deltas: 98% (66456/67811) Resolving deltas: 99% (67134/67811) Resolving deltas: 100% (67811/67811) Resolving deltas: 100% (67811/67811), done.
  9. 16.94 s Fetching commit 13c9bb203f1daef2670356779366ed6afc72bc51 for feynkit ...
  10. 16.94 s $ /nix/store/5vpcfsdx1lcnlb2y4k7xyc74shp5qwbh-git-2.54.0/bin/git fetch origin 13c9bb203f1daef2670356779366ed6afc72bc51
  11. 17.37 s From https://github.com/alphal00p/gammaloop
  12. 17.37 s * branch 13c9bb203f1daef2670356779366ed6afc72bc51 -> FETCH_HEAD
  13. 17.38 s $ /nix/store/61685rbaxmpigwi3z23i33sv3jyfl70q-coreutils-9.11/bin/timeout --kill-after=15s 7200s /nix/store/5vpcfsdx1lcnlb2y4k7xyc74shp5qwbh-git-2.54.0/bin/git -c advice.detachedHead=false checkout 13c9bb203f1daef2670356779366ed6afc72bc51
  14. 17.63 s HEAD is now at 13c9bb203 bundle readable math typography in notebook HTML
  15. 17.64 s $ /nix/store/61685rbaxmpigwi3z23i33sv3jyfl70q-coreutils-9.11/bin/timeout --kill-after=15s 7200s /nix/store/wknkybkzrc16r11vk5vrykh4wmw7a353-nix-2.34.8/bin/nix --extra-experimental-features nix-command --extra-experimental-features flakes --log-format internal-json run .#packages.x86_64-linux.nix-ci-check-gammaloop-nextest-docs --print-build-logs
  16. 17.76 s warning: ignoring untrusted flake configuration setting 'extra-substituters'.
  17. 17.76 s Pass '--accept-flake-config' to trust it
  18. 17.76 s warning: ignoring untrusted flake configuration setting 'extra-trusted-public-keys'.
  19. 17.76 s Pass '--accept-flake-config' to trust it
  20. 23.88 s
  21. 23.99 s Downloading cached nix-ci-check-gammaloop-nextest-docs from https://cache.nix-ci.com
  22. 23.99 s Downloaded cached nix-ci-check-gammaloop-nextest-docs (1128 B) in 3ms
  23. 23.99 s Progress: 0 of 1 built, 1 of 1 downloaded from cache
  24. 24.12 s do you want to allow configuration setting 'extra-substituters' to be set to 'https://cache.nix-ci.com' (y/N)? do you want to permanently mark this value as untrusted (y/N)? warning: ignoring untrusted flake configuration setting 'extra-substituters'.
  25. 24.12 s Pass '--accept-flake-config' to trust it
  26. 24.12 s evaluating derivation 'gdo you want to allow configuration setting 'extra-trusted-public-keys' to be set to 'nix-ci:g3xV5BDTLtIBZr/A00IU1x0EtKKlb7YLgBN2SgYgM6A=' (y/N)? do you want to permanently mark this value as untrusted (y/N)? warning: ignoring untrusted flake configuration setting 'extra-trusted-public-keys'.
  27. 24.12 s Pass '--accept-flake-config' to trust it
  28. 41.59 s copying '/nix/store/hc7a evaluating derivation 'g copying '/nix/store/hc7a evaluating derivation 'g copying '/nix/store/hc7a evaluating derivation 'g copying '/nix/store/hc7a evaluating derivation 'g copying '/nix/store/hc7a evaluating derivation 'g copying '/nix/store/hc7a evaluating derivation 'g copying '/nix/store/hc7a evaluating derivation 'g copying '/nix/store/hc7a evaluating derivation 'g copying '/nix/store/hc7a evaluating derivation 'g [1/0/1 copied (0.0 KiB/2 [1/0/1 copied (3.1/201.4 [1/0/1 copied (8.0/201.4 [1/0/1 copied (14.0/201. [1/0/1 copied (20.2/201. [1/0/1 copied (23.6/201. [1/0/1 copied (31.1/201. [1/0/1 copied (35.2/201. [1/0/1 copied (37.8/201. [1/0/1 copied (39.8/201. [1/0/1 copied (41.9/201. [1/0/1 copied (43.8/201. [1/0/1 copied (47.0/201. [1/0/1 copied (49.3/201. [1/0/1 copied (51.1/201. [1/0/1 copied (53.6/201. [1/0/1 copied (56.0/201. [1/0/1 copied (58.4/201. [1/0/1 copied (60.5/201. [1/0/1 copied (62.4/201. [1/0/1 copied (64.2/201. [1/0/1 copied (65.7/201. [1/0/1 copied (68.4/201. [1/0/1 copied (70.8/201. [1/0/1 copied (72.8/201. [1/0/1 copied (74.3/201. [1/0/1 copied (75.8/201. [1/0/1 copied (77.8/201. [1/0/1 copied (80.2/201. [1/0/1 copied (82.9/201. [1/0/1 copied (86.0/201. [1/0/1 copied (87.8/201. [1/0/1 copied (89.7/201. [1/0/1 copied (92.0/201. [1/0/1 copied (94.8/201. [1/0/1 copied (97.0/201. [1/0/1 copied (99.6/201. [1/0/1 copied (101.8/201 [1/0/1 copied (104.0/201 [1/0/1 copied (106.3/201 [1/0/1 copied (108.2/201 [1/0/1 copied (111.1/201 [1/0/1 copied (114.2/201 [1/0/1 copied (116.2/201 [1/0/1 copied (117.6/201 [1/0/1 copied (129.0/201 [1/0/1 copied (132.3/201 [1/0/1 copied (149.6/201 [1/0/1 copied (153.0/201 [1/0/1 copied (158.7/201 [1/0/1 copied (160.1/201 [1/0/1 copied (161.2/201 [1/0/1 copied (162.3/201 [1/0/1 copied (163.6/201 [1/0/1 copied (164.5/201 [1/0/1 copied (165.6/201 [1/0/1 copied (166.6/201 [1/0/1 copied (167.7/201 [1/0/1 copied (168.8/201 [1/0/1 copied (170.0/201 [1/0/1 copied (170.9/201 [1/0/1 copied (172.0/201 [1/0/1 copied (173.1/201 [1/0/1 copied (174.4/201 [1/0/1 copied (175.4/201 [1/0/1 copied (176.6/201 [1/0/1 copied (184.9/201 [1/0/1 copied (187.8/201 [1/0/1 copied (189.7/201 [1/0/1 copied (192.5/201 [1/0/1 copied (195.2/201 [1/0/1 copied (201.4 MiB [1 copied (201.4 MiB), 4 [0/21 built, 16/2/109 co [0/21 built, 16/11/109 c [0/21 built, 16/19/109 c [0/20 built, 16/24/109 c [0/17 built, 16/31/109 c [0/16 built, 16/32/109 c [0/11 built, 11/46/109 c [0/11 built, 8/55/109 co [0/11 built, 5/60/109 co [0/11 built, 4/62/109 co [1/0/10 built, 2/64/109 [1/0/10 built, 6/65/109 gammaloop-nextest-binaries-docs (post)> Uploading to the NixCI cache: /nix/store/0a7lprsgf16vm0cxyjd4gl819k6ijrk8-gammaloop-nextest-binaries-docs
  29. 41.64 s [1/0/10 built, 16/65/109gammaloop-nextest-binaries-docs (post)> warning: 'warn-short-path-literals' is deprecated, use 'lint-short-path-literals = ignore' instead
  30. 41.67 s gammaloop-nextest-binaries-docs (post)> copying 0 paths...
  31. 41.72 s gammaloop-nextest-binaries-docs (post)> warning: 'warn-short-path-literals' is deprecated, use 'lint-short-path-literals = ignore' instead
  32. 41.90 s gammaloop-nextest-binaries-docs (post)> copying 0 paths...
  33. 42.32 s [1/9 built, 14/83/109 co [1/9 built, 6/94/109 cop [1/9 built, 7/97/109 cop [1/9 built, 6/100/109 co [1/1/8 built, 5/101/109 builder.pl> Running phase: patchPhase
  34. 42.32 s builder.pl> Running phase: updateAutotoolsGnuConfigScriptsPhase
  35. 42.33 s builder.pl> Running phase: configurePhase
  36. 42.34 s builder.pl> no configure script, doing nothing
  37. 42.34 s builder.pl> Running phase: buildPhase
  38. 42.35 s builder.pl> Running phase: checkPhase
  39. 42.35 s builder.pl> Running phase: installPhase
  40. 42.36 s builder.pl> no Makefile or custom installPhase, doing nothing
  41. 42.36 s builder.pl> Running phase: fixupPhase
  42. 42.37 s builder.pl> shrinking RPATHs of ELF executables and libraries in /nix/store/zzmspl8wdn2a3ancrz8dg3kci887nw6d-builder.pl
  43. 42.37 s builder.pl> checking for references to /build/ in /nix/store/zzmspl8wdn2a3ancrz8dg3kci887nw6d-builder.pl...
  44. 42.38 s builder.pl> patching script interpreter paths in /nix/store/zzmspl8wdn2a3ancrz8dg3kci887nw6d-builder.pl
  45. 42.42 s builder.pl (post)> Uploading to the NixCI cache: /nix/store/zzmspl8wdn2a3ancrz8dg3kci887nw6d-builder.pl
  46. 42.47 s builder.pl (post)> warning: 'warn-short-path-literals' is deprecated, use 'lint-short-path-literals = ignore' instead
  47. 42.50 s builder.pl (post)> copying 0 paths...
  48. 42.58 s builder.pl (post)> warning: 'warn-short-path-literals' is deprecated, use 'lint-short-path-literals = ignore' instead
  49. 43.01 s builder.pl (post)> copying 0 paths...
  50. 43.78 s [2/6 built, 2/105/109 co [2/5 built, 1/106/109 co [2/5 built, 1/107/109 co [2/4 built, 109 copied (typst> structuredAttrs is enabled
  51. 43.84 s [1/2/4 built, 109 copiedtypst> created 4 symlinks in user environment
  52. 43.94 s typst (post)> Uploading to the NixCI cache: /nix/store/yc93gbspdkf53nwjsf1mbydbsaq9snxl-typst-0.15.1-env
  53. 43.97 s typst (post)> warning: 'warn-short-path-literals' is deprecated, use 'lint-short-path-literals = ignore' instead
  54. 44.00 s typst (post)> copying 0 paths...
  55. 44.05 s typst (post)> warning: 'warn-short-path-literals' is deprecated, use 'lint-short-path-literals = ignore' instead
  56. 44.50 s typst (post)> copying 0 paths...
  57. 44.92 s [3/5 built, 109 copied ( [1/3/4 built, 109 copiedgammaloop-nextest-docs> Extracting 2 binaries to /build/source
  58. 44.96 s gammaloop-nextest-docs> Extracted 5 files to /build/source in 0.04s
  59. 44.97 s gammaloop-nextest-docs> ------------
  60. 44.97 s gammaloop-nextest-docs> Nextest run ID 146421d1-0e8e-4eee-845a-e599617d7081 with nextest profile: ci_gammaloop
  61. 44.97 s gammaloop-nextest-docs> Starting 129 tests across 2 binaries
  62. 45.00 s gammaloop-nextest-docs> FAIL [ 0.016s] ( 26/129) alphal00p-docs-builder tests::developer_architecture_is_classified_searchable_and_source_backed
  63. 45.00 s gammaloop-nextest-docs> stdout ---
  64. 45.00 s gammaloop-nextest-docs>
  65. 45.00 s gammaloop-nextest-docs> running 1 test
  66. 45.00 s gammaloop-nextest-docs> test tests::developer_architecture_is_classified_searchable_and_source_backed ... FAILED
  67. 45.00 s gammaloop-nextest-docs>
  68. 45.00 s gammaloop-nextest-docs> failures:
  69. 45.00 s gammaloop-nextest-docs>
  70. 45.00 s gammaloop-nextest-docs> failures:
  71. 45.00 s gammaloop-nextest-docs> tests::developer_architecture_is_classified_searchable_and_source_backed
  72. 45.00 s gammaloop-nextest-docs>
  73. 45.00 s gammaloop-nextest-docs> test result: FAILED. 0 passed; 1 failed; 0 ignored; 0 measured; 128 filtered out; finished in 0.01s
  74. 45.00 s gammaloop-nextest-docs>
  75. 45.00 s gammaloop-nextest-docs> stderr ---
  76. 45.00 s gammaloop-nextest-docs>
  77. 45.00 s gammaloop-nextest-docs> thread 'tests::developer_architecture_is_classified_searchable_and_source_backed' (296) panicked at crates/alphal00p-docs-builder/src/lib.rs:12751:14:
  78. 45.00 s gammaloop-nextest-docs> called `Result::unwrap()` on an `Err` value: failed to copy documentation asset crates/spynso3/typst/STIXTwoMath-Regular.woff2
  79. 45.00 s gammaloop-nextest-docs>
  80. 45.00 s gammaloop-nextest-docs> Caused by:
  81. 45.00 s gammaloop-nextest-docs> No such file or directory (os error 2)
  82. 45.00 s gammaloop-nextest-docs>
  83. 45.00 s gammaloop-nextest-docs> Location:
  84. 45.00 s gammaloop-nextest-docs> crates/alphal00p-docs-builder/src/lib.rs:2276:18
  85. 45.00 s gammaloop-nextest-docs> stack backtrace:
  86. 45.00 s gammaloop-nextest-docs> 0: __rustc::rust_begin_unwind
  87. 45.00 s gammaloop-nextest-docs> 1: core::panicking::panic_fmt
  88. 45.00 s gammaloop-nextest-docs> 2: core::result::unwrap_failed
  89. 45.00 s gammaloop-nextest-docs> 3: alphal00p_docs_builder::tests::developer_architecture_is_classified_searchable_and_source_backed
  90. 45.00 s gammaloop-nextest-docs> 4: <alphal00p_docs_builder::tests::developer_architecture_is_classified_searchable_and_source_backed::{closure#0} as core::ops::function::FnOnce<()>>::call_once
  91. 45.00 s gammaloop-nextest-docs> note: Some details are omitted, run with `RUST_BACKTRACE=full` for a verbose backtrace.
  92. 45.00 s gammaloop-nextest-docs>
  93. 45.01 s gammaloop-nextest-docs> FAIL [ 0.013s] ( 30/129) alphal00p-docs-builder tests::every_product_orients_rust_to_native_rustdoc_and_keeps_legacy_redirects
  94. 45.01 s gammaloop-nextest-docs> stdout ---
  95. 45.01 s gammaloop-nextest-docs>
  96. 45.01 s gammaloop-nextest-docs> running 1 test
  97. 45.01 s gammaloop-nextest-docs> test tests::every_product_orients_rust_to_native_rustdoc_and_keeps_legacy_redirects ... FAILED
  98. 45.01 s gammaloop-nextest-docs>
  99. 45.01 s gammaloop-nextest-docs> failures:
  100. 45.01 s gammaloop-nextest-docs>
  101. 45.01 s gammaloop-nextest-docs> failures:
  102. 45.01 s gammaloop-nextest-docs> tests::every_product_orients_rust_to_native_rustdoc_and_keeps_legacy_redirects
  103. 45.01 s gammaloop-nextest-docs>
  104. 45.01 s gammaloop-nextest-docs> test result: FAILED. 0 passed; 1 failed; 0 ignored; 0 measured; 128 filtered out; finished in 0.01s
  105. 45.01 s gammaloop-nextest-docs>
  106. 45.01 s gammaloop-nextest-docs> stderr ---
  107. 45.01 s gammaloop-nextest-docs>
  108. 45.01 s gammaloop-nextest-docs> thread 'tests::every_product_orients_rust_to_native_rustdoc_and_keeps_legacy_redirects' (307) panicked at crates/alphal00p-docs-builder/src/lib.rs:12555:46:
  109. 45.01 s gammaloop-nextest-docs> called `Result::unwrap()` on an `Err` value: failed to copy documentation asset crates/spynso3/typst/STIXTwoMath-Regular.woff2
  110. 45.01 s gammaloop-nextest-docs>
  111. 45.01 s gammaloop-nextest-docs> Caused by:
  112. 45.01 s gammaloop-nextest-docs> No such file or directory (os error 2)
  113. 45.01 s gammaloop-nextest-docs>
  114. 45.01 s gammaloop-nextest-docs> Location:
  115. 45.01 s gammaloop-nextest-docs> crates/alphal00p-docs-builder/src/lib.rs:2276:18
  116. 45.01 s gammaloop-nextest-docs> stack backtrace:
  117. 45.01 s gammaloop-nextest-docs> 0: __rustc::rust_begin_unwind
  118. 45.01 s gammaloop-nextest-docs> 1: core::panicking::panic_fmt
  119. 45.01 s gammaloop-nextest-docs> 2: core::result::unwrap_failed
  120. 45.01 s gammaloop-nextest-docs> 3: alphal00p_docs_builder::tests::every_product_orients_rust_to_native_rustdoc_and_keeps_legacy_redirects
  121. 45.01 s gammaloop-nextest-docs> 4: <alphal00p_docs_builder::tests::every_product_orients_rust_to_native_rustdoc_and_keeps_legacy_redirects::{closure#0} as core::ops::function::FnOnce<()>>::call_once
  122. 45.01 s gammaloop-nextest-docs> note: Some details are omitted, run with `RUST_BACKTRACE=full` for a verbose backtrace.
  123. 45.01 s gammaloop-nextest-docs>
  124. 45.05 s gammaloop-nextest-docs> FAIL [ 0.014s] ( 54/129) alphal00p-docs-builder tests::portal_and_developer_pages_use_federated_search_and_feedback
  125. 45.05 s gammaloop-nextest-docs> stdout ---
  126. 45.05 s gammaloop-nextest-docs>
  127. 45.05 s gammaloop-nextest-docs> running 1 test
  128. 45.05 s gammaloop-nextest-docs> test tests::portal_and_developer_pages_use_federated_search_and_feedback ... FAILED
  129. 45.05 s gammaloop-nextest-docs>
  130. 45.05 s gammaloop-nextest-docs> failures:
  131. 45.05 s gammaloop-nextest-docs>
  132. 45.05 s gammaloop-nextest-docs> failures:
  133. 45.05 s gammaloop-nextest-docs> tests::portal_and_developer_pages_use_federated_search_and_feedback
  134. 45.05 s gammaloop-nextest-docs>
  135. 45.05 s gammaloop-nextest-docs> test result: FAILED. 0 passed; 1 failed; 0 ignored; 0 measured; 128 filtered out; finished in 0.01s
  136. 45.05 s gammaloop-nextest-docs>
  137. 45.05 s gammaloop-nextest-docs> stderr ---
  138. 45.05 s gammaloop-nextest-docs>
  139. 45.05 s gammaloop-nextest-docs> thread 'tests::portal_and_developer_pages_use_federated_search_and_feedback' (420) panicked at crates/alphal00p-docs-builder/src/lib.rs:9684:14:
  140. 45.05 s gammaloop-nextest-docs> called `Result::unwrap()` on an `Err` value: failed to copy documentation asset crates/spynso3/typst/STIXTwoMath-Regular.woff2
  141. 45.05 s gammaloop-nextest-docs>
  142. 45.05 s gammaloop-nextest-docs> Caused by:
  143. 45.05 s gammaloop-nextest-docs> No such file or directory (os error 2)
  144. 45.05 s gammaloop-nextest-docs>
  145. 45.05 s gammaloop-nextest-docs> Location:
  146. 45.05 s gammaloop-nextest-docs> crates/alphal00p-docs-builder/src/lib.rs:2276:18
  147. 45.05 s gammaloop-nextest-docs> stack backtrace:
  148. 45.05 s gammaloop-nextest-docs> 0: __rustc::rust_begin_unwind
  149. 45.05 s gammaloop-nextest-docs> 1: core::panicking::panic_fmt
  150. 45.05 s gammaloop-nextest-docs> 2: core::result::unwrap_failed
  151. 45.05 s gammaloop-nextest-docs> 3: alphal00p_docs_builder::tests::write_test_portal
  152. 45.05 s gammaloop-nextest-docs> 4: alphal00p_docs_builder::tests::portal_and_developer_pages_use_federated_search_and_feedback
  153. 45.05 s gammaloop-nextest-docs> 5: <alphal00p_docs_builder::tests::portal_and_developer_pages_use_federated_search_and_feedback::{closure#0} as core::ops::function::FnOnce<()>>::call_once
  154. 45.05 s gammaloop-nextest-docs> note: Some details are omitted, run with `RUST_BACKTRACE=full` for a verbose backtrace.
  155. 45.05 s gammaloop-nextest-docs>
  156. 45.05 s gammaloop-nextest-docs> FAIL [ 0.012s] ( 55/129) alphal00p-docs-builder tests::portal_emits_routes_and_valid_assets
  157. 45.05 s gammaloop-nextest-docs> stdout ---
  158. 45.05 s gammaloop-nextest-docs>
  159. 45.05 s gammaloop-nextest-docs> running 1 test
  160. 45.05 s gammaloop-nextest-docs> test tests::portal_emits_routes_and_valid_assets ... FAILED
  161. 45.05 s gammaloop-nextest-docs>
  162. 45.05 s gammaloop-nextest-docs> failures:
  163. 45.05 s gammaloop-nextest-docs>
  164. 45.05 s gammaloop-nextest-docs> failures:
  165. 45.05 s gammaloop-nextest-docs> tests::portal_emits_routes_and_valid_assets
  166. 45.05 s gammaloop-nextest-docs>
  167. 45.05 s gammaloop-nextest-docs> test result: FAILED. 0 passed; 1 failed; 0 ignored; 0 measured; 128 filtered out; finished in 0.01s
  168. 45.05 s gammaloop-nextest-docs>
  169. 45.05 s gammaloop-nextest-docs> stderr ---
  170. 45.05 s gammaloop-nextest-docs>
  171. 45.05 s gammaloop-nextest-docs> thread 'tests::portal_emits_routes_and_valid_assets' (431) panicked at crates/alphal00p-docs-builder/src/lib.rs:9684:14:
  172. 45.05 s gammaloop-nextest-docs> called `Result::unwrap()` on an `Err` value: failed to copy documentation asset crates/spynso3/typst/STIXTwoMath-Regular.woff2
  173. 45.05 s gammaloop-nextest-docs>
  174. 45.05 s gammaloop-nextest-docs> Caused by:
  175. 45.05 s gammaloop-nextest-docs> No such file or directory (os error 2)
  176. 45.05 s gammaloop-nextest-docs>
  177. 45.05 s gammaloop-nextest-docs> Location:
  178. 45.05 s gammaloop-nextest-docs> crates/alphal00p-docs-builder/src/lib.rs:2276:18
  179. 45.05 s gammaloop-nextest-docs> stack backtrace:
  180. 45.05 s gammaloop-nextest-docs> 0: __rustc::rust_begin_unwind
  181. 45.05 s gammaloop-nextest-docs> 1: core::panicking::panic_fmt
  182. 45.05 s gammaloop-nextest-docs> 2: core::result::unwrap_failed
  183. 45.05 s gammaloop-nextest-docs> 3: alphal00p_docs_builder::tests::write_test_portal
  184. 45.05 s gammaloop-nextest-docs> 4: alphal00p_docs_builder::tests::portal_emits_routes_and_valid_assets
  185. 45.05 s gammaloop-nextest-docs> 5: <alphal00p_docs_builder::tests::portal_emits_routes_and_valid_assets::{closure#0} as core::ops::function::FnOnce<()>>::call_once
  186. 45.05 s gammaloop-nextest-docs> note: Some details are omitted, run with `RUST_BACKTRACE=full` for a verbose backtrace.
  187. 45.05 s gammaloop-nextest-docs>
  188. 45.05 s gammaloop-nextest-docs> FAIL [ 0.012s] ( 56/129) alphal00p-docs-builder tests::portal_task_chooser_routes_each_goal_to_the_registered_quickstart
  189. 45.05 s gammaloop-nextest-docs> stdout ---
  190. 45.05 s gammaloop-nextest-docs>
  191. 45.05 s gammaloop-nextest-docs> running 1 test
  192. 45.05 s gammaloop-nextest-docs> test tests::portal_task_chooser_routes_each_goal_to_the_registered_quickstart ... FAILED
  193. 45.05 s gammaloop-nextest-docs>
  194. 45.05 s gammaloop-nextest-docs> failures:
  195. 45.05 s gammaloop-nextest-docs>
  196. 45.05 s gammaloop-nextest-docs> failures:
  197. 45.05 s gammaloop-nextest-docs> tests::portal_task_chooser_routes_each_goal_to_the_registered_quickstart
  198. 45.05 s gammaloop-nextest-docs>
  199. 45.05 s gammaloop-nextest-docs> test result: FAILED. 0 passed; 1 failed; 0 ignored; 0 measured; 128 filtered out; finished in 0.01s
  200. 45.05 s gammaloop-nextest-docs>
  201. 45.05 s gammaloop-nextest-docs> stderr ---
  202. 45.05 s gammaloop-nextest-docs>
  203. 45.05 s gammaloop-nextest-docs> thread 'tests::portal_task_chooser_routes_each_goal_to_the_registered_quickstart' (439) panicked at crates/alphal00p-docs-builder/src/lib.rs:9684:14:
  204. 45.05 s gammaloop-nextest-docs> called `Result::unwrap()` on an `Err` value: failed to copy documentation asset crates/spynso3/typst/STIXTwoMath-Regular.woff2
  205. 45.05 s gammaloop-nextest-docs>
  206. 45.05 s gammaloop-nextest-docs> Caused by:
  207. 45.05 s gammaloop-nextest-docs> No such file or directory (os error 2)
  208. 45.05 s gammaloop-nextest-docs>
  209. 45.05 s gammaloop-nextest-docs> Location:
  210. 45.05 s gammaloop-nextest-docs> crates/alphal00p-docs-builder/src/lib.rs:2276:18
  211. 45.05 s gammaloop-nextest-docs> stack backtrace:
  212. 45.05 s gammaloop-nextest-docs> 0: __rustc::rust_begin_unwind
  213. 45.05 s gammaloop-nextest-docs> 1: core::panicking::panic_fmt
  214. 45.05 s gammaloop-nextest-docs> 2: core::result::unwrap_failed
  215. 45.05 s gammaloop-nextest-docs> 3: alphal00p_docs_builder::tests::write_test_portal
  216. 45.05 s gammaloop-nextest-docs> 4: alphal00p_docs_builder::tests::portal_task_chooser_routes_each_goal_to_the_registered_quickstart
  217. 45.05 s gammaloop-nextest-docs> 5: <alphal00p_docs_builder::tests::portal_task_chooser_routes_each_goal_to_the_registered_quickstart::{closure#0} as core::ops::function::FnOnce<()>>::call_once
  218. 45.05 s gammaloop-nextest-docs> note: Some details are omitted, run with `RUST_BACKTRACE=full` for a verbose backtrace.
  219. 45.05 s gammaloop-nextest-docs>
  220. 45.10 s gammaloop-nextest-docs> FAIL [ 0.008s] ( 85/129) alphal00p-docs-builder tests::site_assets_replace_read_only_generated_files
  221. 45.10 s gammaloop-nextest-docs> stdout ---
  222. 45.10 s gammaloop-nextest-docs>
  223. 45.10 s gammaloop-nextest-docs> running 1 test
  224. 45.10 s gammaloop-nextest-docs> test tests::site_assets_replace_read_only_generated_files ... FAILED
  225. 45.10 s gammaloop-nextest-docs>
  226. 45.10 s gammaloop-nextest-docs> failures:
  227. 45.10 s gammaloop-nextest-docs>
  228. 45.10 s gammaloop-nextest-docs> failures:
  229. 45.10 s gammaloop-nextest-docs> tests::site_assets_replace_read_only_generated_files
  230. 45.10 s gammaloop-nextest-docs>
  231. 45.10 s gammaloop-nextest-docs> test result: FAILED. 0 passed; 1 failed; 0 ignored; 0 measured; 128 filtered out; finished in 0.00s
  232. 45.10 s gammaloop-nextest-docs>
  233. 45.10 s gammaloop-nextest-docs> stderr ---
  234. 45.10 s gammaloop-nextest-docs>
  235. 45.10 s gammaloop-nextest-docs> thread 'tests::site_assets_replace_read_only_generated_files' (657) panicked at crates/alphal00p-docs-builder/src/lib.rs:12305:50:
  236. 45.10 s gammaloop-nextest-docs> called `Result::unwrap()` on an `Err` value: failed to copy documentation asset crates/spynso3/typst/STIXTwoMath-Regular.woff2
  237. 45.10 s gammaloop-nextest-docs>
  238. 45.10 s gammaloop-nextest-docs> Caused by:
  239. 45.10 s gammaloop-nextest-docs> No such file or directory (os error 2)
  240. 45.10 s gammaloop-nextest-docs>
  241. 45.10 s gammaloop-nextest-docs> Location:
  242. 45.10 s gammaloop-nextest-docs> crates/alphal00p-docs-builder/src/lib.rs:2276:18
  243. 45.10 s gammaloop-nextest-docs> stack backtrace:
  244. 45.10 s gammaloop-nextest-docs> 0: __rustc::rust_begin_unwind
  245. 45.10 s gammaloop-nextest-docs> 1: core::panicking::panic_fmt
  246. 45.10 s gammaloop-nextest-docs> 2: core::result::unwrap_failed
  247. 45.10 s gammaloop-nextest-docs> 3: alphal00p_docs_builder::tests::site_assets_replace_read_only_generated_files
  248. 45.10 s gammaloop-nextest-docs> 4: <alphal00p_docs_builder::tests::site_assets_replace_read_only_generated_files::{closure#0} as core::ops::function::FnOnce<()>>::call_once
  249. 45.10 s gammaloop-nextest-docs> note: Some details are omitted, run with `RUST_BACKTRACE=full` for a verbose backtrace.
  250. 45.10 s gammaloop-nextest-docs>
  251. 45.10 s gammaloop-nextest-docs> FAIL [ 0.129s] ( 87/129) alphal00p-docs-builder tests::checked_in_registry_is_valid
  252. 45.10 s gammaloop-nextest-docs> stdout ---
  253. 45.10 s gammaloop-nextest-docs>
  254. 45.10 s gammaloop-nextest-docs> running 1 test
  255. 45.10 s gammaloop-nextest-docs> test tests::checked_in_registry_is_valid ... FAILED
  256. 45.10 s gammaloop-nextest-docs>
  257. 45.10 s gammaloop-nextest-docs> failures:
  258. 45.10 s gammaloop-nextest-docs>
  259. 45.10 s gammaloop-nextest-docs> failures:
  260. 45.10 s gammaloop-nextest-docs> tests::checked_in_registry_is_valid
  261. 45.10 s gammaloop-nextest-docs>
  262. 45.10 s gammaloop-nextest-docs> test result: FAILED. 0 passed; 1 failed; 0 ignored; 0 measured; 128 filtered out; finished in 0.12s
  263. 45.10 s gammaloop-nextest-docs>
  264. 45.10 s gammaloop-nextest-docs> stderr ---
  265. 45.10 s gammaloop-nextest-docs>
  266. 45.10 s gammaloop-nextest-docs> thread 'tests::checked_in_registry_is_valid' (195) panicked at crates/alphal00p-docs-builder/src/lib.rs:12260:50:
  267. 45.10 s gammaloop-nextest-docs> called `Result::unwrap()` on an `Err` value: required documentation source is missing: /build/source/crates/spynso3/typst/STIXTwoMath-Regular.woff2
  268. 45.10 s gammaloop-nextest-docs>
  269. 45.10 s gammaloop-nextest-docs> Location:
  270. 45.10 s gammaloop-nextest-docs> crates/alphal00p-docs-builder/src/lib.rs:5103:9
  271. 45.10 s gammaloop-nextest-docs> stack backtrace:
  272. 45.10 s gammaloop-nextest-docs> 0: __rustc::rust_begin_unwind
  273. 45.10 s gammaloop-nextest-docs> 1: core::panicking::panic_fmt
  274. 45.10 s gammaloop-nextest-docs> 2: core::result::unwrap_failed
  275. 45.10 s gammaloop-nextest-docs> 3: alphal00p_docs_builder::tests::checked_in_registry_is_valid
  276. 45.10 s gammaloop-nextest-docs> 4: <alphal00p_docs_builder::tests::checked_in_registry_is_valid::{closure#0} as core::ops::function::FnOnce<()>>::call_once
  277. 45.10 s gammaloop-nextest-docs> note: Some details are omitted, run with `RUST_BACKTRACE=full` for a verbose backtrace.
  278. 45.10 s gammaloop-nextest-docs>
  279. 45.11 s gammaloop-nextest-docs> FAIL [ 0.136s] ( 94/129) alphal00p-docs-builder provenance_tests::each_build_captures_one_revision_before_rendering
  280. 45.11 s gammaloop-nextest-docs> stdout ---
  281. 45.11 s gammaloop-nextest-docs>
  282. 45.11 s gammaloop-nextest-docs> running 1 test
  283. 45.11 s gammaloop-nextest-docs>
  284. 45.11 s gammaloop-nextest-docs> running 1 test
  285. 45.11 s gammaloop-nextest-docs> test provenance_tests::each_build_captures_one_revision_before_rendering ... FAILED
  286. 45.11 s gammaloop-nextest-docs>
  287. 45.11 s gammaloop-nextest-docs> failures:
  288. 45.11 s gammaloop-nextest-docs>
  289. 45.11 s gammaloop-nextest-docs> failures:
  290. 45.11 s gammaloop-nextest-docs> provenance_tests::each_build_captures_one_revision_before_rendering
  291. 45.11 s gammaloop-nextest-docs>
  292. 45.11 s gammaloop-nextest-docs> test result: FAILED. 0 passed; 1 failed; 0 ignored; 0 measured; 128 filtered out; finished in 0.12s
  293. 45.11 s gammaloop-nextest-docs>
  294. 45.11 s gammaloop-nextest-docs> test provenance_tests::each_build_captures_one_revision_before_rendering ... FAILED
  295. 45.11 s gammaloop-nextest-docs>
  296. 45.11 s gammaloop-nextest-docs> failures:
  297. 45.11 s gammaloop-nextest-docs>
  298. 45.11 s gammaloop-nextest-docs> failures:
  299. 45.11 s gammaloop-nextest-docs> provenance_tests::each_build_captures_one_revision_before_rendering
  300. 45.11 s gammaloop-nextest-docs>
  301. 45.11 s gammaloop-nextest-docs> test result: FAILED. 0 passed; 1 failed; 0 ignored; 0 measured; 128 filtered out; finished in 0.13s
  302. 45.11 s gammaloop-nextest-docs>
  303. 45.11 s gammaloop-nextest-docs> stderr ---
  304. 45.11 s gammaloop-nextest-docs>
  305. 45.11 s gammaloop-nextest-docs> thread 'provenance_tests::each_build_captures_one_revision_before_rendering' (250) panicked at crates/alphal00p-docs-builder/src/provenance_tests.rs:297:14:
  306. 45.11 s gammaloop-nextest-docs> called `Result::unwrap()` on an `Err` value: required documentation source is missing: /build/source/target/nix-ci-tmp/.tmpH2EaaK/checkout/crates/spynso3/typst/STIXTwoMath-Regular.woff2
  307. 45.11 s gammaloop-nextest-docs>
  308. 45.11 s gammaloop-nextest-docs> Location:
  309. 45.11 s gammaloop-nextest-docs> crates/alphal00p-docs-builder/src/lib.rs:5103:9
  310. 45.11 s gammaloop-nextest-docs> stack backtrace:
  311. 45.11 s gammaloop-nextest-docs> 0: __rustc::rust_begin_unwind
  312. 45.11 s gammaloop-nextest-docs> 1: core::panicking::panic_fmt
  313. 45.11 s gammaloop-nextest-docs> 2: core::result::unwrap_failed
  314. 45.11 s gammaloop-nextest-docs> 3: alphal00p_docs_builder::provenance_tests::each_build_captures_one_revision_before_rendering
  315. 45.11 s gammaloop-nextest-docs> 4: <alphal00p_docs_builder::provenance_tests::each_build_captures_one_revision_before_rendering::{closure#0} as core::ops::function::FnOnce<()>>::call_once
  316. 45.11 s gammaloop-nextest-docs> note: Some details are omitted, run with `RUST_BACKTRACE=full` for a verbose backtrace.
  317. 45.11 s gammaloop-nextest-docs>
  318. 45.11 s gammaloop-nextest-docs> thread 'provenance_tests::each_build_captures_one_revision_before_rendering' (192) panicked at crates/alphal00p-docs-builder/src/provenance_tests.rs:274:9:
  319. 45.11 s gammaloop-nextest-docs> assertion failed: command.status().unwrap().success()
  320. 45.11 s gammaloop-nextest-docs> stack backtrace:
  321. 45.11 s gammaloop-nextest-docs> 0: __rustc::rust_begin_unwind
  322. 45.11 s gammaloop-nextest-docs> 1: core::panicking::panic_fmt
  323. 45.11 s gammaloop-nextest-docs> 2: core::panicking::panic
  324. 45.11 s gammaloop-nextest-docs> 3: alphal00p_docs_builder::provenance_tests::each_build_captures_one_revision_before_rendering
  325. 45.11 s gammaloop-nextest-docs> 4: <alphal00p_docs_builder::provenance_tests::each_build_captures_one_revision_before_rendering::{closure#0} as core::ops::function::FnOnce<()>>::call_once
  326. 45.11 s gammaloop-nextest-docs> note: Some details are omitted, run with `RUST_BACKTRACE=full` for a verbose backtrace.
  327. 45.11 s gammaloop-nextest-docs>
  328. 45.11 s gammaloop-nextest-docs> FAIL [ 0.122s] ( 95/129) alphal00p-docs-builder tests::developer_scope_ranges_ignore_unrelated_edits_and_warn_only_while_watching
  329. 45.11 s gammaloop-nextest-docs> stdout ---
  330. 45.11 s gammaloop-nextest-docs>
  331. 45.11 s gammaloop-nextest-docs> running 1 test
  332. 45.11 s gammaloop-nextest-docs> test tests::developer_scope_ranges_ignore_unrelated_edits_and_warn_only_while_watching ... FAILED
  333. 45.11 s gammaloop-nextest-docs>
  334. 45.11 s gammaloop-nextest-docs> failures:
  335. 45.11 s gammaloop-nextest-docs>
  336. 45.11 s gammaloop-nextest-docs> failures:
  337. 45.11 s gammaloop-nextest-docs> tests::developer_scope_ranges_ignore_unrelated_edits_and_warn_only_while_watching
  338. 45.11 s gammaloop-nextest-docs>
  339. 45.11 s gammaloop-nextest-docs> test result: FAILED. 0 passed; 1 failed; 0 ignored; 0 measured; 128 filtered out; finished in 0.12s
  340. 45.11 s gammaloop-nextest-docs>
  341. 45.11 s gammaloop-nextest-docs> stderr ---
  342. 45.11 s gammaloop-nextest-docs>
  343. 45.11 s gammaloop-nextest-docs> thread 'tests::developer_scope_ranges_ignore_unrelated_edits_and_warn_only_while_watching' (285) panicked at crates/alphal00p-docs-builder/src/lib.rs:12350:29:
  344. 45.11 s gammaloop-nextest-docs> called `Result::unwrap()` on an `Err` value: required documentation source is missing: /build/source/crates/spynso3/typst/STIXTwoMath-Regular.woff2
  345. 45.11 s gammaloop-nextest-docs>
  346. 45.11 s gammaloop-nextest-docs> Location:
  347. 45.11 s gammaloop-nextest-docs> crates/alphal00p-docs-builder/src/lib.rs:5103:9
  348. 45.11 s gammaloop-nextest-docs> stack backtrace:
  349. 45.11 s gammaloop-nextest-docs> 0: __rustc::rust_begin_unwind
  350. 45.11 s gammaloop-nextest-docs> 1: core::panicking::panic_fmt
  351. 45.11 s gammaloop-nextest-docs> 2: core::result::unwrap_failed
  352. 45.11 s gammaloop-nextest-docs> 3: alphal00p_docs_builder::tests::developer_scope_ranges_ignore_unrelated_edits_and_warn_only_while_watching
  353. 45.11 s gammaloop-nextest-docs> 4: <alphal00p_docs_builder::tests::developer_scope_ranges_ignore_unrelated_edits_and_warn_only_while_watching::{closure#0} as core::ops::function::FnOnce<()>>::call_once
  354. 45.11 s gammaloop-nextest-docs> note: Some details are omitted, run with `RUST_BACKTRACE=full` for a verbose backtrace.
  355. 45.11 s gammaloop-nextest-docs>
  356. 45.12 s gammaloop-nextest-docs> FAIL [ 0.123s] (106/129) alphal00p-docs-builder tests::every_product_requires_a_task_chooser_and_each_supported_interface
  357. 45.12 s gammaloop-nextest-docs> stdout ---
  358. 45.12 s gammaloop-nextest-docs>
  359. 45.12 s gammaloop-nextest-docs> running 1 test
  360. 45.12 s gammaloop-nextest-docs> test tests::every_product_requires_a_task_chooser_and_each_supported_interface ... FAILED
  361. 45.12 s gammaloop-nextest-docs>
  362. 45.12 s gammaloop-nextest-docs> failures:
  363. 45.12 s gammaloop-nextest-docs>
  364. 45.12 s gammaloop-nextest-docs> failures:
  365. 45.12 s gammaloop-nextest-docs> tests::every_product_requires_a_task_chooser_and_each_supported_interface
  366. 45.12 s gammaloop-nextest-docs>
  367. 45.12 s gammaloop-nextest-docs> test result: FAILED. 0 passed; 1 failed; 0 ignored; 0 measured; 128 filtered out; finished in 0.12s
  368. 45.12 s gammaloop-nextest-docs>
  369. 45.12 s gammaloop-nextest-docs> stderr ---
  370. 45.12 s gammaloop-nextest-docs>
  371. 45.12 s gammaloop-nextest-docs> thread 'tests::every_product_requires_a_task_chooser_and_each_supported_interface' (312) panicked at crates/alphal00p-docs-builder/src/lib.rs:12274:9:
  372. 45.12 s gammaloop-nextest-docs> assertion failed: format!("{error:#}").contains("has no quickstart page")
  373. 45.12 s gammaloop-nextest-docs> stack backtrace:
  374. 45.12 s gammaloop-nextest-docs> 0: __rustc::rust_begin_unwind
  375. 45.12 s gammaloop-nextest-docs> 1: core::panicking::panic_fmt
  376. 45.12 s gammaloop-nextest-docs> 2: core::panicking::panic
  377. 45.12 s gammaloop-nextest-docs> 3: alphal00p_docs_builder::tests::every_product_requires_a_task_chooser_and_each_supported_interface
  378. 45.12 s gammaloop-nextest-docs> 4: <alphal00p_docs_builder::tests::every_product_requires_a_task_chooser_and_each_supported_interface::{closure#0} as core::ops::function::FnOnce<()>>::call_once
  379. 45.12 s gammaloop-nextest-docs> note: Some details are omitted, run with `RUST_BACKTRACE=full` for a verbose backtrace.
  380. 45.12 s gammaloop-nextest-docs>
  381. 45.14 s gammaloop-nextest-docs> FAIL [ 0.110s] (122/129) alphal00p-docs-builder tests::pdf_manual_chapter_order_must_match_the_page_registry
  382. 45.14 s gammaloop-nextest-docs> stdout ---
  383. 45.14 s gammaloop-nextest-docs>
  384. 45.14 s gammaloop-nextest-docs> running 1 test
  385. 45.14 s gammaloop-nextest-docs> test tests::pdf_manual_chapter_order_must_match_the_page_registry ... FAILED
  386. 45.14 s gammaloop-nextest-docs>
  387. 45.14 s gammaloop-nextest-docs> failures:
  388. 45.14 s gammaloop-nextest-docs>
  389. 45.14 s gammaloop-nextest-docs> failures:
  390. 45.14 s gammaloop-nextest-docs> tests::pdf_manual_chapter_order_must_match_the_page_registry
  391. 45.14 s gammaloop-nextest-docs>
  392. 45.14 s gammaloop-nextest-docs> test result: FAILED. 0 passed; 1 failed; 0 ignored; 0 measured; 128 filtered out; finished in 0.11s
  393. 45.14 s gammaloop-nextest-docs>
  394. 45.14 s gammaloop-nextest-docs> stderr ---
  395. 45.14 s gammaloop-nextest-docs>
  396. 45.14 s gammaloop-nextest-docs> thread 'tests::pdf_manual_chapter_order_must_match_the_page_registry' (393) panicked at crates/alphal00p-docs-builder/src/lib.rs:12330:9:
  397. 45.14 s gammaloop-nextest-docs> assertion failed: format!("{error:#}").contains("PDF manual chapter order differs")
  398. 45.14 s gammaloop-nextest-docs> stack backtrace:
  399. 45.14 s gammaloop-nextest-docs> 0: __rustc::rust_begin_unwind
  400. 45.14 s gammaloop-nextest-docs> 1: core::panicking::panic_fmt
  401. 45.14 s gammaloop-nextest-docs> 2: core::panicking::panic
  402. 45.14 s gammaloop-nextest-docs> 3: alphal00p_docs_builder::tests::pdf_manual_chapter_order_must_match_the_page_registry
  403. 45.14 s gammaloop-nextest-docs> 4: <alphal00p_docs_builder::tests::pdf_manual_chapter_order_must_match_the_page_registry::{closure#0} as core::ops::function::FnOnce<()>>::call_once
  404. 45.14 s gammaloop-nextest-docs> note: Some details are omitted, run with `RUST_BACKTRACE=full` for a verbose backtrace.
  405. 45.14 s gammaloop-nextest-docs>
  406. 56.28 s gammaloop-nextest-docs> ------------
  407. 56.28 s gammaloop-nextest-docs> Summary [ 11.307s] 129 tests run: 118 passed, 11 failed, 0 skipped
  408. 56.28 s gammaloop-nextest-docs> FAIL [ 0.016s] ( 26/129) alphal00p-docs-builder tests::developer_architecture_is_classified_searchable_and_source_backed
  409. 56.28 s gammaloop-nextest-docs> stdout ---
  410. 56.28 s gammaloop-nextest-docs>
  411. 56.28 s gammaloop-nextest-docs> running 1 test
  412. 56.28 s gammaloop-nextest-docs> test tests::developer_architecture_is_classified_searchable_and_source_backed ... FAILED
  413. 56.28 s gammaloop-nextest-docs>
  414. 56.28 s gammaloop-nextest-docs> failures:
  415. 56.28 s gammaloop-nextest-docs>
  416. 56.28 s gammaloop-nextest-docs> failures:
  417. 56.28 s gammaloop-nextest-docs> tests::developer_architecture_is_classified_searchable_and_source_backed
  418. 56.28 s gammaloop-nextest-docs>
  419. 56.28 s gammaloop-nextest-docs> test result: FAILED. 0 passed; 1 failed; 0 ignored; 0 measured; 128 filtered out; finished in 0.01s
  420. 56.28 s gammaloop-nextest-docs>
  421. 56.28 s gammaloop-nextest-docs> stderr ---
  422. 56.28 s gammaloop-nextest-docs>
  423. 56.28 s gammaloop-nextest-docs> thread 'tests::developer_architecture_is_classified_searchable_and_source_backed' (296) panicked at crates/alphal00p-docs-builder/src/lib.rs:12751:14:
  424. 56.28 s gammaloop-nextest-docs> called `Result::unwrap()` on an `Err` value: failed to copy documentation asset crates/spynso3/typst/STIXTwoMath-Regular.woff2
  425. 56.28 s gammaloop-nextest-docs>
  426. 56.28 s gammaloop-nextest-docs> Caused by:
  427. 56.28 s gammaloop-nextest-docs> No such file or directory (os error 2)
  428. 56.28 s gammaloop-nextest-docs>
  429. 56.28 s gammaloop-nextest-docs> Location:
  430. 56.28 s gammaloop-nextest-docs> crates/alphal00p-docs-builder/src/lib.rs:2276:18
  431. 56.28 s gammaloop-nextest-docs> stack backtrace:
  432. 56.28 s gammaloop-nextest-docs> 0: __rustc::rust_begin_unwind
  433. 56.28 s gammaloop-nextest-docs> 1: core::panicking::panic_fmt
  434. 56.28 s gammaloop-nextest-docs> 2: core::result::unwrap_failed
  435. 56.28 s gammaloop-nextest-docs> 3: alphal00p_docs_builder::tests::developer_architecture_is_classified_searchable_and_source_backed
  436. 56.28 s gammaloop-nextest-docs> 4: <alphal00p_docs_builder::tests::developer_architecture_is_classified_searchable_and_source_backed::{closure#0} as core::ops::function::FnOnce<()>>::call_once
  437. 56.28 s gammaloop-nextest-docs> note: Some details are omitted, run with `RUST_BACKTRACE=full` for a verbose backtrace.
  438. 56.28 s gammaloop-nextest-docs>
  439. 56.28 s gammaloop-nextest-docs> FAIL [ 0.013s] ( 30/129) alphal00p-docs-builder tests::every_product_orients_rust_to_native_rustdoc_and_keeps_legacy_redirects
  440. 56.28 s gammaloop-nextest-docs> stdout ---
  441. 56.28 s gammaloop-nextest-docs>
  442. 56.28 s gammaloop-nextest-docs> running 1 test
  443. 56.28 s gammaloop-nextest-docs> test tests::every_product_orients_rust_to_native_rustdoc_and_keeps_legacy_redirects ... FAILED
  444. 56.28 s gammaloop-nextest-docs>
  445. 56.28 s gammaloop-nextest-docs> failures:
  446. 56.28 s gammaloop-nextest-docs>
  447. 56.28 s gammaloop-nextest-docs> failures:
  448. 56.28 s gammaloop-nextest-docs> tests::every_product_orients_rust_to_native_rustdoc_and_keeps_legacy_redirects
  449. 56.28 s gammaloop-nextest-docs>
  450. 56.28 s gammaloop-nextest-docs> test result: FAILED. 0 passed; 1 failed; 0 ignored; 0 measured; 128 filtered out; finished in 0.01s
  451. 56.28 s gammaloop-nextest-docs>
  452. 56.28 s gammaloop-nextest-docs> stderr ---
  453. 56.28 s gammaloop-nextest-docs>
  454. 56.28 s gammaloop-nextest-docs> thread 'tests::every_product_orients_rust_to_native_rustdoc_and_keeps_legacy_redirects' (307) panicked at crates/alphal00p-docs-builder/src/lib.rs:12555:46:
  455. 56.28 s gammaloop-nextest-docs> called `Result::unwrap()` on an `Err` value: failed to copy documentation asset crates/spynso3/typst/STIXTwoMath-Regular.woff2
  456. 56.28 s gammaloop-nextest-docs>
  457. 56.28 s gammaloop-nextest-docs> Caused by:
  458. 56.28 s gammaloop-nextest-docs> No such file or directory (os error 2)
  459. 56.28 s gammaloop-nextest-docs>
  460. 56.28 s gammaloop-nextest-docs> Location:
  461. 56.28 s gammaloop-nextest-docs> crates/alphal00p-docs-builder/src/lib.rs:2276:18
  462. 56.28 s gammaloop-nextest-docs> stack backtrace:
  463. 56.28 s gammaloop-nextest-docs> 0: __rustc::rust_begin_unwind
  464. 56.28 s gammaloop-nextest-docs> 1: core::panicking::panic_fmt
  465. 56.28 s gammaloop-nextest-docs> 2: core::result::unwrap_failed
  466. 56.28 s gammaloop-nextest-docs> 3: alphal00p_docs_builder::tests::every_product_orients_rust_to_native_rustdoc_and_keeps_legacy_redirects
  467. 56.28 s gammaloop-nextest-docs> 4: <alphal00p_docs_builder::tests::every_product_orients_rust_to_native_rustdoc_and_keeps_legacy_redirects::{closure#0} as core::ops::function::FnOnce<()>>::call_once
  468. 56.28 s gammaloop-nextest-docs> note: Some details are omitted, run with `RUST_BACKTRACE=full` for a verbose backtrace.
  469. 56.28 s gammaloop-nextest-docs>
  470. 56.28 s gammaloop-nextest-docs> FAIL [ 0.014s] ( 54/129) alphal00p-docs-builder tests::portal_and_developer_pages_use_federated_search_and_feedback
  471. 56.28 s gammaloop-nextest-docs> stdout ---
  472. 56.28 s gammaloop-nextest-docs>
  473. 56.28 s gammaloop-nextest-docs> running 1 test
  474. 56.28 s gammaloop-nextest-docs> test tests::portal_and_developer_pages_use_federated_search_and_feedback ... FAILED
  475. 56.28 s gammaloop-nextest-docs>
  476. 56.28 s gammaloop-nextest-docs> failures:
  477. 56.28 s gammaloop-nextest-docs>
  478. 56.28 s gammaloop-nextest-docs> failures:
  479. 56.28 s gammaloop-nextest-docs> tests::portal_and_developer_pages_use_federated_search_and_feedback
  480. 56.28 s gammaloop-nextest-docs>
  481. 56.28 s gammaloop-nextest-docs> test result: FAILED. 0 passed; 1 failed; 0 ignored; 0 measured; 128 filtered out; finished in 0.01s
  482. 56.28 s gammaloop-nextest-docs>
  483. 56.28 s gammaloop-nextest-docs> stderr ---
  484. 56.28 s gammaloop-nextest-docs>
  485. 56.28 s gammaloop-nextest-docs> thread 'tests::portal_and_developer_pages_use_federated_search_and_feedback' (420) panicked at crates/alphal00p-docs-builder/src/lib.rs:9684:14:
  486. 56.28 s gammaloop-nextest-docs> called `Result::unwrap()` on an `Err` value: failed to copy documentation asset crates/spynso3/typst/STIXTwoMath-Regular.woff2
  487. 56.28 s gammaloop-nextest-docs>
  488. 56.28 s gammaloop-nextest-docs> Caused by:
  489. 56.28 s gammaloop-nextest-docs> No such file or directory (os error 2)
  490. 56.28 s gammaloop-nextest-docs>
  491. 56.28 s gammaloop-nextest-docs> Location:
  492. 56.28 s gammaloop-nextest-docs> crates/alphal00p-docs-builder/src/lib.rs:2276:18
  493. 56.28 s gammaloop-nextest-docs> stack backtrace:
  494. 56.28 s gammaloop-nextest-docs> 0: __rustc::rust_begin_unwind
  495. 56.28 s gammaloop-nextest-docs> 1: core::panicking::panic_fmt
  496. 56.28 s gammaloop-nextest-docs> 2: core::result::unwrap_failed
  497. 56.28 s gammaloop-nextest-docs> 3: alphal00p_docs_builder::tests::write_test_portal
  498. 56.28 s gammaloop-nextest-docs> 4: alphal00p_docs_builder::tests::portal_and_developer_pages_use_federated_search_and_feedback
  499. 56.28 s gammaloop-nextest-docs> 5: <alphal00p_docs_builder::tests::portal_and_developer_pages_use_federated_search_and_feedback::{closure#0} as core::ops::function::FnOnce<()>>::call_once
  500. 56.28 s gammaloop-nextest-docs> note: Some details are omitted, run with `RUST_BACKTRACE=full` for a verbose backtrace.
  501. 56.28 s gammaloop-nextest-docs>
  502. 56.28 s gammaloop-nextest-docs> FAIL [ 0.012s] ( 55/129) alphal00p-docs-builder tests::portal_emits_routes_and_valid_assets
  503. 56.28 s gammaloop-nextest-docs> stdout ---
  504. 56.28 s gammaloop-nextest-docs>
  505. 56.28 s gammaloop-nextest-docs> running 1 test
  506. 56.28 s gammaloop-nextest-docs> test tests::portal_emits_routes_and_valid_assets ... FAILED
  507. 56.28 s gammaloop-nextest-docs>
  508. 56.28 s gammaloop-nextest-docs> failures:
  509. 56.28 s gammaloop-nextest-docs>
  510. 56.28 s gammaloop-nextest-docs> failures:
  511. 56.28 s gammaloop-nextest-docs> tests::portal_emits_routes_and_valid_assets
  512. 56.28 s gammaloop-nextest-docs>
  513. 56.28 s gammaloop-nextest-docs> test result: FAILED. 0 passed; 1 failed; 0 ignored; 0 measured; 128 filtered out; finished in 0.01s
  514. 56.28 s gammaloop-nextest-docs>
  515. 56.28 s gammaloop-nextest-docs> stderr ---
  516. 56.28 s gammaloop-nextest-docs>
  517. 56.28 s gammaloop-nextest-docs> thread 'tests::portal_emits_routes_and_valid_assets' (431) panicked at crates/alphal00p-docs-builder/src/lib.rs:9684:14:
  518. 56.28 s gammaloop-nextest-docs> called `Result::unwrap()` on an `Err` value: failed to copy documentation asset crates/spynso3/typst/STIXTwoMath-Regular.woff2
  519. 56.28 s gammaloop-nextest-docs>
  520. 56.28 s gammaloop-nextest-docs> Caused by:
  521. 56.28 s gammaloop-nextest-docs> No such file or directory (os error 2)
  522. 56.28 s gammaloop-nextest-docs>
  523. 56.28 s gammaloop-nextest-docs> Location:
  524. 56.28 s gammaloop-nextest-docs> crates/alphal00p-docs-builder/src/lib.rs:2276:18
  525. 56.28 s gammaloop-nextest-docs> stack backtrace:
  526. 56.28 s gammaloop-nextest-docs> 0: __rustc::rust_begin_unwind
  527. 56.28 s gammaloop-nextest-docs> 1: core::panicking::panic_fmt
  528. 56.28 s gammaloop-nextest-docs> 2: core::result::unwrap_failed
  529. 56.28 s gammaloop-nextest-docs> 3: alphal00p_docs_builder::tests::write_test_portal
  530. 56.28 s gammaloop-nextest-docs> 4: alphal00p_docs_builder::tests::portal_emits_routes_and_valid_assets
  531. 56.28 s gammaloop-nextest-docs> 5: <alphal00p_docs_builder::tests::portal_emits_routes_and_valid_assets::{closure#0} as core::ops::function::FnOnce<()>>::call_once
  532. 56.28 s gammaloop-nextest-docs> note: Some details are omitted, run with `RUST_BACKTRACE=full` for a verbose backtrace.
  533. 56.28 s gammaloop-nextest-docs>
  534. 56.28 s gammaloop-nextest-docs> FAIL [ 0.012s] ( 56/129) alphal00p-docs-builder tests::portal_task_chooser_routes_each_goal_to_the_registered_quickstart
  535. 56.28 s gammaloop-nextest-docs> stdout ---
  536. 56.28 s gammaloop-nextest-docs>
  537. 56.28 s gammaloop-nextest-docs> running 1 test
  538. 56.28 s gammaloop-nextest-docs> test tests::portal_task_chooser_routes_each_goal_to_the_registered_quickstart ... FAILED
  539. 56.28 s gammaloop-nextest-docs>
  540. 56.28 s gammaloop-nextest-docs> failures:
  541. 56.28 s gammaloop-nextest-docs>
  542. 56.28 s gammaloop-nextest-docs> failures:
  543. 56.28 s gammaloop-nextest-docs> tests::portal_task_chooser_routes_each_goal_to_the_registered_quickstart
  544. 56.28 s gammaloop-nextest-docs>
  545. 56.28 s gammaloop-nextest-docs> test result: FAILED. 0 passed; 1 failed; 0 ignored; 0 measured; 128 filtered out; finished in 0.01s
  546. 56.28 s gammaloop-nextest-docs>
  547. 56.28 s gammaloop-nextest-docs> stderr ---
  548. 56.28 s gammaloop-nextest-docs>
  549. 56.28 s gammaloop-nextest-docs> thread 'tests::portal_task_chooser_routes_each_goal_to_the_registered_quickstart' (439) panicked at crates/alphal00p-docs-builder/src/lib.rs:9684:14:
  550. 56.28 s gammaloop-nextest-docs> called `Result::unwrap()` on an `Err` value: failed to copy documentation asset crates/spynso3/typst/STIXTwoMath-Regular.woff2
  551. 56.28 s gammaloop-nextest-docs>
  552. 56.28 s gammaloop-nextest-docs> Caused by:
  553. 56.28 s gammaloop-nextest-docs> No such file or directory (os error 2)
  554. 56.28 s gammaloop-nextest-docs>
  555. 56.28 s gammaloop-nextest-docs> Location:
  556. 56.28 s gammaloop-nextest-docs> crates/alphal00p-docs-builder/src/lib.rs:2276:18
  557. 56.28 s gammaloop-nextest-docs> stack backtrace:
  558. 56.28 s gammaloop-nextest-docs> 0: __rustc::rust_begin_unwind
  559. 56.28 s gammaloop-nextest-docs> 1: core::panicking::panic_fmt
  560. 56.28 s gammaloop-nextest-docs> 2: core::result::unwrap_failed
  561. 56.28 s gammaloop-nextest-docs> 3: alphal00p_docs_builder::tests::write_test_portal
  562. 56.28 s gammaloop-nextest-docs> 4: alphal00p_docs_builder::tests::portal_task_chooser_routes_each_goal_to_the_registered_quickstart
  563. 56.28 s gammaloop-nextest-docs> 5: <alphal00p_docs_builder::tests::portal_task_chooser_routes_each_goal_to_the_registered_quickstart::{closure#0} as core::ops::function::FnOnce<()>>::call_once
  564. 56.28 s gammaloop-nextest-docs> note: Some details are omitted, run with `RUST_BACKTRACE=full` for a verbose backtrace.
  565. 56.28 s gammaloop-nextest-docs>
  566. 56.28 s gammaloop-nextest-docs> FAIL [ 0.008s] ( 85/129) alphal00p-docs-builder tests::site_assets_replace_read_only_generated_files
  567. 56.28 s gammaloop-nextest-docs> stdout ---
  568. 56.28 s gammaloop-nextest-docs>
  569. 56.28 s gammaloop-nextest-docs> running 1 test
  570. 56.28 s gammaloop-nextest-docs> test tests::site_assets_replace_read_only_generated_files ... FAILED
  571. 56.28 s gammaloop-nextest-docs>
  572. 56.28 s gammaloop-nextest-docs> failures:
  573. 56.28 s gammaloop-nextest-docs>
  574. 56.28 s gammaloop-nextest-docs> failures:
  575. 56.28 s gammaloop-nextest-docs> tests::site_assets_replace_read_only_generated_files
  576. 56.28 s gammaloop-nextest-docs>
  577. 56.28 s gammaloop-nextest-docs> test result: FAILED. 0 passed; 1 failed; 0 ignored; 0 measured; 128 filtered out; finished in 0.00s
  578. 56.28 s gammaloop-nextest-docs>
  579. 56.28 s gammaloop-nextest-docs> stderr ---
  580. 56.28 s gammaloop-nextest-docs>
  581. 56.28 s gammaloop-nextest-docs> thread 'tests::site_assets_replace_read_only_generated_files' (657) panicked at crates/alphal00p-docs-builder/src/lib.rs:12305:50:
  582. 56.28 s gammaloop-nextest-docs> called `Result::unwrap()` on an `Err` value: failed to copy documentation asset crates/spynso3/typst/STIXTwoMath-Regular.woff2
  583. 56.28 s gammaloop-nextest-docs>
  584. 56.28 s gammaloop-nextest-docs> Caused by:
  585. 56.28 s gammaloop-nextest-docs> No such file or directory (os error 2)
  586. 56.28 s gammaloop-nextest-docs>
  587. 56.28 s gammaloop-nextest-docs> Location:
  588. 56.28 s gammaloop-nextest-docs> crates/alphal00p-docs-builder/src/lib.rs:2276:18
  589. 56.28 s gammaloop-nextest-docs> stack backtrace:
  590. 56.28 s gammaloop-nextest-docs> 0: __rustc::rust_begin_unwind
  591. 56.28 s gammaloop-nextest-docs> 1: core::panicking::panic_fmt
  592. 56.28 s gammaloop-nextest-docs> 2: core::result::unwrap_failed
  593. 56.28 s gammaloop-nextest-docs> 3: alphal00p_docs_builder::tests::site_assets_replace_read_only_generated_files
  594. 56.28 s gammaloop-nextest-docs> 4: <alphal00p_docs_builder::tests::site_assets_replace_read_only_generated_files::{closure#0} as core::ops::function::FnOnce<()>>::call_once
  595. 56.28 s gammaloop-nextest-docs> note: Some details are omitted, run with `RUST_BACKTRACE=full` for a verbose backtrace.
  596. 56.28 s gammaloop-nextest-docs>
  597. 56.28 s gammaloop-nextest-docs> FAIL [ 0.129s] ( 87/129) alphal00p-docs-builder tests::checked_in_registry_is_valid
  598. 56.28 s gammaloop-nextest-docs> stdout ---
  599. 56.28 s gammaloop-nextest-docs>
  600. 56.28 s gammaloop-nextest-docs> running 1 test
  601. 56.28 s gammaloop-nextest-docs> test tests::checked_in_registry_is_valid ... FAILED
  602. 56.28 s gammaloop-nextest-docs>
  603. 56.28 s gammaloop-nextest-docs> failures:
  604. 56.28 s gammaloop-nextest-docs>
  605. 56.28 s gammaloop-nextest-docs> failures:
  606. 56.28 s gammaloop-nextest-docs> tests::checked_in_registry_is_valid
  607. 56.28 s gammaloop-nextest-docs>
  608. 56.28 s gammaloop-nextest-docs> test result: FAILED. 0 passed; 1 failed; 0 ignored; 0 measured; 128 filtered out; finished in 0.12s
  609. 56.28 s gammaloop-nextest-docs>
  610. 56.28 s gammaloop-nextest-docs> stderr ---
  611. 56.28 s gammaloop-nextest-docs>
  612. 56.28 s gammaloop-nextest-docs> thread 'tests::checked_in_registry_is_valid' (195) panicked at crates/alphal00p-docs-builder/src/lib.rs:12260:50:
  613. 56.28 s gammaloop-nextest-docs> called `Result::unwrap()` on an `Err` value: required documentation source is missing: /build/source/crates/spynso3/typst/STIXTwoMath-Regular.woff2
  614. 56.28 s gammaloop-nextest-docs>
  615. 56.28 s gammaloop-nextest-docs> Location:
  616. 56.28 s gammaloop-nextest-docs> crates/alphal00p-docs-builder/src/lib.rs:5103:9
  617. 56.28 s gammaloop-nextest-docs> stack backtrace:
  618. 56.28 s gammaloop-nextest-docs> 0: __rustc::rust_begin_unwind
  619. 56.28 s gammaloop-nextest-docs> 1: core::panicking::panic_fmt
  620. 56.28 s gammaloop-nextest-docs> 2: core::result::unwrap_failed
  621. 56.28 s gammaloop-nextest-docs> 3: alphal00p_docs_builder::tests::checked_in_registry_is_valid
  622. 56.28 s gammaloop-nextest-docs> 4: <alphal00p_docs_builder::tests::checked_in_registry_is_valid::{closure#0} as core::ops::function::FnOnce<()>>::call_once
  623. 56.28 s gammaloop-nextest-docs> note: Some details are omitted, run with `RUST_BACKTRACE=full` for a verbose backtrace.
  624. 56.28 s gammaloop-nextest-docs>
  625. 56.28 s gammaloop-nextest-docs> FAIL [ 0.136s] ( 94/129) alphal00p-docs-builder provenance_tests::each_build_captures_one_revision_before_rendering
  626. 56.28 s gammaloop-nextest-docs> stdout ---
  627. 56.28 s gammaloop-nextest-docs>
  628. 56.28 s gammaloop-nextest-docs> running 1 test
  629. 56.28 s gammaloop-nextest-docs>
  630. 56.28 s gammaloop-nextest-docs> running 1 test
  631. 56.28 s gammaloop-nextest-docs> test provenance_tests::each_build_captures_one_revision_before_rendering ... FAILED
  632. 56.28 s gammaloop-nextest-docs>
  633. 56.28 s gammaloop-nextest-docs> failures:
  634. 56.28 s gammaloop-nextest-docs>
  635. 56.28 s gammaloop-nextest-docs> failures:
  636. 56.28 s gammaloop-nextest-docs> provenance_tests::each_build_captures_one_revision_before_rendering
  637. 56.28 s gammaloop-nextest-docs>
  638. 56.28 s gammaloop-nextest-docs> test result: FAILED. 0 passed; 1 failed; 0 ignored; 0 measured; 128 filtered out; finished in 0.12s
  639. 56.28 s gammaloop-nextest-docs>
  640. 56.28 s gammaloop-nextest-docs> test provenance_tests::each_build_captures_one_revision_before_rendering ... FAILED
  641. 56.28 s gammaloop-nextest-docs>
  642. 56.28 s gammaloop-nextest-docs> failures:
  643. 56.28 s gammaloop-nextest-docs>
  644. 56.28 s gammaloop-nextest-docs> failures:
  645. 56.28 s gammaloop-nextest-docs> provenance_tests::each_build_captures_one_revision_before_rendering
  646. 56.28 s gammaloop-nextest-docs>
  647. 56.28 s gammaloop-nextest-docs> test result: FAILED. 0 passed; 1 failed; 0 ignored; 0 measured; 128 filtered out; finished in 0.13s
  648. 56.28 s gammaloop-nextest-docs>
  649. 56.28 s gammaloop-nextest-docs> stderr ---
  650. 56.28 s gammaloop-nextest-docs>
  651. 56.28 s gammaloop-nextest-docs> thread 'provenance_tests::each_build_captures_one_revision_before_rendering' (250) panicked at crates/alphal00p-docs-builder/src/provenance_tests.rs:297:14:
  652. 56.28 s gammaloop-nextest-docs> called `Result::unwrap()` on an `Err` value: required documentation source is missing: /build/source/target/nix-ci-tmp/.tmpH2EaaK/checkout/crates/spynso3/typst/STIXTwoMath-Regular.woff2
  653. 56.28 s gammaloop-nextest-docs>
  654. 56.28 s gammaloop-nextest-docs> Location:
  655. 56.28 s gammaloop-nextest-docs> crates/alphal00p-docs-builder/src/lib.rs:5103:9
  656. 56.28 s gammaloop-nextest-docs> stack backtrace:
  657. 56.28 s gammaloop-nextest-docs> 0: __rustc::rust_begin_unwind
  658. 56.28 s gammaloop-nextest-docs> 1: core::panicking::panic_fmt
  659. 56.28 s gammaloop-nextest-docs> 2: core::result::unwrap_failed
  660. 56.28 s gammaloop-nextest-docs> 3: alphal00p_docs_builder::provenance_tests::each_build_captures_one_revision_before_rendering
  661. 56.28 s gammaloop-nextest-docs> 4: <alphal00p_docs_builder::provenance_tests::each_build_captures_one_revision_before_rendering::{closure#0} as core::ops::function::FnOnce<()>>::call_once
  662. 56.28 s gammaloop-nextest-docs> note: Some details are omitted, run with `RUST_BACKTRACE=full` for a verbose backtrace.
  663. 56.28 s gammaloop-nextest-docs>
  664. 56.28 s gammaloop-nextest-docs> thread 'provenance_tests::each_build_captures_one_revision_before_rendering' (192) panicked at crates/alphal00p-docs-builder/src/provenance_tests.rs:274:9:
  665. 56.28 s gammaloop-nextest-docs> assertion failed: command.status().unwrap().success()
  666. 56.28 s gammaloop-nextest-docs> stack backtrace:
  667. 56.28 s gammaloop-nextest-docs> 0: __rustc::rust_begin_unwind
  668. 56.28 s gammaloop-nextest-docs> 1: core::panicking::panic_fmt
  669. 56.28 s gammaloop-nextest-docs> 2: core::panicking::panic
  670. 56.28 s gammaloop-nextest-docs> 3: alphal00p_docs_builder::provenance_tests::each_build_captures_one_revision_before_rendering
  671. 56.28 s gammaloop-nextest-docs> 4: <alphal00p_docs_builder::provenance_tests::each_build_captures_one_revision_before_rendering::{closure#0} as core::ops::function::FnOnce<()>>::call_once
  672. 56.28 s gammaloop-nextest-docs> note: Some details are omitted, run with `RUST_BACKTRACE=full` for a verbose backtrace.
  673. 56.28 s gammaloop-nextest-docs>
  674. 56.28 s gammaloop-nextest-docs> FAIL [ 0.122s] ( 95/129) alphal00p-docs-builder tests::developer_scope_ranges_ignore_unrelated_edits_and_warn_only_while_watching
  675. 56.28 s gammaloop-nextest-docs> stdout ---
  676. 56.28 s gammaloop-nextest-docs>
  677. 56.28 s gammaloop-nextest-docs> running 1 test
  678. 56.28 s gammaloop-nextest-docs> test tests::developer_scope_ranges_ignore_unrelated_edits_and_warn_only_while_watching ... FAILED
  679. 56.28 s gammaloop-nextest-docs>
  680. 56.28 s gammaloop-nextest-docs> failures:
  681. 56.28 s gammaloop-nextest-docs>
  682. 56.28 s gammaloop-nextest-docs> failures:
  683. 56.28 s gammaloop-nextest-docs> tests::developer_scope_ranges_ignore_unrelated_edits_and_warn_only_while_watching
  684. 56.28 s gammaloop-nextest-docs>
  685. 56.28 s gammaloop-nextest-docs> test result: FAILED. 0 passed; 1 failed; 0 ignored; 0 measured; 128 filtered out; finished in 0.12s
  686. 56.28 s gammaloop-nextest-docs>
  687. 56.28 s gammaloop-nextest-docs> stderr ---
  688. 56.28 s gammaloop-nextest-docs>
  689. 56.28 s gammaloop-nextest-docs> thread 'tests::developer_scope_ranges_ignore_unrelated_edits_and_warn_only_while_watching' (285) panicked at crates/alphal00p-docs-builder/src/lib.rs:12350:29:
  690. 56.28 s gammaloop-nextest-docs> called `Result::unwrap()` on an `Err` value: required documentation source is missing: /build/source/crates/spynso3/typst/STIXTwoMath-Regular.woff2
  691. 56.28 s gammaloop-nextest-docs>
  692. 56.28 s gammaloop-nextest-docs> Location:
  693. 56.28 s gammaloop-nextest-docs> crates/alphal00p-docs-builder/src/lib.rs:5103:9
  694. 56.28 s gammaloop-nextest-docs> stack backtrace:
  695. 56.28 s gammaloop-nextest-docs> 0: __rustc::rust_begin_unwind
  696. 56.28 s gammaloop-nextest-docs> 1: core::panicking::panic_fmt
  697. 56.28 s gammaloop-nextest-docs> 2: core::result::unwrap_failed
  698. 56.28 s gammaloop-nextest-docs> 3: alphal00p_docs_builder::tests::developer_scope_ranges_ignore_unrelated_edits_and_warn_only_while_watching
  699. 56.28 s gammaloop-nextest-docs> 4: <alphal00p_docs_builder::tests::developer_scope_ranges_ignore_unrelated_edits_and_warn_only_while_watching::{closure#0} as core::ops::function::FnOnce<()>>::call_once
  700. 56.28 s gammaloop-nextest-docs> note: Some details are omitted, run with `RUST_BACKTRACE=full` for a verbose backtrace.
  701. 56.28 s gammaloop-nextest-docs>
  702. 56.28 s gammaloop-nextest-docs> FAIL [ 0.123s] (106/129) alphal00p-docs-builder tests::every_product_requires_a_task_chooser_and_each_supported_interface
  703. 56.28 s gammaloop-nextest-docs> stdout ---
  704. 56.28 s gammaloop-nextest-docs>
  705. 56.28 s gammaloop-nextest-docs> running 1 test
  706. 56.28 s gammaloop-nextest-docs> test tests::every_product_requires_a_task_chooser_and_each_supported_interface ... FAILED
  707. 56.28 s gammaloop-nextest-docs>
  708. 56.28 s gammaloop-nextest-docs> failures:
  709. 56.28 s gammaloop-nextest-docs>
  710. 56.28 s gammaloop-nextest-docs> failures:
  711. 56.28 s gammaloop-nextest-docs> tests::every_product_requires_a_task_chooser_and_each_supported_interface
  712. 56.28 s gammaloop-nextest-docs>
  713. 56.28 s gammaloop-nextest-docs> test result: FAILED. 0 passed; 1 failed; 0 ignored; 0 measured; 128 filtered out; finished in 0.12s
  714. 56.28 s gammaloop-nextest-docs>
  715. 56.28 s gammaloop-nextest-docs> stderr ---
  716. 56.28 s gammaloop-nextest-docs>
  717. 56.28 s gammaloop-nextest-docs> thread 'tests::every_product_requires_a_task_chooser_and_each_supported_interface' (312) panicked at crates/alphal00p-docs-builder/src/lib.rs:12274:9:
  718. 56.28 s gammaloop-nextest-docs> assertion failed: format!("{error:#}").contains("has no quickstart page")
  719. 56.28 s gammaloop-nextest-docs> stack backtrace:
  720. 56.28 s gammaloop-nextest-docs> 0: __rustc::rust_begin_unwind
  721. 56.28 s gammaloop-nextest-docs> 1: core::panicking::panic_fmt
  722. 56.28 s gammaloop-nextest-docs> 2: core::panicking::panic
  723. 56.28 s gammaloop-nextest-docs> 3: alphal00p_docs_builder::tests::every_product_requires_a_task_chooser_and_each_supported_interface
  724. 56.28 s gammaloop-nextest-docs> 4: <alphal00p_docs_builder::tests::every_product_requires_a_task_chooser_and_each_supported_interface::{closure#0} as core::ops::function::FnOnce<()>>::call_once
  725. 56.28 s gammaloop-nextest-docs> note: Some details are omitted, run with `RUST_BACKTRACE=full` for a verbose backtrace.
  726. 56.28 s gammaloop-nextest-docs>
  727. 56.28 s gammaloop-nextest-docs> FAIL [ 0.110s] (122/129) alphal00p-docs-builder tests::pdf_manual_chapter_order_must_match_the_page_registry
  728. 56.28 s gammaloop-nextest-docs> stdout ---
  729. 56.28 s gammaloop-nextest-docs>
  730. 56.28 s gammaloop-nextest-docs> running 1 test
  731. 56.28 s gammaloop-nextest-docs> test tests::pdf_manual_chapter_order_must_match_the_page_registry ... FAILED
  732. 56.28 s gammaloop-nextest-docs>
  733. 56.28 s gammaloop-nextest-docs> failures:
  734. 56.28 s gammaloop-nextest-docs>
  735. 56.28 s gammaloop-nextest-docs> failures:
  736. 56.28 s gammaloop-nextest-docs> tests::pdf_manual_chapter_order_must_match_the_page_registry
  737. 56.28 s gammaloop-nextest-docs>
  738. 56.28 s gammaloop-nextest-docs> test result: FAILED. 0 passed; 1 failed; 0 ignored; 0 measured; 128 filtered out; finished in 0.11s
  739. 56.28 s gammaloop-nextest-docs>
  740. 56.28 s gammaloop-nextest-docs> stderr ---
  741. 56.28 s gammaloop-nextest-docs>
  742. 56.28 s gammaloop-nextest-docs> thread 'tests::pdf_manual_chapter_order_must_match_the_page_registry' (393) panicked at crates/alphal00p-docs-builder/src/lib.rs:12330:9:
  743. 56.28 s gammaloop-nextest-docs> assertion failed: format!("{error:#}").contains("PDF manual chapter order differs")
  744. 56.28 s gammaloop-nextest-docs> stack backtrace:
  745. 56.28 s gammaloop-nextest-docs> 0: __rustc::rust_begin_unwind
  746. 56.28 s gammaloop-nextest-docs> 1: core::panicking::panic_fmt
  747. 56.28 s gammaloop-nextest-docs> 2: core::panicking::panic
  748. 56.28 s gammaloop-nextest-docs> 3: alphal00p_docs_builder::tests::pdf_manual_chapter_order_must_match_the_page_registry
  749. 56.28 s gammaloop-nextest-docs> 4: <alphal00p_docs_builder::tests::pdf_manual_chapter_order_must_match_the_page_registry::{closure#0} as core::ops::function::FnOnce<()>>::call_once
  750. 56.28 s gammaloop-nextest-docs> note: Some details are omitted, run with `RUST_BACKTRACE=full` for a verbose backtrace.
  751. 56.28 s gammaloop-nextest-docs>
  752. 56.28 s gammaloop-nextest-docs> error: test run failed
  753. 56.31 s gammaloop-nextest-docs>
  754. 56.31 s gammaloop-nextest-docs> ========== nextest test summary ==========
  755. 56.31 s gammaloop-nextest-docs> report: target/nextest/ci_gammaloop/junit.xml
  756. 56.31 s gammaloop-nextest-docs> tests: 129, failures: 11, errors: 0
  757. 56.31 s gammaloop-nextest-docs>
  758. 56.31 s gammaloop-nextest-docs> 1. alphal00p-docs-builder::tests::developer_architecture_is_classified_searchable_and_source_backed
  759. 56.31 s gammaloop-nextest-docs> failure: test failure with exit code 101
  760. 56.31 s gammaloop-nextest-docs> thread 'tests::developer_architecture_is_classified_searchable_and_source_backed' (296) panicked at crates/alphal00p-docs-builder/src/lib.rs:12751:14:
  761. 56.31 s gammaloop-nextest-docs> called `Result::unwrap()` on an `Err` value: failed to copy documentation asset crates/spynso3/typst/STIXTwoMath-Regular.woff2
  762. 56.31 s gammaloop-nextest-docs>
  763. 56.31 s gammaloop-nextest-docs> Caused by:
  764. 56.31 s gammaloop-nextest-docs> No such file or directory (os error 2)
  765. 56.31 s gammaloop-nextest-docs>
  766. 56.31 s gammaloop-nextest-docs> Location:
  767. 56.31 s gammaloop-nextest-docs> crates/alphal00p-docs-builder/src/lib.rs:2276:18
  768. 56.31 s gammaloop-nextest-docs> stack backtrace:
  769. 56.31 s gammaloop-nextest-docs> 0: __rustc::rust_begin_unwind
  770. 56.31 s gammaloop-nextest-docs> 1: core::panicking::panic_fmt
  771. 56.31 s gammaloop-nextest-docs> 2: core::result::unwrap_failed
  772. 56.31 s gammaloop-nextest-docs> 3: alphal00p_docs_builder::tests::developer_architecture_is_classified_searchable_and_source_backed
  773. 56.31 s gammaloop-nextest-docs> 4: <alphal00p_docs_builder::tests::developer_architecture_is_classified_searchable_and_source_backed::{closure#0} as core::ops::function::FnOnce<()>>::call_once
  774. 56.31 s gammaloop-nextest-docs> note: Some details are omitted, run with `RUST_BACKTRACE=full` for a verbose backtrace.
  775. 56.31 s gammaloop-nextest-docs> system-out
  776. 56.31 s gammaloop-nextest-docs> running 1 test
  777. 56.31 s gammaloop-nextest-docs> test tests::developer_architecture_is_classified_searchable_and_source_backed ... FAILED
  778. 56.31 s gammaloop-nextest-docs>
  779. 56.31 s gammaloop-nextest-docs> failures:
  780. 56.31 s gammaloop-nextest-docs>
  781. 56.31 s gammaloop-nextest-docs> failures:
  782. 56.31 s gammaloop-nextest-docs> tests::developer_architecture_is_classified_searchable_and_source_backed
  783. 56.31 s gammaloop-nextest-docs>
  784. 56.31 s gammaloop-nextest-docs> test result: FAILED. 0 passed; 1 failed; 0 ignored; 0 measured; 128 filtered out; finished in 0.01s
  785. 56.31 s gammaloop-nextest-docs> system-err
  786. 56.31 s gammaloop-nextest-docs> thread 'tests::developer_architecture_is_classified_searchable_and_source_backed' (296) panicked at crates/alphal00p-docs-builder/src/lib.rs:12751:14:
  787. 56.31 s gammaloop-nextest-docs> called `Result::unwrap()` on an `Err` value: failed to copy documentation asset crates/spynso3/typst/STIXTwoMath-Regular.woff2
  788. 56.31 s gammaloop-nextest-docs>
  789. 56.31 s gammaloop-nextest-docs> Caused by:
  790. 56.31 s gammaloop-nextest-docs> No such file or directory (os error 2)
  791. 56.31 s gammaloop-nextest-docs>
  792. 56.31 s gammaloop-nextest-docs> Location:
  793. 56.31 s gammaloop-nextest-docs> crates/alphal00p-docs-builder/src/lib.rs:2276:18
  794. 56.31 s gammaloop-nextest-docs> stack backtrace:
  795. 56.31 s gammaloop-nextest-docs> 0: __rustc::rust_begin_unwind
  796. 56.31 s gammaloop-nextest-docs> 1: core::panicking::panic_fmt
  797. 56.31 s gammaloop-nextest-docs> 2: core::result::unwrap_failed
  798. 56.31 s gammaloop-nextest-docs> 3: alphal00p_docs_builder::tests::developer_architecture_is_classified_searchable_and_source_backed
  799. 56.31 s gammaloop-nextest-docs> 4: <alphal00p_docs_builder::tests::developer_architecture_is_classified_searchable_and_source_backed::{closure#0} as core::ops::function::FnOnce<()>>::call_once
  800. 56.31 s gammaloop-nextest-docs> note: Some details are omitted, run with `RUST_BACKTRACE=full` for a verbose backtrace.
  801. 56.31 s gammaloop-nextest-docs>
  802. 56.31 s gammaloop-nextest-docs> 2. alphal00p-docs-builder::tests::every_product_orients_rust_to_native_rustdoc_and_keeps_legacy_redirects
  803. 56.31 s gammaloop-nextest-docs> failure: test failure with exit code 101
  804. 56.31 s gammaloop-nextest-docs> thread 'tests::every_product_orients_rust_to_native_rustdoc_and_keeps_legacy_redirects' (307) panicked at crates/alphal00p-docs-builder/src/lib.rs:12555:46:
  805. 56.31 s gammaloop-nextest-docs> called `Result::unwrap()` on an `Err` value: failed to copy documentation asset crates/spynso3/typst/STIXTwoMath-Regular.woff2
  806. 56.31 s gammaloop-nextest-docs>
  807. 56.31 s gammaloop-nextest-docs> Caused by:
  808. 56.31 s gammaloop-nextest-docs> No such file or directory (os error 2)
  809. 56.31 s gammaloop-nextest-docs>
  810. 56.31 s gammaloop-nextest-docs> Location:
  811. 56.31 s gammaloop-nextest-docs> crates/alphal00p-docs-builder/src/lib.rs:2276:18
  812. 56.31 s gammaloop-nextest-docs> stack backtrace:
  813. 56.31 s gammaloop-nextest-docs> 0: __rustc::rust_begin_unwind
  814. 56.31 s gammaloop-nextest-docs> 1: core::panicking::panic_fmt
  815. 56.31 s gammaloop-nextest-docs> 2: core::result::unwrap_failed
  816. 56.31 s gammaloop-nextest-docs> 3: alphal00p_docs_builder::tests::every_product_orients_rust_to_native_rustdoc_and_keeps_legacy_redirects
  817. 56.31 s gammaloop-nextest-docs> 4: <alphal00p_docs_builder::tests::every_product_orients_rust_to_native_rustdoc_and_keeps_legacy_redirects::{closure#0} as core::ops::function::FnOnce<()>>::call_once
  818. 56.31 s gammaloop-nextest-docs> note: Some details are omitted, run with `RUST_BACKTRACE=full` for a verbose backtrace.
  819. 56.31 s gammaloop-nextest-docs> system-out
  820. 56.31 s gammaloop-nextest-docs> running 1 test
  821. 56.31 s gammaloop-nextest-docs> test tests::every_product_orients_rust_to_native_rustdoc_and_keeps_legacy_redirects ... FAILED
  822. 56.31 s gammaloop-nextest-docs>
  823. 56.31 s gammaloop-nextest-docs> failures:
  824. 56.31 s gammaloop-nextest-docs>
  825. 56.31 s gammaloop-nextest-docs> failures:
  826. 56.31 s gammaloop-nextest-docs> tests::every_product_orients_rust_to_native_rustdoc_and_keeps_legacy_redirects
  827. 56.31 s gammaloop-nextest-docs>
  828. 56.31 s gammaloop-nextest-docs> test result: FAILED. 0 passed; 1 failed; 0 ignored; 0 measured; 128 filtered out; finished in 0.01s
  829. 56.31 s gammaloop-nextest-docs> system-err
  830. 56.31 s gammaloop-nextest-docs> thread 'tests::every_product_orients_rust_to_native_rustdoc_and_keeps_legacy_redirects' (307) panicked at crates/alphal00p-docs-builder/src/lib.rs:12555:46:
  831. 56.31 s gammaloop-nextest-docs> called `Result::unwrap()` on an `Err` value: failed to copy documentation asset crates/spynso3/typst/STIXTwoMath-Regular.woff2
  832. 56.31 s gammaloop-nextest-docs>
  833. 56.31 s gammaloop-nextest-docs> Caused by:
  834. 56.31 s gammaloop-nextest-docs> No such file or directory (os error 2)
  835. 56.31 s gammaloop-nextest-docs>
  836. 56.31 s gammaloop-nextest-docs> Location:
  837. 56.31 s gammaloop-nextest-docs> crates/alphal00p-docs-builder/src/lib.rs:2276:18
  838. 56.31 s gammaloop-nextest-docs> stack backtrace:
  839. 56.31 s gammaloop-nextest-docs> 0: __rustc::rust_begin_unwind
  840. 56.31 s gammaloop-nextest-docs> 1: core::panicking::panic_fmt
  841. 56.31 s gammaloop-nextest-docs> 2: core::result::unwrap_failed
  842. 56.31 s gammaloop-nextest-docs> 3: alphal00p_docs_builder::tests::every_product_orients_rust_to_native_rustdoc_and_keeps_legacy_redirects
  843. 56.31 s gammaloop-nextest-docs> 4: <alphal00p_docs_builder::tests::every_product_orients_rust_to_native_rustdoc_and_keeps_legacy_redirects::{closure#0} as core::ops::function::FnOnce<()>>::call_once
  844. 56.31 s gammaloop-nextest-docs> note: Some details are omitted, run with `RUST_BACKTRACE=full` for a verbose backtrace.
  845. 56.31 s gammaloop-nextest-docs>
  846. 56.31 s gammaloop-nextest-docs> 3. alphal00p-docs-builder::tests::portal_and_developer_pages_use_federated_search_and_feedback
  847. 56.31 s gammaloop-nextest-docs> failure: test failure with exit code 101
  848. 56.31 s gammaloop-nextest-docs> thread 'tests::portal_and_developer_pages_use_federated_search_and_feedback' (420) panicked at crates/alphal00p-docs-builder/src/lib.rs:9684:14:
  849. 56.31 s gammaloop-nextest-docs> called `Result::unwrap()` on an `Err` value: failed to copy documentation asset crates/spynso3/typst/STIXTwoMath-Regular.woff2
  850. 56.31 s gammaloop-nextest-docs>
  851. 56.31 s gammaloop-nextest-docs> Caused by:
  852. 56.31 s gammaloop-nextest-docs> No such file or directory (os error 2)
  853. 56.31 s gammaloop-nextest-docs>
  854. 56.31 s gammaloop-nextest-docs> Location:
  855. 56.31 s gammaloop-nextest-docs> crates/alphal00p-docs-builder/src/lib.rs:2276:18
  856. 56.31 s gammaloop-nextest-docs> stack backtrace:
  857. 56.31 s gammaloop-nextest-docs> 0: __rustc::rust_begin_unwind
  858. 56.31 s gammaloop-nextest-docs> 1: core::panicking::panic_fmt
  859. 56.31 s gammaloop-nextest-docs> 2: core::result::unwrap_failed
  860. 56.31 s gammaloop-nextest-docs> 3: alphal00p_docs_builder::tests::write_test_portal
  861. 56.31 s gammaloop-nextest-docs> 4: alphal00p_docs_builder::tests::portal_and_developer_pages_use_federated_search_and_feedback
  862. 56.31 s gammaloop-nextest-docs> 5: <alphal00p_docs_builder::tests::portal_and_developer_pages_use_federated_search_and_feedback::{closure#0} as core::ops::function::FnOnce<()>>::call_once
  863. 56.31 s gammaloop-nextest-docs> note: Some details are omitted, run with `RUST_BACKTRACE=full` for a verbose backtrace.
  864. 56.31 s gammaloop-nextest-docs> system-out
  865. 56.31 s gammaloop-nextest-docs> running 1 test
  866. 56.31 s gammaloop-nextest-docs> test tests::portal_and_developer_pages_use_federated_search_and_feedback ... FAILED
  867. 56.31 s gammaloop-nextest-docs>
  868. 56.31 s gammaloop-nextest-docs> failures:
  869. 56.31 s gammaloop-nextest-docs>
  870. 56.31 s gammaloop-nextest-docs> failures:
  871. 56.31 s gammaloop-nextest-docs> tests::portal_and_developer_pages_use_federated_search_and_feedback
  872. 56.31 s gammaloop-nextest-docs>
  873. 56.31 s gammaloop-nextest-docs> test result: FAILED. 0 passed; 1 failed; 0 ignored; 0 measured; 128 filtered out; finished in 0.01s
  874. 56.31 s gammaloop-nextest-docs> system-err
  875. 56.31 s gammaloop-nextest-docs> thread 'tests::portal_and_developer_pages_use_federated_search_and_feedback' (420) panicked at crates/alphal00p-docs-builder/src/lib.rs:9684:14:
  876. 56.31 s gammaloop-nextest-docs> called `Result::unwrap()` on an `Err` value: failed to copy documentation asset crates/spynso3/typst/STIXTwoMath-Regular.woff2
  877. 56.31 s gammaloop-nextest-docs>
  878. 56.31 s gammaloop-nextest-docs> Caused by:
  879. 56.31 s gammaloop-nextest-docs> No such file or directory (os error 2)
  880. 56.31 s gammaloop-nextest-docs>
  881. 56.31 s gammaloop-nextest-docs> Location:
  882. 56.31 s gammaloop-nextest-docs> crates/alphal00p-docs-builder/src/lib.rs:2276:18
  883. 56.31 s gammaloop-nextest-docs> stack backtrace:
  884. 56.31 s gammaloop-nextest-docs> 0: __rustc::rust_begin_unwind
  885. 56.31 s gammaloop-nextest-docs> 1: core::panicking::panic_fmt
  886. 56.31 s gammaloop-nextest-docs> 2: core::result::unwrap_failed
  887. 56.31 s gammaloop-nextest-docs> 3: alphal00p_docs_builder::tests::write_test_portal
  888. 56.31 s gammaloop-nextest-docs> 4: alphal00p_docs_builder::tests::portal_and_developer_pages_use_federated_search_and_feedback
  889. 56.31 s gammaloop-nextest-docs> 5: <alphal00p_docs_builder::tests::portal_and_developer_pages_use_federated_search_and_feedback::{closure#0} as core::ops::function::FnOnce<()>>::call_once
  890. 56.31 s gammaloop-nextest-docs> note: Some details are omitted, run with `RUST_BACKTRACE=full` for a verbose backtrace.
  891. 56.31 s gammaloop-nextest-docs>
  892. 56.31 s gammaloop-nextest-docs> 4. alphal00p-docs-builder::tests::portal_emits_routes_and_valid_assets
  893. 56.31 s gammaloop-nextest-docs> failure: test failure with exit code 101
  894. 56.31 s gammaloop-nextest-docs> thread 'tests::portal_emits_routes_and_valid_assets' (431) panicked at crates/alphal00p-docs-builder/src/lib.rs:9684:14:
  895. 56.31 s gammaloop-nextest-docs> called `Result::unwrap()` on an `Err` value: failed to copy documentation asset crates/spynso3/typst/STIXTwoMath-Regular.woff2
  896. 56.31 s gammaloop-nextest-docs>
  897. 56.31 s gammaloop-nextest-docs> Caused by:
  898. 56.31 s gammaloop-nextest-docs> No such file or directory (os error 2)
  899. 56.31 s gammaloop-nextest-docs>
  900. 56.31 s gammaloop-nextest-docs> Location:
  901. 56.31 s gammaloop-nextest-docs> crates/alphal00p-docs-builder/src/lib.rs:2276:18
  902. 56.31 s gammaloop-nextest-docs> stack backtrace:
  903. 56.31 s gammaloop-nextest-docs> 0: __rustc::rust_begin_unwind
  904. 56.31 s gammaloop-nextest-docs> 1: core::panicking::panic_fmt
  905. 56.31 s gammaloop-nextest-docs> 2: core::result::unwrap_failed
  906. 56.31 s gammaloop-nextest-docs> 3: alphal00p_docs_builder::tests::write_test_portal
  907. 56.31 s gammaloop-nextest-docs> 4: alphal00p_docs_builder::tests::portal_emits_routes_and_valid_assets
  908. 56.31 s gammaloop-nextest-docs> 5: <alphal00p_docs_builder::tests::portal_emits_routes_and_valid_assets::{closure#0} as core::ops::function::FnOnce<()>>::call_once
  909. 56.31 s gammaloop-nextest-docs> note: Some details are omitted, run with `RUST_BACKTRACE=full` for a verbose backtrace.
  910. 56.31 s gammaloop-nextest-docs> system-out
  911. 56.31 s gammaloop-nextest-docs> running 1 test
  912. 56.31 s gammaloop-nextest-docs> test tests::portal_emits_routes_and_valid_assets ... FAILED
  913. 56.31 s gammaloop-nextest-docs>
  914. 56.31 s gammaloop-nextest-docs> failures:
  915. 56.31 s gammaloop-nextest-docs>
  916. 56.31 s gammaloop-nextest-docs> failures:
  917. 56.31 s gammaloop-nextest-docs> tests::portal_emits_routes_and_valid_assets
  918. 56.31 s gammaloop-nextest-docs>
  919. 56.31 s gammaloop-nextest-docs> test result: FAILED. 0 passed; 1 failed; 0 ignored; 0 measured; 128 filtered out; finished in 0.01s
  920. 56.31 s gammaloop-nextest-docs> system-err
  921. 56.31 s gammaloop-nextest-docs> thread 'tests::portal_emits_routes_and_valid_assets' (431) panicked at crates/alphal00p-docs-builder/src/lib.rs:9684:14:
  922. 56.31 s gammaloop-nextest-docs> called `Result::unwrap()` on an `Err` value: failed to copy documentation asset crates/spynso3/typst/STIXTwoMath-Regular.woff2
  923. 56.31 s gammaloop-nextest-docs>
  924. 56.31 s gammaloop-nextest-docs> Caused by:
  925. 56.31 s gammaloop-nextest-docs> No such file or directory (os error 2)
  926. 56.31 s gammaloop-nextest-docs>
  927. 56.31 s gammaloop-nextest-docs> Location:
  928. 56.31 s gammaloop-nextest-docs> crates/alphal00p-docs-builder/src/lib.rs:2276:18
  929. 56.31 s gammaloop-nextest-docs> stack backtrace:
  930. 56.31 s gammaloop-nextest-docs> 0: __rustc::rust_begin_unwind
  931. 56.31 s gammaloop-nextest-docs> 1: core::panicking::panic_fmt
  932. 56.31 s gammaloop-nextest-docs> 2: core::result::unwrap_failed
  933. 56.31 s gammaloop-nextest-docs> 3: alphal00p_docs_builder::tests::write_test_portal
  934. 56.31 s gammaloop-nextest-docs> 4: alphal00p_docs_builder::tests::portal_emits_routes_and_valid_assets
  935. 56.31 s gammaloop-nextest-docs> 5: <alphal00p_docs_builder::tests::portal_emits_routes_and_valid_assets::{closure#0} as core::ops::function::FnOnce<()>>::call_once
  936. 56.31 s gammaloop-nextest-docs> note: Some details are omitted, run with `RUST_BACKTRACE=full` for a verbose backtrace.
  937. 56.31 s gammaloop-nextest-docs>
  938. 56.31 s gammaloop-nextest-docs> 5. alphal00p-docs-builder::tests::portal_task_chooser_routes_each_goal_to_the_registered_quickstart
  939. 56.31 s gammaloop-nextest-docs> failure: test failure with exit code 101
  940. 56.31 s gammaloop-nextest-docs> thread 'tests::portal_task_chooser_routes_each_goal_to_the_registered_quickstart' (439) panicked at crates/alphal00p-docs-builder/src/lib.rs:9684:14:
  941. 56.31 s gammaloop-nextest-docs> called `Result::unwrap()` on an `Err` value: failed to copy documentation asset crates/spynso3/typst/STIXTwoMath-Regular.woff2
  942. 56.31 s gammaloop-nextest-docs>
  943. 56.31 s gammaloop-nextest-docs> Caused by:
  944. 56.31 s gammaloop-nextest-docs> No such file or directory (os error 2)
  945. 56.31 s gammaloop-nextest-docs>
  946. 56.31 s gammaloop-nextest-docs> Location:
  947. 56.31 s gammaloop-nextest-docs> crates/alphal00p-docs-builder/src/lib.rs:2276:18
  948. 56.31 s gammaloop-nextest-docs> stack backtrace:
  949. 56.31 s gammaloop-nextest-docs> 0: __rustc::rust_begin_unwind
  950. 56.31 s gammaloop-nextest-docs> 1: core::panicking::panic_fmt
  951. 56.31 s gammaloop-nextest-docs> 2: core::result::unwrap_failed
  952. 56.31 s gammaloop-nextest-docs> 3: alphal00p_docs_builder::tests::write_test_portal
  953. 56.31 s gammaloop-nextest-docs> 4: alphal00p_docs_builder::tests::portal_task_chooser_routes_each_goal_to_the_registered_quickstart
  954. 56.31 s gammaloop-nextest-docs> 5: <alphal00p_docs_builder::tests::portal_task_chooser_routes_each_goal_to_the_registered_quickstart::{closure#0} as core::ops::function::FnOnce<()>>::call_once
  955. 56.31 s gammaloop-nextest-docs> note: Some details are omitted, run with `RUST_BACKTRACE=full` for a verbose backtrace.
  956. 56.31 s gammaloop-nextest-docs> system-out
  957. 56.31 s gammaloop-nextest-docs> running 1 test
  958. 56.31 s gammaloop-nextest-docs> test tests::portal_task_chooser_routes_each_goal_to_the_registered_quickstart ... FAILED
  959. 56.31 s gammaloop-nextest-docs>
  960. 56.31 s gammaloop-nextest-docs> failures:
  961. 56.31 s gammaloop-nextest-docs>
  962. 56.31 s gammaloop-nextest-docs> failures:
  963. 56.31 s gammaloop-nextest-docs> tests::portal_task_chooser_routes_each_goal_to_the_registered_quickstart
  964. 56.31 s gammaloop-nextest-docs>
  965. 56.31 s gammaloop-nextest-docs> test result: FAILED. 0 passed; 1 failed; 0 ignored; 0 measured; 128 filtered out; finished in 0.01s
  966. 56.31 s gammaloop-nextest-docs> system-err
  967. 56.31 s gammaloop-nextest-docs> thread 'tests::portal_task_chooser_routes_each_goal_to_the_registered_quickstart' (439) panicked at crates/alphal00p-docs-builder/src/lib.rs:9684:14:
  968. 56.31 s gammaloop-nextest-docs> called `Result::unwrap()` on an `Err` value: failed to copy documentation asset crates/spynso3/typst/STIXTwoMath-Regular.woff2
  969. 56.31 s gammaloop-nextest-docs>
  970. 56.31 s gammaloop-nextest-docs> Caused by:
  971. 56.31 s gammaloop-nextest-docs> No such file or directory (os error 2)
  972. 56.31 s gammaloop-nextest-docs>
  973. 56.31 s gammaloop-nextest-docs> Location:
  974. 56.31 s gammaloop-nextest-docs> crates/alphal00p-docs-builder/src/lib.rs:2276:18
  975. 56.31 s gammaloop-nextest-docs> stack backtrace:
  976. 56.31 s gammaloop-nextest-docs> 0: __rustc::rust_begin_unwind
  977. 56.31 s gammaloop-nextest-docs> 1: core::panicking::panic_fmt
  978. 56.31 s gammaloop-nextest-docs> 2: core::result::unwrap_failed
  979. 56.31 s gammaloop-nextest-docs> 3: alphal00p_docs_builder::tests::write_test_portal
  980. 56.31 s gammaloop-nextest-docs> 4: alphal00p_docs_builder::tests::portal_task_chooser_routes_each_goal_to_the_registered_quickstart
  981. 56.31 s gammaloop-nextest-docs> 5: <alphal00p_docs_builder::tests::portal_task_chooser_routes_each_goal_to_the_registered_quickstart::{closure#0} as core::ops::function::FnOnce<()>>::call_once
  982. 56.31 s gammaloop-nextest-docs> note: Some details are omitted, run with `RUST_BACKTRACE=full` for a verbose backtrace.
  983. 56.31 s gammaloop-nextest-docs>
  984. 56.31 s gammaloop-nextest-docs> 6. alphal00p-docs-builder::tests::site_assets_replace_read_only_generated_files
  985. 56.31 s gammaloop-nextest-docs> failure: test failure with exit code 101
  986. 56.31 s gammaloop-nextest-docs> thread 'tests::site_assets_replace_read_only_generated_files' (657) panicked at crates/alphal00p-docs-builder/src/lib.rs:12305:50:
  987. 56.31 s gammaloop-nextest-docs> called `Result::unwrap()` on an `Err` value: failed to copy documentation asset crates/spynso3/typst/STIXTwoMath-Regular.woff2
  988. 56.31 s gammaloop-nextest-docs>
  989. 56.31 s gammaloop-nextest-docs> Caused by:
  990. 56.31 s gammaloop-nextest-docs> No such file or directory (os error 2)
  991. 56.31 s gammaloop-nextest-docs>
  992. 56.31 s gammaloop-nextest-docs> Location:
  993. 56.31 s gammaloop-nextest-docs> crates/alphal00p-docs-builder/src/lib.rs:2276:18
  994. 56.31 s gammaloop-nextest-docs> stack backtrace:
  995. 56.31 s gammaloop-nextest-docs> 0: __rustc::rust_begin_unwind
  996. 56.31 s gammaloop-nextest-docs> 1: core::panicking::panic_fmt
  997. 56.31 s gammaloop-nextest-docs> 2: core::result::unwrap_failed
  998. 56.31 s gammaloop-nextest-docs> 3: alphal00p_docs_builder::tests::site_assets_replace_read_only_generated_files
  999. 56.31 s gammaloop-nextest-docs> 4: <alphal00p_docs_builder::tests::site_assets_replace_read_only_generated_files::{closure#0} as core::ops::function::FnOnce<()>>::call_once
  1000. 56.31 s gammaloop-nextest-docs> note: Some details are omitted, run with `RUST_BACKTRACE=full` for a verbose backtrace.
  1001. 56.31 s gammaloop-nextest-docs> system-out
  1002. 56.31 s gammaloop-nextest-docs> running 1 test
  1003. 56.31 s gammaloop-nextest-docs> test tests::site_assets_replace_read_only_generated_files ... FAILED
  1004. 56.31 s gammaloop-nextest-docs>
  1005. 56.31 s gammaloop-nextest-docs> failures:
  1006. 56.31 s gammaloop-nextest-docs>
  1007. 56.31 s gammaloop-nextest-docs> failures:
  1008. 56.31 s gammaloop-nextest-docs> tests::site_assets_replace_read_only_generated_files
  1009. 56.31 s gammaloop-nextest-docs>
  1010. 56.31 s gammaloop-nextest-docs> test result: FAILED. 0 passed; 1 failed; 0 ignored; 0 measured; 128 filtered out; finished in 0.00s
  1011. 56.31 s gammaloop-nextest-docs> system-err
  1012. 56.31 s gammaloop-nextest-docs> thread 'tests::site_assets_replace_read_only_generated_files' (657) panicked at crates/alphal00p-docs-builder/src/lib.rs:12305:50:
  1013. 56.31 s gammaloop-nextest-docs> called `Result::unwrap()` on an `Err` value: failed to copy documentation asset crates/spynso3/typst/STIXTwoMath-Regular.woff2
  1014. 56.31 s gammaloop-nextest-docs>
  1015. 56.31 s gammaloop-nextest-docs> Caused by:
  1016. 56.31 s gammaloop-nextest-docs> No such file or directory (os error 2)
  1017. 56.31 s gammaloop-nextest-docs>
  1018. 56.31 s gammaloop-nextest-docs> Location:
  1019. 56.31 s gammaloop-nextest-docs> crates/alphal00p-docs-builder/src/lib.rs:2276:18
  1020. 56.31 s gammaloop-nextest-docs> stack backtrace:
  1021. 56.31 s gammaloop-nextest-docs> 0: __rustc::rust_begin_unwind
  1022. 56.31 s gammaloop-nextest-docs> 1: core::panicking::panic_fmt
  1023. 56.31 s gammaloop-nextest-docs> 2: core::result::unwrap_failed
  1024. 56.31 s gammaloop-nextest-docs> 3: alphal00p_docs_builder::tests::site_assets_replace_read_only_generated_files
  1025. 56.31 s gammaloop-nextest-docs> 4: <alphal00p_docs_builder::tests::site_assets_replace_read_only_generated_files::{closure#0} as core::ops::function::FnOnce<()>>::call_once
  1026. 56.31 s gammaloop-nextest-docs> note: Some details are omitted, run with `RUST_BACKTRACE=full` for a verbose backtrace.
  1027. 56.31 s gammaloop-nextest-docs>
  1028. 56.31 s gammaloop-nextest-docs> 7. alphal00p-docs-builder::tests::checked_in_registry_is_valid
  1029. 56.31 s gammaloop-nextest-docs> failure: test failure with exit code 101
  1030. 56.31 s gammaloop-nextest-docs> thread 'tests::checked_in_registry_is_valid' (195) panicked at crates/alphal00p-docs-builder/src/lib.rs:12260:50:
  1031. 56.31 s gammaloop-nextest-docs> called `Result::unwrap()` on an `Err` value: required documentation source is missing: /build/source/crates/spynso3/typst/STIXTwoMath-Regular.woff2
  1032. 56.31 s gammaloop-nextest-docs>
  1033. 56.31 s gammaloop-nextest-docs> Location:
  1034. 56.31 s gammaloop-nextest-docs> crates/alphal00p-docs-builder/src/lib.rs:5103:9
  1035. 56.31 s gammaloop-nextest-docs> stack backtrace:
  1036. 56.31 s gammaloop-nextest-docs> 0: __rustc::rust_begin_unwind
  1037. 56.31 s gammaloop-nextest-docs> 1: core::panicking::panic_fmt
  1038. 56.31 s gammaloop-nextest-docs> 2: core::result::unwrap_failed
  1039. 56.31 s gammaloop-nextest-docs> 3: alphal00p_docs_builder::tests::checked_in_registry_is_valid
  1040. 56.31 s gammaloop-nextest-docs> 4: <alphal00p_docs_builder::tests::checked_in_registry_is_valid::{closure#0} as core::ops::function::FnOnce<()>>::call_once
  1041. 56.31 s gammaloop-nextest-docs> note: Some details are omitted, run with `RUST_BACKTRACE=full` for a verbose backtrace.
  1042. 56.31 s gammaloop-nextest-docs> system-out
  1043. 56.31 s gammaloop-nextest-docs> running 1 test
  1044. 56.31 s gammaloop-nextest-docs> test tests::checked_in_registry_is_valid ... FAILED
  1045. 56.31 s gammaloop-nextest-docs>
  1046. 56.31 s gammaloop-nextest-docs> failures:
  1047. 56.31 s gammaloop-nextest-docs>
  1048. 56.31 s gammaloop-nextest-docs> failures:
  1049. 56.31 s gammaloop-nextest-docs> tests::checked_in_registry_is_valid
  1050. 56.31 s gammaloop-nextest-docs>
  1051. 56.31 s gammaloop-nextest-docs> test result: FAILED. 0 passed; 1 failed; 0 ignored; 0 measured; 128 filtered out; finished in 0.12s
  1052. 56.31 s gammaloop-nextest-docs> system-err
  1053. 56.31 s gammaloop-nextest-docs> thread 'tests::checked_in_registry_is_valid' (195) panicked at crates/alphal00p-docs-builder/src/lib.rs:12260:50:
  1054. 56.31 s gammaloop-nextest-docs> called `Result::unwrap()` on an `Err` value: required documentation source is missing: /build/source/crates/spynso3/typst/STIXTwoMath-Regular.woff2
  1055. 56.31 s gammaloop-nextest-docs>
  1056. 56.31 s gammaloop-nextest-docs> Location:
  1057. 56.31 s gammaloop-nextest-docs> crates/alphal00p-docs-builder/src/lib.rs:5103:9
  1058. 56.31 s gammaloop-nextest-docs> stack backtrace:
  1059. 56.31 s gammaloop-nextest-docs> 0: __rustc::rust_begin_unwind
  1060. 56.31 s gammaloop-nextest-docs> 1: core::panicking::panic_fmt
  1061. 56.31 s gammaloop-nextest-docs> 2: core::result::unwrap_failed
  1062. 56.31 s gammaloop-nextest-docs> 3: alphal00p_docs_builder::tests::checked_in_registry_is_valid
  1063. 56.31 s gammaloop-nextest-docs> 4: <alphal00p_docs_builder::tests::checked_in_registry_is_valid::{closure#0} as core::ops::function::FnOnce<()>>::call_once
  1064. 56.31 s gammaloop-nextest-docs> note: Some details are omitted, run with `RUST_BACKTRACE=full` for a verbose backtrace.
  1065. 56.31 s gammaloop-nextest-docs>
  1066. 56.31 s gammaloop-nextest-docs> 8. alphal00p-docs-builder::provenance_tests::each_build_captures_one_revision_before_rendering
  1067. 56.31 s gammaloop-nextest-docs> failure: test failure with exit code 101
  1068. 56.31 s gammaloop-nextest-docs> thread 'provenance_tests::each_build_captures_one_revision_before_rendering' (192) panicked at crates/alphal00p-docs-builder/src/provenance_tests.rs:274:9:
  1069. 56.31 s gammaloop-nextest-docs> assertion failed: command.status().unwrap().success()
  1070. 56.31 s gammaloop-nextest-docs> stack backtrace:
  1071. 56.31 s gammaloop-nextest-docs> 0: __rustc::rust_begin_unwind
  1072. 56.31 s gammaloop-nextest-docs> 1: core::panicking::panic_fmt
  1073. 56.31 s gammaloop-nextest-docs> 2: core::panicking::panic
  1074. 56.31 s gammaloop-nextest-docs> 3: alphal00p_docs_builder::provenance_tests::each_build_captures_one_revision_before_rendering
  1075. 56.31 s gammaloop-nextest-docs> 4: <alphal00p_docs_builder::provenance_tests::each_build_captures_one_revision_before_rendering::{closure#0} as core::ops::function::FnOnce<()>>::call_once
  1076. 56.31 s gammaloop-nextest-docs> note: Some details are omitted, run with `RUST_BACKTRACE=full` for a verbose backtrace.
  1077. 56.31 s gammaloop-nextest-docs> system-out
  1078. 56.31 s gammaloop-nextest-docs> running 1 test
  1079. 56.31 s gammaloop-nextest-docs>
  1080. 56.31 s gammaloop-nextest-docs> running 1 test
  1081. 56.31 s gammaloop-nextest-docs> test provenance_tests::each_build_captures_one_revision_before_rendering ... FAILED
  1082. 56.31 s gammaloop-nextest-docs>
  1083. 56.31 s gammaloop-nextest-docs> failures:
  1084. 56.31 s gammaloop-nextest-docs>
  1085. 56.31 s gammaloop-nextest-docs> failures:
  1086. 56.31 s gammaloop-nextest-docs> provenance_tests::each_build_captures_one_revision_before_rendering
  1087. 56.31 s gammaloop-nextest-docs>
  1088. 56.31 s gammaloop-nextest-docs> test result: FAILED. 0 passed; 1 failed; 0 ignored; 0 measured; 128 filtered out; finished in 0.12s
  1089. 56.31 s gammaloop-nextest-docs>
  1090. 56.31 s gammaloop-nextest-docs> test provenance_tests::each_build_captures_one_revision_before_rendering ... FAILED
  1091. 56.31 s gammaloop-nextest-docs>
  1092. 56.31 s gammaloop-nextest-docs> failures:
  1093. 56.31 s gammaloop-nextest-docs>
  1094. 56.31 s gammaloop-nextest-docs> failures:
  1095. 56.31 s gammaloop-nextest-docs> provenance_tests::each_build_captures_one_revision_before_rendering
  1096. 56.31 s gammaloop-nextest-docs>
  1097. 56.31 s gammaloop-nextest-docs> test result: FAILED. 0 passed; 1 failed; 0 ignored; 0 measured; 128 filtered out; finished in 0.13s
  1098. 56.31 s gammaloop-nextest-docs> system-err
  1099. 56.31 s gammaloop-nextest-docs> thread 'provenance_tests::each_build_captures_one_revision_before_rendering' (250) panicked at crates/alphal00p-docs-builder/src/provenance_tests.rs:297:14:
  1100. 56.31 s gammaloop-nextest-docs> called `Result::unwrap()` on an `Err` value: required documentation source is missing: /build/source/target/nix-ci-tmp/.tmpH2EaaK/checkout/crates/spynso3/typst/STIXTwoMath-Regular.woff2
  1101. 56.31 s gammaloop-nextest-docs>
  1102. 56.31 s gammaloop-nextest-docs> Location:
  1103. 56.31 s gammaloop-nextest-docs> crates/alphal00p-docs-builder/src/lib.rs:5103:9
  1104. 56.31 s gammaloop-nextest-docs> stack backtrace:
  1105. 56.31 s gammaloop-nextest-docs> 0: __rustc::rust_begin_unwind
  1106. 56.31 s gammaloop-nextest-docs> 1: core::panicking::panic_fmt
  1107. 56.31 s gammaloop-nextest-docs> 2: core::result::unwrap_failed
  1108. 56.31 s gammaloop-nextest-docs> 3: alphal00p_docs_builder::provenance_tests::each_build_captures_one_revision_before_rendering
  1109. 56.31 s gammaloop-nextest-docs> 4: <alphal00p_docs_builder::provenance_tests::each_build_captures_one_revision_before_rendering::{closure#0} as core::ops::function::FnOnce<()>>::call_once
  1110. 56.31 s gammaloop-nextest-docs> note: Some details are omitted, run with `RUST_BACKTRACE=full` for a verbose backtrace.
  1111. 56.31 s gammaloop-nextest-docs>
  1112. 56.31 s gammaloop-nextest-docs> thread 'provenance_tests::each_build_captures_one_revision_before_rendering' (192) panicked at crates/alphal00p-docs-builder/src/provenance_tests.rs:274:9:
  1113. 56.31 s gammaloop-nextest-docs> assertion failed: command.status().unwrap().success()
  1114. 56.31 s gammaloop-nextest-docs> stack backtrace:
  1115. 56.31 s gammaloop-nextest-docs> 0: __rustc::rust_begin_unwind
  1116. 56.31 s gammaloop-nextest-docs> 1: core::panicking::panic_fmt
  1117. 56.31 s gammaloop-nextest-docs> 2: core::panicking::panic
  1118. 56.31 s gammaloop-nextest-docs> 3: alphal00p_docs_builder::provenance_tests::each_build_captures_one_revision_before_rendering
  1119. 56.31 s gammaloop-nextest-docs> 4: <alphal00p_docs_builder::provenance_tests::each_build_captures_one_revision_before_rendering::{closure#0} as core::ops::function::FnOnce<()>>::call_once
  1120. 56.31 s gammaloop-nextest-docs> note: Some details are omitted, run with `RUST_BACKTRACE=full` for a verbose backtrace.
  1121. 56.31 s gammaloop-nextest-docs>
  1122. 56.31 s gammaloop-nextest-docs> 9. alphal00p-docs-builder::tests::developer_scope_ranges_ignore_unrelated_edits_and_warn_only_while_watching
  1123. 56.31 s gammaloop-nextest-docs> failure: test failure with exit code 101
  1124. 56.31 s gammaloop-nextest-docs> thread 'tests::developer_scope_ranges_ignore_unrelated_edits_and_warn_only_while_watching' (285) panicked at crates/alphal00p-docs-builder/src/lib.rs:12350:29:
  1125. 56.31 s gammaloop-nextest-docs> called `Result::unwrap()` on an `Err` value: required documentation source is missing: /build/source/crates/spynso3/typst/STIXTwoMath-Regular.woff2
  1126. 56.31 s gammaloop-nextest-docs>
  1127. 56.32 s gammaloop-nextest-docs> Location:
  1128. 56.32 s gammaloop-nextest-docs> crates/alphal00p-docs-builder/src/lib.rs:5103:9
  1129. 56.32 s gammaloop-nextest-docs> stack backtrace:
  1130. 56.32 s gammaloop-nextest-docs> 0: __rustc::rust_begin_unwind
  1131. 56.32 s gammaloop-nextest-docs> 1: core::panicking::panic_fmt
  1132. 56.32 s gammaloop-nextest-docs> 2: core::result::unwrap_failed
  1133. 56.32 s gammaloop-nextest-docs> 3: alphal00p_docs_builder::tests::developer_scope_ranges_ignore_unrelated_edits_and_warn_only_while_watching
  1134. 56.32 s gammaloop-nextest-docs> 4: <alphal00p_docs_builder::tests::developer_scope_ranges_ignore_unrelated_edits_and_warn_only_while_watching::{closure#0} as core::ops::function::FnOnce<()>>::call_once
  1135. 56.32 s gammaloop-nextest-docs> note: Some details are omitted, run with `RUST_BACKTRACE=full` for a verbose backtrace.
  1136. 56.32 s gammaloop-nextest-docs> system-out
  1137. 56.32 s gammaloop-nextest-docs> running 1 test
  1138. 56.32 s gammaloop-nextest-docs> test tests::developer_scope_ranges_ignore_unrelated_edits_and_warn_only_while_watching ... FAILED
  1139. 56.32 s gammaloop-nextest-docs>
  1140. 56.32 s gammaloop-nextest-docs> failures:
  1141. 56.32 s gammaloop-nextest-docs>
  1142. 56.32 s gammaloop-nextest-docs> failures:
  1143. 56.32 s gammaloop-nextest-docs> tests::developer_scope_ranges_ignore_unrelated_edits_and_warn_only_while_watching
  1144. 56.32 s gammaloop-nextest-docs>
  1145. 56.32 s gammaloop-nextest-docs> test result: FAILED. 0 passed; 1 failed; 0 ignored; 0 measured; 128 filtered out; finished in 0.12s
  1146. 56.32 s gammaloop-nextest-docs> system-err
  1147. 56.32 s gammaloop-nextest-docs> thread 'tests::developer_scope_ranges_ignore_unrelated_edits_and_warn_only_while_watching' (285) panicked at crates/alphal00p-docs-builder/src/lib.rs:12350:29:
  1148. 56.32 s gammaloop-nextest-docs> called `Result::unwrap()` on an `Err` value: required documentation source is missing: /build/source/crates/spynso3/typst/STIXTwoMath-Regular.woff2
  1149. 56.32 s gammaloop-nextest-docs>
  1150. 56.32 s gammaloop-nextest-docs> Location:
  1151. 56.32 s gammaloop-nextest-docs> crates/alphal00p-docs-builder/src/lib.rs:5103:9
  1152. 56.32 s gammaloop-nextest-docs> stack backtrace:
  1153. 56.32 s gammaloop-nextest-docs> 0: __rustc::rust_begin_unwind
  1154. 56.32 s gammaloop-nextest-docs> 1: core::panicking::panic_fmt
  1155. 56.32 s gammaloop-nextest-docs> 2: core::result::unwrap_failed
  1156. 56.32 s gammaloop-nextest-docs> 3: alphal00p_docs_builder::tests::developer_scope_ranges_ignore_unrelated_edits_and_warn_only_while_watching
  1157. 56.32 s gammaloop-nextest-docs> 4: <alphal00p_docs_builder::tests::developer_scope_ranges_ignore_unrelated_edits_and_warn_only_while_watching::{closure#0} as core::ops::function::FnOnce<()>>::call_once
  1158. 56.32 s gammaloop-nextest-docs> note: Some details are omitted, run with `RUST_BACKTRACE=full` for a verbose backtrace.
  1159. 56.32 s gammaloop-nextest-docs>
  1160. 56.32 s gammaloop-nextest-docs> 10. alphal00p-docs-builder::tests::every_product_requires_a_task_chooser_and_each_supported_interface
  1161. 56.32 s gammaloop-nextest-docs> failure: test failure with exit code 101
  1162. 56.32 s gammaloop-nextest-docs> thread 'tests::every_product_requires_a_task_chooser_and_each_supported_interface' (312) panicked at crates/alphal00p-docs-builder/src/lib.rs:12274:9:
  1163. 56.32 s gammaloop-nextest-docs> assertion failed: format!("{error:#}").contains("has no quickstart page")
  1164. 56.32 s gammaloop-nextest-docs> stack backtrace:
  1165. 56.32 s gammaloop-nextest-docs> 0: __rustc::rust_begin_unwind
  1166. 56.32 s gammaloop-nextest-docs> 1: core::panicking::panic_fmt
  1167. 56.32 s gammaloop-nextest-docs> 2: core::panicking::panic
  1168. 56.32 s gammaloop-nextest-docs> 3: alphal00p_docs_builder::tests::every_product_requires_a_task_chooser_and_each_supported_interface
  1169. 56.32 s gammaloop-nextest-docs> 4: <alphal00p_docs_builder::tests::every_product_requires_a_task_chooser_and_each_supported_interface::{closure#0} as core::ops::function::FnOnce<()>>::call_once
  1170. 56.32 s gammaloop-nextest-docs> note: Some details are omitted, run with `RUST_BACKTRACE=full` for a verbose backtrace.
  1171. 56.32 s gammaloop-nextest-docs> system-out
  1172. 56.32 s gammaloop-nextest-docs> running 1 test
  1173. 56.32 s gammaloop-nextest-docs> test tests::every_product_requires_a_task_chooser_and_each_supported_interface ... FAILED
  1174. 56.32 s gammaloop-nextest-docs>
  1175. 56.32 s gammaloop-nextest-docs> failures:
  1176. 56.32 s gammaloop-nextest-docs>
  1177. 56.32 s gammaloop-nextest-docs> failures:
  1178. 56.32 s gammaloop-nextest-docs> tests::every_product_requires_a_task_chooser_and_each_supported_interface
  1179. 56.32 s gammaloop-nextest-docs>
  1180. 56.32 s gammaloop-nextest-docs> test result: FAILED. 0 passed; 1 failed; 0 ignored; 0 measured; 128 filtered out; finished in 0.12s
  1181. 56.32 s gammaloop-nextest-docs> system-err
  1182. 56.32 s gammaloop-nextest-docs> thread 'tests::every_product_requires_a_task_chooser_and_each_supported_interface' (312) panicked at crates/alphal00p-docs-builder/src/lib.rs:12274:9:
  1183. 56.32 s gammaloop-nextest-docs> assertion failed: format!("{error:#}").contains("has no quickstart page")
  1184. 56.32 s gammaloop-nextest-docs> stack backtrace:
  1185. 56.32 s gammaloop-nextest-docs> 0: __rustc::rust_begin_unwind
  1186. 56.32 s gammaloop-nextest-docs> 1: core::panicking::panic_fmt
  1187. 56.32 s gammaloop-nextest-docs> 2: core::panicking::panic
  1188. 56.32 s gammaloop-nextest-docs> 3: alphal00p_docs_builder::tests::every_product_requires_a_task_chooser_and_each_supported_interface
  1189. 56.32 s gammaloop-nextest-docs> 4: <alphal00p_docs_builder::tests::every_product_requires_a_task_chooser_and_each_supported_interface::{closure#0} as core::ops::function::FnOnce<()>>::call_once
  1190. 56.32 s gammaloop-nextest-docs> note: Some details are omitted, run with `RUST_BACKTRACE=full` for a verbose backtrace.
  1191. 56.32 s gammaloop-nextest-docs>
  1192. 56.32 s gammaloop-nextest-docs> 11. alphal00p-docs-builder::tests::pdf_manual_chapter_order_must_match_the_page_registry
  1193. 56.32 s gammaloop-nextest-docs> failure: test failure with exit code 101
  1194. 56.32 s gammaloop-nextest-docs> thread 'tests::pdf_manual_chapter_order_must_match_the_page_registry' (393) panicked at crates/alphal00p-docs-builder/src/lib.rs:12330:9:
  1195. 56.32 s gammaloop-nextest-docs> assertion failed: format!("{error:#}").contains("PDF manual chapter order differs")
  1196. 56.32 s gammaloop-nextest-docs> stack backtrace:
  1197. 56.32 s gammaloop-nextest-docs> 0: __rustc::rust_begin_unwind
  1198. 56.32 s gammaloop-nextest-docs> 1: core::panicking::panic_fmt
  1199. 56.32 s gammaloop-nextest-docs> 2: core::panicking::panic
  1200. 56.32 s gammaloop-nextest-docs> 3: alphal00p_docs_builder::tests::pdf_manual_chapter_order_must_match_the_page_registry
  1201. 56.32 s gammaloop-nextest-docs> 4: <alphal00p_docs_builder::tests::pdf_manual_chapter_order_must_match_the_page_registry::{closure#0} as core::ops::function::FnOnce<()>>::call_once
  1202. 56.32 s gammaloop-nextest-docs> note: Some details are omitted, run with `RUST_BACKTRACE=full` for a verbose backtrace.
  1203. 56.32 s gammaloop-nextest-docs> system-out
  1204. 56.32 s gammaloop-nextest-docs> running 1 test
  1205. 56.32 s gammaloop-nextest-docs> test tests::pdf_manual_chapter_order_must_match_the_page_registry ... FAILED
  1206. 56.32 s gammaloop-nextest-docs>
  1207. 56.32 s gammaloop-nextest-docs> failures:
  1208. 56.32 s gammaloop-nextest-docs>
  1209. 56.32 s gammaloop-nextest-docs> failures:
  1210. 56.32 s gammaloop-nextest-docs> tests::pdf_manual_chapter_order_must_match_the_page_registry
  1211. 56.32 s gammaloop-nextest-docs>
  1212. 56.32 s gammaloop-nextest-docs> test result: FAILED. 0 passed; 1 failed; 0 ignored; 0 measured; 128 filtered out; finished in 0.11s
  1213. 56.32 s gammaloop-nextest-docs> system-err
  1214. 56.32 s gammaloop-nextest-docs> thread 'tests::pdf_manual_chapter_order_must_match_the_page_registry' (393) panicked at crates/alphal00p-docs-builder/src/lib.rs:12330:9:
  1215. 56.32 s gammaloop-nextest-docs> assertion failed: format!("{error:#}").contains("PDF manual chapter order differs")
  1216. 56.32 s gammaloop-nextest-docs> stack backtrace:
  1217. 56.32 s gammaloop-nextest-docs> 0: __rustc::rust_begin_unwind
  1218. 56.32 s gammaloop-nextest-docs> 1: core::panicking::panic_fmt
  1219. 56.32 s gammaloop-nextest-docs> 2: core::panicking::panic
  1220. 56.32 s gammaloop-nextest-docs> 3: alphal00p_docs_builder::tests::pdf_manual_chapter_order_must_match_the_page_registry
  1221. 56.32 s gammaloop-nextest-docs> 4: <alphal00p_docs_builder::tests::pdf_manual_chapter_order_must_match_the_page_registry::{closure#0} as core::ops::function::FnOnce<()>>::call_once
  1222. 56.32 s gammaloop-nextest-docs> note: Some details are omitted, run with `RUST_BACKTRACE=full` for a verbose backtrace.
  1223. 56.32 s gammaloop-nextest-docs> =========================================
  1224. 56.32 s gammaloop-nextest-docs> Extracting 2 binaries to /build/source
  1225. 56.36 s gammaloop-nextest-docs> Extracted 5 files to /build/source in 0.04s
  1226. 56.37 s gammaloop-nextest-docs> ------------
  1227. 56.37 s gammaloop-nextest-docs> Nextest run ID c85bfe55-2751-452c-a6f5-63723ac9c32c with nextest profile: ci_gammaloop
  1228. 56.37 s gammaloop-nextest-docs> Starting 22 tests across 2 binaries
  1229. 56.39 s gammaloop-nextest-docs> ------------
  1230. 56.39 s gammaloop-nextest-docs> Summary [ 0.019s] 22 tests run: 22 passed, 0 skipped
  1231. 56.42 s gammaloop-nextest-docs>
  1232. 56.42 s gammaloop-nextest-docs> ========== nextest test summary ==========
  1233. 56.42 s gammaloop-nextest-docs> report: target/nextest/ci_gammaloop/junit.xml
  1234. 56.42 s gammaloop-nextest-docs> tests: 22, failures: 0, errors: 0
  1235. 56.42 s gammaloop-nextest-docs> No failing testcases found.
  1236. 56.42 s gammaloop-nextest-docs> =========================================
  1237. 56.43 s gammaloop-nextest-docs> Extracting 3 binaries (including 2 non-test binaries), 1 build script output directory, and 2 linked paths to /build/source
  1238. 56.68 s gammaloop-nextest-docs> Extracted 22 files to /build/source in 0.25s
  1239. 56.69 s gammaloop-nextest-docs> ------------
  1240. 56.69 s gammaloop-nextest-docs> Nextest run ID 3cb74e23-7de6-44e7-b908-d735912a69bb with nextest profile: ci_gammaloop
  1241. 56.69 s gammaloop-nextest-docs> Starting 89 tests across 1 binary
  1242. 56.74 s gammaloop-nextest-docs> ------------
  1243. 56.74 s gammaloop-nextest-docs> Summary [ 0.044s] 89 tests run: 89 passed, 0 skipped
  1244. 56.77 s gammaloop-nextest-docs>
  1245. 56.77 s gammaloop-nextest-docs> ========== nextest test summary ==========
  1246. 56.77 s gammaloop-nextest-docs> report: target/nextest/ci_gammaloop/junit.xml
  1247. 56.77 s gammaloop-nextest-docs> tests: 89, failures: 0, errors: 0
  1248. 56.77 s gammaloop-nextest-docs> No failing testcases found.
  1249. 56.77 s gammaloop-nextest-docs> =========================================
  1250. 56.78 s gammaloop-nextest-docs> Extracting 2 binaries to /build/source
  1251. 56.82 s gammaloop-nextest-docs> Extracted 5 files to /build/source in 0.04s
  1252. 56.83 s gammaloop-nextest-docs> ------------
  1253. 56.83 s gammaloop-nextest-docs> Nextest run ID 2ccc36a9-9ef3-4cff-bf63-f78f60cf6d63 with nextest profile: ci_gammaloop
  1254. 56.83 s gammaloop-nextest-docs> Starting 10 tests across 2 binaries
  1255. 69.05 s gammaloop-nextest-docs> ------------
  1256. 69.05 s gammaloop-nextest-docs> Summary [ 12.226s] 10 tests run: 10 passed, 0 skipped
  1257. 69.08 s gammaloop-nextest-docs>
  1258. 69.08 s gammaloop-nextest-docs> ========== nextest test summary ==========
  1259. 69.08 s gammaloop-nextest-docs> report: target/nextest/ci_gammaloop/junit.xml
  1260. 69.08 s gammaloop-nextest-docs> tests: 10, failures: 0, errors: 0
  1261. 69.08 s gammaloop-nextest-docs> No failing testcases found.
  1262. 69.08 s gammaloop-nextest-docs> =========================================
  1263. 69.10 s gammaloop-nextest-docs> Extracting 1 binary to /build/source
  1264. 69.13 s gammaloop-nextest-docs> Extracted 4 files to /build/source in 0.03s
  1265. 69.14 s gammaloop-nextest-docs> ------------
  1266. 69.14 s gammaloop-nextest-docs> Nextest run ID 42c549a1-e0e2-44c0-9447-a3d4c21c7b6d with nextest profile: ci_gammaloop
  1267. 69.14 s gammaloop-nextest-docs> Starting 0 tests across 1 binary
  1268. 69.14 s gammaloop-nextest-docs> ------------
  1269. 69.14 s gammaloop-nextest-docs> Summary [ 0.000s] 0 tests run: 0 passed, 0 skipped
  1270. 69.17 s gammaloop-nextest-docs>
  1271. 69.17 s gammaloop-nextest-docs> ========== nextest test summary ==========
  1272. 69.17 s gammaloop-nextest-docs> report: target/nextest/ci_gammaloop/junit.xml
  1273. 69.17 s gammaloop-nextest-docs> tests: 0, failures: 0, errors: 0
  1274. 69.17 s gammaloop-nextest-docs> No failing testcases found.
  1275. 69.17 s gammaloop-nextest-docs> =========================================
  1276. 69.18 s gammaloop-nextest-docs> Extracting 1 binary to /build/source
  1277. 69.22 s gammaloop-nextest-docs> Extracted 4 files to /build/source in 0.04s
  1278. 69.23 s gammaloop-nextest-docs> ------------
  1279. 69.23 s gammaloop-nextest-docs> Nextest run ID 43b03e6b-ed68-4614-be20-9bb70c2474fd with nextest profile: ci_gammaloop
  1280. 69.23 s gammaloop-nextest-docs> Starting 5 tests across 1 binary
  1281. 69.23 s gammaloop-nextest-docs> ------------
  1282. 69.23 s gammaloop-nextest-docs> Summary [ 0.005s] 5 tests run: 5 passed, 0 skipped
  1283. 69.26 s gammaloop-nextest-docs>
  1284. 69.26 s gammaloop-nextest-docs> ========== nextest test summary ==========
  1285. 69.26 s gammaloop-nextest-docs> report: target/nextest/ci_gammaloop/junit.xml
  1286. 69.26 s gammaloop-nextest-docs> tests: 5, failures: 0, errors: 0
  1287. 69.26 s gammaloop-nextest-docs> No failing testcases found.
  1288. 69.26 s gammaloop-nextest-docs> =========================================
  1289. 69.45 s error: Cannot build '/nix/store/lss98va6a34sawhfmb9hflr4awgmkih4-gammaloop-nextest-docs.drv'.
  1290. 69.45 s Reason: builder failed with exit code 100.
  1291. 69.45 s Output paths:
  1292. 69.45 s /nix/store/926njs5va6m12lpp63iqc0d8pab03bw0-gammaloop-nextest-docs
  1293. 69.45 s Last 1232 log lines:
  1294. 69.45 s > Extracting 2 binaries to /build/source
  1295. 69.45 s > Extracted 5 files to /build/source in 0.04s
  1296. 69.45 s > ------------
  1297. 69.45 s > Nextest run ID 146421d1-0e8e-4eee-845a-e599617d7081 with nextest profile: ci_gammaloop
  1298. 69.45 s > Starting 129 tests across 2 binaries
  1299. 69.45 s > FAIL [ 0.016s] ( 26/129) alphal00p-docs-builder tests::developer_architecture_is_classified_searchable_and_source_backed
  1300. 69.45 s > stdout ---
  1301. 69.45 s >
  1302. 69.45 s > running 1 test
  1303. 69.45 s > test tests::developer_architecture_is_classified_searchable_and_source_backed ... FAILED
  1304. 69.45 s >
  1305. 69.45 s > failures:
  1306. 69.45 s >
  1307. 69.45 s > failures:
  1308. 69.45 s > tests::developer_architecture_is_classified_searchable_and_source_backed
  1309. 69.45 s >
  1310. 69.45 s > test result: FAILED. 0 passed; 1 failed; 0 ignored; 0 measured; 128 filtered out; finished in 0.01s
  1311. 69.45 s >
  1312. 69.45 s > stderr ---
  1313. 69.45 s >
  1314. 69.45 s > thread 'tests::developer_architecture_is_classified_searchable_and_source_backed' (296) panicked at crates/alphal00p-docs-builder/src/lib.rs:12751:14:
  1315. 69.45 s > called `Result::unwrap()` on an `Err` value: failed to copy documentation asset crates/spynso3/typst/STIXTwoMath-Regular.woff2
  1316. 69.45 s >
  1317. 69.45 s > Caused by:
  1318. 69.45 s > No such file or directory (os error 2)
  1319. 69.45 s >
  1320. 69.45 s > Location:
  1321. 69.45 s > crates/alphal00p-docs-builder/src/lib.rs:2276:18
  1322. 69.45 s > stack backtrace:
  1323. 69.45 s > 0: __rustc::rust_begin_unwind
  1324. 69.45 s > 1: core::panicking::panic_fmt
  1325. 69.45 s > 2: core::result::unwrap_failed
  1326. 69.45 s > 3: alphal00p_docs_builder::tests::developer_architecture_is_classified_searchable_and_source_backed
  1327. 69.45 s > 4: <alphal00p_docs_builder::tests::developer_architecture_is_classified_searchable_and_source_backed::{closure#0} as core::ops::function::FnOnce<()>>::call_once
  1328. 69.45 s > note: Some details are omitted, run with `RUST_BACKTRACE=full` for a verbose backtrace.
  1329. 69.45 s >
  1330. 69.45 s > FAIL [ 0.013s] ( 30/129) alphal00p-docs-builder tests::every_product_orients_rust_to_native_rustdoc_and_keeps_legacy_redirects
  1331. 69.45 s > stdout ---
  1332. 69.45 s >
  1333. 69.45 s > running 1 test
  1334. 69.45 s > test tests::every_product_orients_rust_to_native_rustdoc_and_keeps_legacy_redirects ... FAILED
  1335. 69.45 s >
  1336. 69.45 s > failures:
  1337. 69.45 s >
  1338. 69.45 s > failures:
  1339. 69.45 s > tests::every_product_orients_rust_to_native_rustdoc_and_keeps_legacy_redirects
  1340. 69.45 s >
  1341. 69.45 s > test result: FAILED. 0 passed; 1 failed; 0 ignored; 0 measured; 128 filtered out; finished in 0.01s
  1342. 69.45 s >
  1343. 69.45 s > stderr ---
  1344. 69.45 s >
  1345. 69.45 s > thread 'tests::every_product_orients_rust_to_native_rustdoc_and_keeps_legacy_redirects' (307) panicked at crates/alphal00p-docs-builder/src/lib.rs:12555:46:
  1346. 69.45 s > called `Result::unwrap()` on an `Err` value: failed to copy documentation asset crates/spynso3/typst/STIXTwoMath-Regular.woff2
  1347. 69.45 s >
  1348. 69.45 s > Caused by:
  1349. 69.45 s > No such file or directory (os error 2)
  1350. 69.45 s >
  1351. 69.45 s > Location:
  1352. 69.45 s > crates/alphal00p-docs-builder/src/lib.rs:2276:18
  1353. 69.45 s > stack backtrace:
  1354. 69.45 s > 0: __rustc::rust_begin_unwind
  1355. 69.45 s > 1: core::panicking::panic_fmt
  1356. 69.45 s > 2: core::result::unwrap_failed
  1357. 69.45 s > 3: alphal00p_docs_builder::tests::every_product_orients_rust_to_native_rustdoc_and_keeps_legacy_redirects
  1358. 69.45 s > 4: <alphal00p_docs_builder::tests::every_product_orients_rust_to_native_rustdoc_and_keeps_legacy_redirects::{closure#0} as core::ops::function::FnOnce<()>>::call_once
  1359. 69.45 s > note: Some details are omitted, run with `RUST_BACKTRACE=full` for a verbose backtrace.
  1360. 69.45 s >
  1361. 69.45 s > FAIL [ 0.014s] ( 54/129) alphal00p-docs-builder tests::portal_and_developer_pages_use_federated_search_and_feedback
  1362. 69.45 s > stdout ---
  1363. 69.45 s >
  1364. 69.45 s > running 1 test
  1365. 69.45 s > test tests::portal_and_developer_pages_use_federated_search_and_feedback ... FAILED
  1366. 69.45 s >
  1367. 69.45 s > failures:
  1368. 69.45 s >
  1369. 69.45 s > failures:
  1370. 69.45 s > tests::portal_and_developer_pages_use_federated_search_and_feedback
  1371. 69.45 s >
  1372. 69.45 s > test result: FAILED. 0 passed; 1 failed; 0 ignored; 0 measured; 128 filtered out; finished in 0.01s
  1373. 69.45 s >
  1374. 69.45 s > stderr ---
  1375. 69.45 s >
  1376. 69.45 s > thread 'tests::portal_and_developer_pages_use_federated_search_and_feedback' (420) panicked at crates/alphal00p-docs-builder/src/lib.rs:9684:14:
  1377. 69.45 s > called `Result::unwrap()` on an `Err` value: failed to copy documentation asset crates/spynso3/typst/STIXTwoMath-Regular.woff2
  1378. 69.45 s >
  1379. 69.45 s > Caused by:
  1380. 69.45 s > No such file or directory (os error 2)
  1381. 69.45 s >
  1382. 69.45 s > Location:
  1383. 69.45 s > crates/alphal00p-docs-builder/src/lib.rs:2276:18
  1384. 69.45 s > stack backtrace:
  1385. 69.45 s > 0: __rustc::rust_begin_unwind
  1386. 69.45 s > 1: core::panicking::panic_fmt
  1387. 69.45 s > 2: core::result::unwrap_failed
  1388. 69.45 s > 3: alphal00p_docs_builder::tests::write_test_portal
  1389. 69.45 s > 4: alphal00p_docs_builder::tests::portal_and_developer_pages_use_federated_search_and_feedback
  1390. 69.45 s > 5: <alphal00p_docs_builder::tests::portal_and_developer_pages_use_federated_search_and_feedback::{closure#0} as core::ops::function::FnOnce<()>>::call_once
  1391. 69.45 s > note: Some details are omitted, run with `RUST_BACKTRACE=full` for a verbose backtrace.
  1392. 69.45 s >
  1393. 69.45 s > FAIL [ 0.012s] ( 55/129) alphal00p-docs-builder tests::portal_emits_routes_and_valid_assets
  1394. 69.45 s > stdout ---
  1395. 69.45 s >
  1396. 69.45 s > running 1 test
  1397. 69.45 s > test tests::portal_emits_routes_and_valid_assets ... FAILED
  1398. 69.45 s >
  1399. 69.45 s > failures:
  1400. 69.45 s >
  1401. 69.45 s > failures:
  1402. 69.45 s > tests::portal_emits_routes_and_valid_assets
  1403. 69.45 s >
  1404. 69.45 s > test result: FAILED. 0 passed; 1 failed; 0 ignored; 0 measured; 128 filtered out; finished in 0.01s
  1405. 69.45 s >
  1406. 69.45 s > stderr ---
  1407. 69.45 s >
  1408. 69.45 s > thread 'tests::portal_emits_routes_and_valid_assets' (431) panicked at crates/alphal00p-docs-builder/src/lib.rs:9684:14:
  1409. 69.45 s > called `Result::unwrap()` on an `Err` value: failed to copy documentation asset crates/spynso3/typst/STIXTwoMath-Regular.woff2
  1410. 69.45 s >
  1411. 69.45 s > Caused by:
  1412. 69.45 s > No such file or directory (os error 2)
  1413. 69.45 s >
  1414. 69.45 s > Location:
  1415. 69.45 s > crates/alphal00p-docs-builder/src/lib.rs:2276:18
  1416. 69.45 s > stack backtrace:
  1417. 69.45 s > 0: __rustc::rust_begin_unwind
  1418. 69.45 s > 1: core::panicking::panic_fmt
  1419. 69.45 s > 2: core::result::unwrap_failed
  1420. 69.45 s > 3: alphal00p_docs_builder::tests::write_test_portal
  1421. 69.45 s > 4: alphal00p_docs_builder::tests::portal_emits_routes_and_valid_assets
  1422. 69.45 s > 5: <alphal00p_docs_builder::tests::portal_emits_routes_and_valid_assets::{closure#0} as core::ops::function::FnOnce<()>>::call_once
  1423. 69.45 s > note: Some details are omitted, run with `RUST_BACKTRACE=full` for a verbose backtrace.
  1424. 69.45 s >
  1425. 69.45 s > FAIL [ 0.012s] ( 56/129) alphal00p-docs-builder tests::portal_task_chooser_routes_each_goal_to_the_registered_quickstart
  1426. 69.45 s > stdout ---
  1427. 69.45 s >
  1428. 69.45 s > running 1 test
  1429. 69.45 s > test tests::portal_task_chooser_routes_each_goal_to_the_registered_quickstart ... FAILED
  1430. 69.45 s >
  1431. 69.45 s > failures:
  1432. 69.45 s >
  1433. 69.45 s > failures:
  1434. 69.45 s > tests::portal_task_chooser_routes_each_goal_to_the_registered_quickstart
  1435. 69.45 s >
  1436. 69.45 s > test result: FAILED. 0 passed; 1 failed; 0 ignored; 0 measured; 128 filtered out; finished in 0.01s
  1437. 69.45 s >
  1438. 69.45 s > stderr ---
  1439. 69.45 s >
  1440. 69.45 s > thread 'tests::portal_task_chooser_routes_each_goal_to_the_registered_quickstart' (439) panicked at crates/alphal00p-docs-builder/src/lib.rs:9684:14:
  1441. 69.45 s > called `Result::unwrap()` on an `Err` value: failed to copy documentation asset crates/spynso3/typst/STIXTwoMath-Regular.woff2
  1442. 69.45 s >
  1443. 69.45 s > Caused by:
  1444. 69.45 s > No such file or directory (os error 2)
  1445. 69.45 s >
  1446. 69.45 s > Location:
  1447. 69.45 s > crates/alphal00p-docs-builder/src/lib.rs:2276:18
  1448. 69.45 s > stack backtrace:
  1449. 69.45 s > 0: __rustc::rust_begin_unwind
  1450. 69.45 s > 1: core::panicking::panic_fmt
  1451. 69.45 s > 2: core::result::unwrap_failed
  1452. 69.45 s > 3: alphal00p_docs_builder::tests::write_test_portal
  1453. 69.45 s > 4: alphal00p_docs_builder::tests::portal_task_chooser_routes_each_goal_to_the_registered_quickstart
  1454. 69.45 s > 5: <alphal00p_docs_builder::tests::portal_task_chooser_routes_each_goal_to_the_registered_quickstart::{closure#0} as core::ops::function::FnOnce<()>>::call_once
  1455. 69.45 s > note: Some details are omitted, run with `RUST_BACKTRACE=full` for a verbose backtrace.
  1456. 69.45 s >
  1457. 69.45 s > FAIL [ 0.008s] ( 85/129) alphal00p-docs-builder tests::site_assets_replace_read_only_generated_files
  1458. 69.45 s > stdout ---
  1459. 69.45 s >
  1460. 69.45 s > running 1 test
  1461. 69.45 s > test tests::site_assets_replace_read_only_generated_files ... FAILED
  1462. 69.45 s >
  1463. 69.45 s > failures:
  1464. 69.45 s >
  1465. 69.45 s > failures:
  1466. 69.45 s > tests::site_assets_replace_read_only_generated_files
  1467. 69.45 s >
  1468. 69.45 s > test result: FAILED. 0 passed; 1 failed; 0 ignored; 0 measured; 128 filtered out; finished in 0.00s
  1469. 69.45 s >
  1470. 69.45 s > stderr ---
  1471. 69.45 s >
  1472. 69.45 s > thread 'tests::site_assets_replace_read_only_generated_files' (657) panicked at crates/alphal00p-docs-builder/src/lib.rs:12305:50:
  1473. 69.45 s > called `Result::unwrap()` on an `Err` value: failed to copy documentation asset crates/spynso3/typst/STIXTwoMath-Regular.woff2
  1474. 69.45 s >
  1475. 69.45 s > Caused by:
  1476. 69.45 s > No such file or directory (os error 2)
  1477. 69.45 s >
  1478. 69.45 s > Location:
  1479. 69.45 s > crates/alphal00p-docs-builder/src/lib.rs:2276:18
  1480. 69.45 s > stack backtrace:
  1481. 69.45 s > 0: __rustc::rust_begin_unwind
  1482. 69.45 s > 1: core::panicking::panic_fmt
  1483. 69.45 s > 2: core::result::unwrap_failed
  1484. 69.45 s > 3: alphal00p_docs_builder::tests::site_assets_replace_read_only_generated_files
  1485. 69.45 s > 4: <alphal00p_docs_builder::tests::site_assets_replace_read_only_generated_files::{closure#0} as core::ops::function::FnOnce<()>>::call_once
  1486. 69.45 s > note: Some details are omitted, run with `RUST_BACKTRACE=full` for a verbose backtrace.
  1487. 69.45 s >
  1488. 69.45 s > FAIL [ 0.129s] ( 87/129) alphal00p-docs-builder tests::checked_in_registry_is_valid
  1489. 69.45 s > stdout ---
  1490. 69.45 s >
  1491. 69.45 s > running 1 test
  1492. 69.45 s > test tests::checked_in_registry_is_valid ... FAILED
  1493. 69.45 s >
  1494. 69.45 s > failures:
  1495. 69.45 s >
  1496. 69.45 s > failures:
  1497. 69.45 s > tests::checked_in_registry_is_valid
  1498. 69.45 s >
  1499. 69.45 s > test result: FAILED. 0 passed; 1 failed; 0 ignored; 0 measured; 128 filtered out; finished in 0.12s
  1500. 69.45 s >
  1501. 69.45 s > stderr ---
  1502. 69.45 s >
  1503. 69.45 s > thread 'tests::checked_in_registry_is_valid' (195) panicked at crates/alphal00p-docs-builder/src/lib.rs:12260:50:
  1504. 69.45 s > called `Result::unwrap()` on an `Err` value: required documentation source is missing: /build/source/crates/spynso3/typst/STIXTwoMath-Regular.woff2
  1505. 69.45 s >
  1506. 69.45 s > Location:
  1507. 69.45 s > crates/alphal00p-docs-builder/src/lib.rs:5103:9
  1508. 69.45 s > stack backtrace:
  1509. 69.45 s > 0: __rustc::rust_begin_unwind
  1510. 69.45 s > 1: core::panicking::panic_fmt
  1511. 69.45 s > 2: core::result::unwrap_failed
  1512. 69.45 s > 3: alphal00p_docs_builder::tests::checked_in_registry_is_valid
  1513. 69.45 s > 4: <alphal00p_docs_builder::tests::checked_in_registry_is_valid::{closure#0} as core::ops::function::FnOnce<()>>::call_once
  1514. 69.45 s > note: Some details are omitted, run with `RUST_BACKTRACE=full` for a verbose backtrace.
  1515. 69.45 s >
  1516. 69.45 s > FAIL [ 0.136s] ( 94/129) alphal00p-docs-builder provenance_tests::each_build_captures_one_revision_before_rendering
  1517. 69.45 s > stdout ---
  1518. 69.45 s >
  1519. 69.45 s > running 1 test
  1520. 69.45 s >
  1521. 69.45 s > running 1 test
  1522. 69.45 s > test provenance_tests::each_build_captures_one_revision_before_rendering ... FAILED
  1523. 69.45 s >
  1524. 69.45 s > failures:
  1525. 69.45 s >
  1526. 69.45 s > failures:
  1527. 69.45 s > provenance_tests::each_build_captures_one_revision_before_rendering
  1528. 69.45 s >
  1529. 69.45 s > test result: FAILED. 0 passed; 1 failed; 0 ignored; 0 measured; 128 filtered out; finished in 0.12s
  1530. 69.45 s >
  1531. 69.45 s > test provenance_tests::each_build_captures_one_revision_before_rendering ... FAILED
  1532. 69.45 s >
  1533. 69.45 s > failures:
  1534. 69.45 s >
  1535. 69.45 s > failures:
  1536. 69.45 s > provenance_tests::each_build_captures_one_revision_before_rendering
  1537. 69.45 s >
  1538. 69.45 s > test result: FAILED. 0 passed; 1 failed; 0 ignored; 0 measured; 128 filtered out; finished in 0.13s
  1539. 69.45 s >
  1540. 69.45 s > stderr ---
  1541. 69.45 s >
  1542. 69.45 s > thread 'provenance_tests::each_build_captures_one_revision_before_rendering' (250) panicked at crates/alphal00p-docs-builder/src/provenance_tests.rs:297:14:
  1543. 69.45 s > called `Result::unwrap()` on an `Err` value: required documentation source is missing: /build/source/target/nix-ci-tmp/.tmpH2EaaK/checkout/crates/spynso3/typst/STIXTwoMath-Regular.woff2
  1544. 69.45 s >
  1545. 69.45 s > Location:
  1546. 69.45 s > crates/alphal00p-docs-builder/src/lib.rs:5103:9
  1547. 69.45 s > stack backtrace:
  1548. 69.45 s > 0: __rustc::rust_begin_unwind
  1549. 69.45 s > 1: core::panicking::panic_fmt
  1550. 69.45 s > 2: core::result::unwrap_failed
  1551. 69.45 s > 3: alphal00p_docs_builder::provenance_tests::each_build_captures_one_revision_before_rendering
  1552. 69.45 s > 4: <alphal00p_docs_builder::provenance_tests::each_build_captures_one_revision_before_rendering::{closure#0} as core::ops::function::FnOnce<()>>::call_once
  1553. 69.45 s > note: Some details are omitted, run with `RUST_BACKTRACE=full` for a verbose backtrace.
  1554. 69.45 s >
  1555. 69.45 s > thread 'provenance_tests::each_build_captures_one_revision_before_rendering' (192) panicked at crates/alphal00p-docs-builder/src/provenance_tests.rs:274:9:
  1556. 69.45 s > assertion failed: command.status().unwrap().success()
  1557. 69.45 s > stack backtrace:
  1558. 69.45 s > 0: __rustc::rust_begin_unwind
  1559. 69.45 s > 1: core::panicking::panic_fmt
  1560. 69.45 s > 2: core::panicking::panic
  1561. 69.45 s > 3: alphal00p_docs_builder::provenance_tests::each_build_captures_one_revision_before_rendering
  1562. 69.45 s > 4: <alphal00p_docs_builder::provenance_tests::each_build_captures_one_revision_before_rendering::{closure#0} as core::ops::function::FnOnce<()>>::call_once
  1563. 69.45 s > note: Some details are omitted, run with `RUST_BACKTRACE=full` for a verbose backtrace.
  1564. 69.45 s >
  1565. 69.45 s > FAIL [ 0.122s] ( 95/129) alphal00p-docs-builder tests::developer_scope_ranges_ignore_unrelated_edits_and_warn_only_while_watching
  1566. 69.45 s > stdout ---
  1567. 69.45 s >
  1568. 69.45 s > running 1 test
  1569. 69.45 s > test tests::developer_scope_ranges_ignore_unrelated_edits_and_warn_only_while_watching ... FAILED
  1570. 69.45 s >
  1571. 69.45 s > failures:
  1572. 69.45 s >
  1573. 69.45 s > failures:
  1574. 69.45 s > tests::developer_scope_ranges_ignore_unrelated_edits_and_warn_only_while_watching
  1575. 69.45 s >
  1576. 69.45 s > test result: FAILED. 0 passed; 1 failed; 0 ignored; 0 measured; 128 filtered out; finished in 0.12s
  1577. 69.45 s >
  1578. 69.45 s > stderr ---
  1579. 69.45 s >
  1580. 69.45 s > thread 'tests::developer_scope_ranges_ignore_unrelated_edits_and_warn_only_while_watching' (285) panicked at crates/alphal00p-docs-builder/src/lib.rs:12350:29:
  1581. 69.45 s > called `Result::unwrap()` on an `Err` value: required documentation source is missing: /build/source/crates/spynso3/typst/STIXTwoMath-Regular.woff2
  1582. 69.45 s >
  1583. 69.45 s > Location:
  1584. 69.45 s > crates/alphal00p-docs-builder/src/lib.rs:5103:9
  1585. 69.45 s > stack backtrace:
  1586. 69.45 s > 0: __rustc::rust_begin_unwind
  1587. 69.45 s > 1: core::panicking::panic_fmt
  1588. 69.45 s > 2: core::result::unwrap_failed
  1589. 69.45 s > 3: alphal00p_docs_builder::tests::developer_scope_ranges_ignore_unrelated_edits_and_warn_only_while_watching
  1590. 69.45 s > 4: <alphal00p_docs_builder::tests::developer_scope_ranges_ignore_unrelated_edits_and_warn_only_while_watching::{closure#0} as core::ops::function::FnOnce<()>>::call_once
  1591. 69.45 s > note: Some details are omitted, run with `RUST_BACKTRACE=full` for a verbose backtrace.
  1592. 69.45 s >
  1593. 69.45 s > FAIL [ 0.123s] (106/129) alphal00p-docs-builder tests::every_product_requires_a_task_chooser_and_each_supported_interface
  1594. 69.45 s > stdout ---
  1595. 69.45 s >
  1596. 69.45 s > running 1 test
  1597. 69.45 s > test tests::every_product_requires_a_task_chooser_and_each_supported_interface ... FAILED
  1598. 69.45 s >
  1599. 69.45 s > failures:
  1600. 69.45 s >
  1601. 69.45 s > failures:
  1602. 69.45 s > tests::every_product_requires_a_task_chooser_and_each_supported_interface
  1603. 69.45 s >
  1604. 69.45 s > test result: FAILED. 0 passed; 1 failed; 0 ignored; 0 measured; 128 filtered out; finished in 0.12s
  1605. 69.45 s >
  1606. 69.45 s > stderr ---
  1607. 69.45 s >
  1608. 69.45 s > thread 'tests::every_product_requires_a_task_chooser_and_each_supported_interface' (312) panicked at crates/alphal00p-docs-builder/src/lib.rs:12274:9:
  1609. 69.45 s > assertion failed: format!("{error:#}").contains("has no quickstart page")
  1610. 69.45 s > stack backtrace:
  1611. 69.45 s > 0: __rustc::rust_begin_unwind
  1612. 69.45 s > 1: core::panicking::panic_fmt
  1613. 69.45 s > 2: core::panicking::panic
  1614. 69.45 s > 3: alphal00p_docs_builder::tests::every_product_requires_a_task_chooser_and_each_supported_interface
  1615. 69.45 s > 4: <alphal00p_docs_builder::tests::every_product_requires_a_task_chooser_and_each_supported_interface::{closure#0} as core::ops::function::FnOnce<()>>::call_once
  1616. 69.45 s > note: Some details are omitted, run with `RUST_BACKTRACE=full` for a verbose backtrace.
  1617. 69.45 s >
  1618. 69.45 s > FAIL [ 0.110s] (122/129) alphal00p-docs-builder tests::pdf_manual_chapter_order_must_match_the_page_registry
  1619. 69.45 s > stdout ---
  1620. 69.45 s >
  1621. 69.45 s > running 1 test
  1622. 69.45 s > test tests::pdf_manual_chapter_order_must_match_the_page_registry ... FAILED
  1623. 69.45 s >
  1624. 69.45 s > failures:
  1625. 69.45 s >
  1626. 69.45 s > failures:
  1627. 69.45 s > tests::pdf_manual_chapter_order_must_match_the_page_registry
  1628. 69.45 s >
  1629. 69.45 s > test result: FAILED. 0 passed; 1 failed; 0 ignored; 0 measured; 128 filtered out; finished in 0.11s
  1630. 69.45 s >
  1631. 69.45 s > stderr ---
  1632. 69.45 s >
  1633. 69.45 s > thread 'tests::pdf_manual_chapter_order_must_match_the_page_registry' (393) panicked at crates/alphal00p-docs-builder/src/lib.rs:12330:9:
  1634. 69.45 s > assertion failed: format!("{error:#}").contains("PDF manual chapter order differs")
  1635. 69.45 s > stack backtrace:
  1636. 69.45 s > 0: __rustc::rust_begin_unwind
  1637. 69.45 s > 1: core::panicking::panic_fmt
  1638. 69.45 s > 2: core::panicking::panic
  1639. 69.45 s > 3: alphal00p_docs_builder::tests::pdf_manual_chapter_order_must_match_the_page_registry
  1640. 69.45 s > 4: <alphal00p_docs_builder::tests::pdf_manual_chapter_order_must_match_the_page_registry::{closure#0} as core::ops::function::FnOnce<()>>::call_once
  1641. 69.45 s > note: Some details are omitted, run with `RUST_BACKTRACE=full` for a verbose backtrace.
  1642. 69.45 s >
  1643. 69.45 s > ------------
  1644. 69.45 s > Summary [ 11.307s] 129 tests run: 118 passed, 11 failed, 0 skipped
  1645. 69.45 s > FAIL [ 0.016s] ( 26/129) alphal00p-docs-builder tests::developer_architecture_is_classified_searchable_and_source_backed
  1646. 69.45 s > stdout ---
  1647. 69.45 s >
  1648. 69.45 s > running 1 test
  1649. 69.45 s > test tests::developer_architecture_is_classified_searchable_and_source_backed ... FAILED
  1650. 69.45 s >
  1651. 69.45 s > failures:
  1652. 69.45 s >
  1653. 69.45 s > failures:
  1654. 69.45 s > tests::developer_architecture_is_classified_searchable_and_source_backed
  1655. 69.45 s >
  1656. 69.45 s > test result: FAILED. 0 passed; 1 failed; 0 ignored; 0 measured; 128 filtered out; finished in 0.01s
  1657. 69.45 s >
  1658. 69.45 s > stderr ---
  1659. 69.45 s >
  1660. 69.45 s > thread 'tests::developer_architecture_is_classified_searchable_and_source_backed' (296) panicked at crates/alphal00p-docs-builder/src/lib.rs:12751:14:
  1661. 69.45 s > called `Result::unwrap()` on an `Err` value: failed to copy documentation asset crates/spynso3/typst/STIXTwoMath-Regular.woff2
  1662. 69.45 s >
  1663. 69.45 s > Caused by:
  1664. 69.45 s > No such file or directory (os error 2)
  1665. 69.45 s >
  1666. 69.45 s > Location:
  1667. 69.45 s > crates/alphal00p-docs-builder/src/lib.rs:2276:18
  1668. 69.45 s > stack backtrace:
  1669. 69.45 s > 0: __rustc::rust_begin_unwind
  1670. 69.45 s > 1: core::panicking::panic_fmt
  1671. 69.45 s > 2: core::result::unwrap_failed
  1672. 69.45 s > 3: alphal00p_docs_builder::tests::developer_architecture_is_classified_searchable_and_source_backed
  1673. 69.45 s > 4: <alphal00p_docs_builder::tests::developer_architecture_is_classified_searchable_and_source_backed::{closure#0} as core::ops::function::FnOnce<()>>::call_once
  1674. 69.45 s > note: Some details are omitted, run with `RUST_BACKTRACE=full` for a verbose backtrace.
  1675. 69.45 s >
  1676. 69.45 s > FAIL [ 0.013s] ( 30/129) alphal00p-docs-builder tests::every_product_orients_rust_to_native_rustdoc_and_keeps_legacy_redirects
  1677. 69.45 s > stdout ---
  1678. 69.45 s >
  1679. 69.45 s > running 1 test
  1680. 69.45 s > test tests::every_product_orients_rust_to_native_rustdoc_and_keeps_legacy_redirects ... FAILED
  1681. 69.45 s >
  1682. 69.45 s > failures:
  1683. 69.45 s >
  1684. 69.45 s > failures:
  1685. 69.45 s > tests::every_product_orients_rust_to_native_rustdoc_and_keeps_legacy_redirects
  1686. 69.45 s >
  1687. 69.45 s > test result: FAILED. 0 passed; 1 failed; 0 ignored; 0 measured; 128 filtered out; finished in 0.01s
  1688. 69.45 s >
  1689. 69.45 s > stderr ---
  1690. 69.45 s >
  1691. 69.45 s > thread 'tests::every_product_orients_rust_to_native_rustdoc_and_keeps_legacy_redirects' (307) panicked at crates/alphal00p-docs-builder/src/lib.rs:12555:46:
  1692. 69.45 s > called `Result::unwrap()` on an `Err` value: failed to copy documentation asset crates/spynso3/typst/STIXTwoMath-Regular.woff2
  1693. 69.45 s >
  1694. 69.45 s > Caused by:
  1695. 69.45 s > No such file or directory (os error 2)
  1696. 69.45 s >
  1697. 69.45 s > Location:
  1698. 69.45 s > crates/alphal00p-docs-builder/src/lib.rs:2276:18
  1699. 69.45 s > stack backtrace:
  1700. 69.45 s > 0: __rustc::rust_begin_unwind
  1701. 69.45 s > 1: core::panicking::panic_fmt
  1702. 69.45 s > 2: core::result::unwrap_failed
  1703. 69.45 s > 3: alphal00p_docs_builder::tests::every_product_orients_rust_to_native_rustdoc_and_keeps_legacy_redirects
  1704. 69.45 s > 4: <alphal00p_docs_builder::tests::every_product_orients_rust_to_native_rustdoc_and_keeps_legacy_redirects::{closure#0} as core::ops::function::FnOnce<()>>::call_once
  1705. 69.45 s > note: Some details are omitted, run with `RUST_BACKTRACE=full` for a verbose backtrace.
  1706. 69.45 s >
  1707. 69.45 s > FAIL [ 0.014s] ( 54/129) alphal00p-docs-builder tests::portal_and_developer_pages_use_federated_search_and_feedback
  1708. 69.45 s > stdout ---
  1709. 69.45 s >
  1710. 69.45 s > running 1 test
  1711. 69.45 s > test tests::portal_and_developer_pages_use_federated_search_and_feedback ... FAILED
  1712. 69.45 s >
  1713. 69.45 s > failures:
  1714. 69.45 s >
  1715. 69.45 s > failures:
  1716. 69.45 s > tests::portal_and_developer_pages_use_federated_search_and_feedback
  1717. 69.45 s >
  1718. 69.45 s > test result: FAILED. 0 passed; 1 failed; 0 ignored; 0 measured; 128 filtered out; finished in 0.01s
  1719. 69.45 s >
  1720. 69.45 s > stderr ---
  1721. 69.45 s >
  1722. 69.45 s > thread 'tests::portal_and_developer_pages_use_federated_search_and_feedback' (420) panicked at crates/alphal00p-docs-builder/src/lib.rs:9684:14:
  1723. 69.45 s > called `Result::unwrap()` on an `Err` value: failed to copy documentation asset crates/spynso3/typst/STIXTwoMath-Regular.woff2
  1724. 69.45 s >
  1725. 69.45 s > Caused by:
  1726. 69.45 s > No such file or directory (os error 2)
  1727. 69.45 s >
  1728. 69.45 s > Location:
  1729. 69.45 s > crates/alphal00p-docs-builder/src/lib.rs:2276:18
  1730. 69.45 s > stack backtrace:
  1731. 69.45 s > 0: __rustc::rust_begin_unwind
  1732. 69.45 s > 1: core::panicking::panic_fmt
  1733. 69.45 s > 2: core::result::unwrap_failed
  1734. 69.45 s > 3: alphal00p_docs_builder::tests::write_test_portal
  1735. 69.45 s > 4: alphal00p_docs_builder::tests::portal_and_developer_pages_use_federated_search_and_feedback
  1736. 69.45 s > 5: <alphal00p_docs_builder::tests::portal_and_developer_pages_use_federated_search_and_feedback::{closure#0} as core::ops::function::FnOnce<()>>::call_once
  1737. 69.45 s > note: Some details are omitted, run with `RUST_BACKTRACE=full` for a verbose backtrace.
  1738. 69.45 s >
  1739. 69.45 s > FAIL [ 0.012s] ( 55/129) alphal00p-docs-builder tests::portal_emits_routes_and_valid_assets
  1740. 69.45 s > stdout ---
  1741. 69.45 s >
  1742. 69.45 s > running 1 test
  1743. 69.45 s > test tests::portal_emits_routes_and_valid_assets ... FAILED
  1744. 69.45 s >
  1745. 69.45 s > failures:
  1746. 69.45 s >
  1747. 69.45 s > failures:
  1748. 69.45 s > tests::portal_emits_routes_and_valid_assets
  1749. 69.45 s >
  1750. 69.45 s > test result: FAILED. 0 passed; 1 failed; 0 ignored; 0 measured; 128 filtered out; finished in 0.01s
  1751. 69.45 s >
  1752. 69.45 s > stderr ---
  1753. 69.45 s >
  1754. 69.45 s > thread 'tests::portal_emits_routes_and_valid_assets' (431) panicked at crates/alphal00p-docs-builder/src/lib.rs:9684:14:
  1755. 69.45 s > called `Result::unwrap()` on an `Err` value: failed to copy documentation asset crates/spynso3/typst/STIXTwoMath-Regular.woff2
  1756. 69.45 s >
  1757. 69.45 s > Caused by:
  1758. 69.45 s > No such file or directory (os error 2)
  1759. 69.45 s >
  1760. 69.45 s > Location:
  1761. 69.45 s > crates/alphal00p-docs-builder/src/lib.rs:2276:18
  1762. 69.45 s > stack backtrace:
  1763. 69.45 s > 0: __rustc::rust_begin_unwind
  1764. 69.45 s > 1: core::panicking::panic_fmt
  1765. 69.45 s > 2: core::result::unwrap_failed
  1766. 69.45 s > 3: alphal00p_docs_builder::tests::write_test_portal
  1767. 69.45 s > 4: alphal00p_docs_builder::tests::portal_emits_routes_and_valid_assets
  1768. 69.45 s > 5: <alphal00p_docs_builder::tests::portal_emits_routes_and_valid_assets::{closure#0} as core::ops::function::FnOnce<()>>::call_once
  1769. 69.45 s > note: Some details are omitted, run with `RUST_BACKTRACE=full` for a verbose backtrace.
  1770. 69.45 s >
  1771. 69.45 s > FAIL [ 0.012s] ( 56/129) alphal00p-docs-builder tests::portal_task_chooser_routes_each_goal_to_the_registered_quickstart
  1772. 69.45 s > stdout ---
  1773. 69.45 s >
  1774. 69.45 s > running 1 test
  1775. 69.45 s > test tests::portal_task_chooser_routes_each_goal_to_the_registered_quickstart ... FAILED
  1776. 69.45 s >
  1777. 69.45 s > failures:
  1778. 69.45 s >
  1779. 69.45 s > failures:
  1780. 69.45 s > tests::portal_task_chooser_routes_each_goal_to_the_registered_quickstart
  1781. 69.45 s >
  1782. 69.45 s > test result: FAILED. 0 passed; 1 failed; 0 ignored; 0 measured; 128 filtered out; finished in 0.01s
  1783. 69.45 s >
  1784. 69.45 s > stderr ---
  1785. 69.45 s >
  1786. 69.45 s > thread 'tests::portal_task_chooser_routes_each_goal_to_the_registered_quickstart' (439) panicked at crates/alphal00p-docs-builder/src/lib.rs:9684:14:
  1787. 69.45 s > called `Result::unwrap()` on an `Err` value: failed to copy documentation asset crates/spynso3/typst/STIXTwoMath-Regular.woff2
  1788. 69.45 s >
  1789. 69.45 s > Caused by:
  1790. 69.45 s > No such file or directory (os error 2)
  1791. 69.45 s >
  1792. 69.45 s > Location:
  1793. 69.45 s > crates/alphal00p-docs-builder/src/lib.rs:2276:18
  1794. 69.45 s > stack backtrace:
  1795. 69.45 s > 0: __rustc::rust_begin_unwind
  1796. 69.45 s > 1: core::panicking::panic_fmt
  1797. 69.45 s > 2: core::result::unwrap_failed
  1798. 69.45 s > 3: alphal00p_docs_builder::tests::write_test_portal
  1799. 69.45 s > 4: alphal00p_docs_builder::tests::portal_task_chooser_routes_each_goal_to_the_registered_quickstart
  1800. 69.45 s > 5: <alphal00p_docs_builder::tests::portal_task_chooser_routes_each_goal_to_the_registered_quickstart::{closure#0} as core::ops::function::FnOnce<()>>::call_once
  1801. 69.45 s > note: Some details are omitted, run with `RUST_BACKTRACE=full` for a verbose backtrace.
  1802. 69.45 s >
  1803. 69.45 s > FAIL [ 0.008s] ( 85/129) alphal00p-docs-builder tests::site_assets_replace_read_only_generated_files
  1804. 69.45 s > stdout ---
  1805. 69.45 s >
  1806. 69.45 s > running 1 test
  1807. 69.45 s > test tests::site_assets_replace_read_only_generated_files ... FAILED
  1808. 69.45 s >
  1809. 69.45 s > failures:
  1810. 69.45 s >
  1811. 69.45 s > failures:
  1812. 69.45 s > tests::site_assets_replace_read_only_generated_files
  1813. 69.45 s >
  1814. 69.45 s > test result: FAILED. 0 passed; 1 failed; 0 ignored; 0 measured; 128 filtered out; finished in 0.00s
  1815. 69.45 s >
  1816. 69.45 s > stderr ---
  1817. 69.45 s >
  1818. 69.45 s > thread 'tests::site_assets_replace_read_only_generated_files' (657) panicked at crates/alphal00p-docs-builder/src/lib.rs:12305:50:
  1819. 69.45 s > called `Result::unwrap()` on an `Err` value: failed to copy documentation asset crates/spynso3/typst/STIXTwoMath-Regular.woff2
  1820. 69.45 s >
  1821. 69.45 s > Caused by:
  1822. 69.45 s > No such file or directory (os error 2)
  1823. 69.45 s >
  1824. 69.45 s > Location:
  1825. 69.45 s > crates/alphal00p-docs-builder/src/lib.rs:2276:18
  1826. 69.45 s > stack backtrace:
  1827. 69.45 s > 0: __rustc::rust_begin_unwind
  1828. 69.45 s > 1: core::panicking::panic_fmt
  1829. 69.45 s > 2: core::result::unwrap_failed
  1830. 69.45 s > 3: alphal00p_docs_builder::tests::site_assets_replace_read_only_generated_files
  1831. 69.45 s > 4: <alphal00p_docs_builder::tests::site_assets_replace_read_only_generated_files::{closure#0} as core::ops::function::FnOnce<()>>::call_once
  1832. 69.45 s > note: Some details are omitted, run with `RUST_BACKTRACE=full` for a verbose backtrace.
  1833. 69.45 s >
  1834. 69.45 s > FAIL [ 0.129s] ( 87/129) alphal00p-docs-builder tests::checked_in_registry_is_valid
  1835. 69.45 s > stdout ---
  1836. 69.45 s >
  1837. 69.45 s > running 1 test
  1838. 69.45 s > test tests::checked_in_registry_is_valid ... FAILED
  1839. 69.45 s >
  1840. 69.45 s > failures:
  1841. 69.45 s >
  1842. 69.45 s > failures:
  1843. 69.45 s > tests::checked_in_registry_is_valid
  1844. 69.45 s >
  1845. 69.45 s > test result: FAILED. 0 passed; 1 failed; 0 ignored; 0 measured; 128 filtered out; finished in 0.12s
  1846. 69.45 s >
  1847. 69.45 s > stderr ---
  1848. 69.45 s >
  1849. 69.45 s > thread 'tests::checked_in_registry_is_valid' (195) panicked at crates/alphal00p-docs-builder/src/lib.rs:12260:50:
  1850. 69.45 s > called `Result::unwrap()` on an `Err` value: required documentation source is missing: /build/source/crates/spynso3/typst/STIXTwoMath-Regular.woff2
  1851. 69.45 s >
  1852. 69.45 s > Location:
  1853. 69.45 s > crates/alphal00p-docs-builder/src/lib.rs:5103:9
  1854. 69.45 s > stack backtrace:
  1855. 69.45 s > 0: __rustc::rust_begin_unwind
  1856. 69.45 s > 1: core::panicking::panic_fmt
  1857. 69.45 s > 2: core::result::unwrap_failed
  1858. 69.45 s > 3: alphal00p_docs_builder::tests::checked_in_registry_is_valid
  1859. 69.45 s > 4: <alphal00p_docs_builder::tests::checked_in_registry_is_valid::{closure#0} as core::ops::function::FnOnce<()>>::call_once
  1860. 69.45 s > note: Some details are omitted, run with `RUST_BACKTRACE=full` for a verbose backtrace.
  1861. 69.45 s >
  1862. 69.45 s > FAIL [ 0.136s] ( 94/129) alphal00p-docs-builder provenance_tests::each_build_captures_one_revision_before_rendering
  1863. 69.45 s > stdout ---
  1864. 69.45 s >
  1865. 69.45 s > running 1 test
  1866. 69.45 s >
  1867. 69.45 s > running 1 test
  1868. 69.45 s > test provenance_tests::each_build_captures_one_revision_before_rendering ... FAILED
  1869. 69.45 s >
  1870. 69.45 s > failures:
  1871. 69.45 s >
  1872. 69.45 s > failures:
  1873. 69.45 s > provenance_tests::each_build_captures_one_revision_before_rendering
  1874. 69.45 s >
  1875. 69.45 s > test result: FAILED. 0 passed; 1 failed; 0 ignored; 0 measured; 128 filtered out; finished in 0.12s
  1876. 69.45 s >
  1877. 69.45 s > test provenance_tests::each_build_captures_one_revision_before_rendering ... FAILED
  1878. 69.45 s >
  1879. 69.45 s > failures:
  1880. 69.45 s >
  1881. 69.45 s > failures:
  1882. 69.45 s > provenance_tests::each_build_captures_one_revision_before_rendering
  1883. 69.45 s >
  1884. 69.45 s > test result: FAILED. 0 passed; 1 failed; 0 ignored; 0 measured; 128 filtered out; finished in 0.13s
  1885. 69.45 s >
  1886. 69.45 s > stderr ---
  1887. 69.45 s >
  1888. 69.45 s > thread 'provenance_tests::each_build_captures_one_revision_before_rendering' (250) panicked at crates/alphal00p-docs-builder/src/provenance_tests.rs:297:14:
  1889. 69.45 s > called `Result::unwrap()` on an `Err` value: required documentation source is missing: /build/source/target/nix-ci-tmp/.tmpH2EaaK/checkout/crates/spynso3/typst/STIXTwoMath-Regular.woff2
  1890. 69.45 s >
  1891. 69.45 s > Location:
  1892. 69.45 s > crates/alphal00p-docs-builder/src/lib.rs:5103:9
  1893. 69.45 s > stack backtrace:
  1894. 69.45 s > 0: __rustc::rust_begin_unwind
  1895. 69.45 s > 1: core::panicking::panic_fmt
  1896. 69.45 s > 2: core::result::unwrap_failed
  1897. 69.45 s > 3: alphal00p_docs_builder::provenance_tests::each_build_captures_one_revision_before_rendering
  1898. 69.45 s > 4: <alphal00p_docs_builder::provenance_tests::each_build_captures_one_revision_before_rendering::{closure#0} as core::ops::function::FnOnce<()>>::call_once
  1899. 69.45 s > note: Some details are omitted, run with `RUST_BACKTRACE=full` for a verbose backtrace.
  1900. 69.45 s >
  1901. 69.45 s > thread 'provenance_tests::each_build_captures_one_revision_before_rendering' (192) panicked at crates/alphal00p-docs-builder/src/provenance_tests.rs:274:9:
  1902. 69.45 s > assertion failed: command.status().unwrap().success()
  1903. 69.45 s > stack backtrace:
  1904. 69.45 s > 0: __rustc::rust_begin_unwind
  1905. 69.45 s > 1: core::panicking::panic_fmt
  1906. 69.45 s > 2: core::panicking::panic
  1907. 69.45 s > 3: alphal00p_docs_builder::provenance_tests::each_build_captures_one_revision_before_rendering
  1908. 69.45 s > 4: <alphal00p_docs_builder::provenance_tests::each_build_captures_one_revision_before_rendering::{closure#0} as core::ops::function::FnOnce<()>>::call_once
  1909. 69.45 s > note: Some details are omitted, run with `RUST_BACKTRACE=full` for a verbose backtrace.
  1910. 69.45 s >
  1911. 69.45 s > FAIL [ 0.122s] ( 95/129) alphal00p-docs-builder tests::developer_scope_ranges_ignore_unrelated_edits_and_warn_only_while_watching
  1912. 69.45 s > stdout ---
  1913. 69.45 s >
  1914. 69.45 s > running 1 test
  1915. 69.45 s > test tests::developer_scope_ranges_ignore_unrelated_edits_and_warn_only_while_watching ... FAILED
  1916. 69.45 s >
  1917. 69.45 s > failures:
  1918. 69.45 s >
  1919. 69.45 s > failures:
  1920. 69.45 s > tests::developer_scope_ranges_ignore_unrelated_edits_and_warn_only_while_watching
  1921. 69.45 s >
  1922. 69.45 s > test result: FAILED. 0 passed; 1 failed; 0 ignored; 0 measured; 128 filtered out; finished in 0.12s
  1923. 69.45 s >
  1924. 69.45 s > stderr ---
  1925. 69.45 s >
  1926. 69.45 s > thread 'tests::developer_scope_ranges_ignore_unrelated_edits_and_warn_only_while_watching' (285) panicked at crates/alphal00p-docs-builder/src/lib.rs:12350:29:
  1927. 69.45 s > called `Result::unwrap()` on an `Err` value: required documentation source is missing: /build/source/crates/spynso3/typst/STIXTwoMath-Regular.woff2
  1928. 69.45 s >
  1929. 69.45 s > Location:
  1930. 69.45 s > crates/alphal00p-docs-builder/src/lib.rs:5103:9
  1931. 69.45 s > stack backtrace:
  1932. 69.45 s > 0: __rustc::rust_begin_unwind
  1933. 69.45 s > 1: core::panicking::panic_fmt
  1934. 69.45 s > 2: core::result::unwrap_failed
  1935. 69.45 s > 3: alphal00p_docs_builder::tests::developer_scope_ranges_ignore_unrelated_edits_and_warn_only_while_watching
  1936. 69.45 s > 4: <alphal00p_docs_builder::tests::developer_scope_ranges_ignore_unrelated_edits_and_warn_only_while_watching::{closure#0} as core::ops::function::FnOnce<()>>::call_once
  1937. 69.45 s > note: Some details are omitted, run with `RUST_BACKTRACE=full` for a verbose backtrace.
  1938. 69.45 s >
  1939. 69.45 s > FAIL [ 0.123s] (106/129) alphal00p-docs-builder tests::every_product_requires_a_task_chooser_and_each_supported_interface
  1940. 69.45 s > stdout ---
  1941. 69.45 s >
  1942. 69.45 s > running 1 test
  1943. 69.45 s > test tests::every_product_requires_a_task_chooser_and_each_supported_interface ... FAILED
  1944. 69.45 s >
  1945. 69.45 s > failures:
  1946. 69.45 s >
  1947. 69.45 s > failures:
  1948. 69.45 s > tests::every_product_requires_a_task_chooser_and_each_supported_interface
  1949. 69.45 s >
  1950. 69.45 s > test result: FAILED. 0 passed; 1 failed; 0 ignored; 0 measured; 128 filtered out; finished in 0.12s
  1951. 69.45 s >
  1952. 69.45 s > stderr ---
  1953. 69.45 s >
  1954. 69.45 s > thread 'tests::every_product_requires_a_task_chooser_and_each_supported_interface' (312) panicked at crates/alphal00p-docs-builder/src/lib.rs:12274:9:
  1955. 69.45 s > assertion failed: format!("{error:#}").contains("has no quickstart page")
  1956. 69.45 s > stack backtrace:
  1957. 69.45 s > 0: __rustc::rust_begin_unwind
  1958. 69.45 s > 1: core::panicking::panic_fmt
  1959. 69.45 s > 2: core::panicking::panic
  1960. 69.45 s > 3: alphal00p_docs_builder::tests::every_product_requires_a_task_chooser_and_each_supported_interface
  1961. 69.45 s > 4: <alphal00p_docs_builder::tests::every_product_requires_a_task_chooser_and_each_supported_interface::{closure#0} as core::ops::function::FnOnce<()>>::call_once
  1962. 69.45 s > note: Some details are omitted, run with `RUST_BACKTRACE=full` for a verbose backtrace.
  1963. 69.45 s >
  1964. 69.45 s > FAIL [ 0.110s] (122/129) alphal00p-docs-builder tests::pdf_manual_chapter_order_must_match_the_page_registry
  1965. 69.45 s > stdout ---
  1966. 69.45 s >
  1967. 69.45 s > running 1 test
  1968. 69.45 s > test tests::pdf_manual_chapter_order_must_match_the_page_registry ... FAILED
  1969. 69.45 s >
  1970. 69.45 s > failures:
  1971. 69.45 s >
  1972. 69.45 s > failures:
  1973. 69.45 s > tests::pdf_manual_chapter_order_must_match_the_page_registry
  1974. 69.45 s >
  1975. 69.45 s > test result: FAILED. 0 passed; 1 failed; 0 ignored; 0 measured; 128 filtered out; finished in 0.11s
  1976. 69.45 s >
  1977. 69.45 s > stderr ---
  1978. 69.45 s >
  1979. 69.45 s > thread 'tests::pdf_manual_chapter_order_must_match_the_page_registry' (393) panicked at crates/alphal00p-docs-builder/src/lib.rs:12330:9:
  1980. 69.45 s > assertion failed: format!("{error:#}").contains("PDF manual chapter order differs")
  1981. 69.45 s > stack backtrace:
  1982. 69.45 s > 0: __rustc::rust_begin_unwind
  1983. 69.45 s > 1: core::panicking::panic_fmt
  1984. 69.45 s > 2: core::panicking::panic
  1985. 69.45 s > 3: alphal00p_docs_builder::tests::pdf_manual_chapter_order_must_match_the_page_registry
  1986. 69.45 s > 4: <alphal00p_docs_builder::tests::pdf_manual_chapter_order_must_match_the_page_registry::{closure#0} as core::ops::function::FnOnce<()>>::call_once
  1987. 69.45 s > note: Some details are omitted, run with `RUST_BACKTRACE=full` for a verbose backtrace.
  1988. 69.45 s >
  1989. 69.45 s > error: test run failed
  1990. 69.45 s >
  1991. 69.45 s > ========== nextest test summary ==========
  1992. 69.45 s > report: target/nextest/ci_gammaloop/junit.xml
  1993. 69.45 s > tests: 129, failures: 11, errors: 0
  1994. 69.45 s >
  1995. 69.45 s > 1. alphal00p-docs-builder::tests::developer_architecture_is_classified_searchable_and_source_backed
  1996. 69.45 s > failure: test failure with exit code 101
  1997. 69.45 s > thread 'tests::developer_architecture_is_classified_searchable_and_source_backed' (296) panicked at crates/alphal00p-docs-builder/src/lib.rs:12751:14:
  1998. 69.45 s > called `Result::unwrap()` on an `Err` value: failed to copy documentation asset crates/spynso3/typst/STIXTwoMath-Regular.woff2
  1999. 69.45 s >
  2000. 69.45 s > Caused by:
  2001. 69.45 s > No such file or directory (os error 2)
  2002. 69.45 s >
  2003. 69.45 s > Location:
  2004. 69.45 s > crates/alphal00p-docs-builder/src/lib.rs:2276:18
  2005. 69.45 s > stack backtrace:
  2006. 69.45 s > 0: __rustc::rust_begin_unwind
  2007. 69.45 s > 1: core::panicking::panic_fmt
  2008. 69.45 s > 2: core::result::unwrap_failed
  2009. 69.45 s > 3: alphal00p_docs_builder::tests::developer_architecture_is_classified_searchable_and_source_backed
  2010. 69.45 s > 4: <alphal00p_docs_builder::tests::developer_architecture_is_classified_searchable_and_source_backed::{closure#0} as core::ops::function::FnOnce<()>>::call_once
  2011. 69.45 s > note: Some details are omitted, run with `RUST_BACKTRACE=full` for a verbose backtrace.
  2012. 69.45 s > system-out
  2013. 69.45 s > running 1 test
  2014. 69.45 s > test tests::developer_architecture_is_classified_searchable_and_source_backed ... FAILED
  2015. 69.45 s >
  2016. 69.45 s > failures:
  2017. 69.45 s >
  2018. 69.45 s > failures:
  2019. 69.45 s > tests::developer_architecture_is_classified_searchable_and_source_backed
  2020. 69.45 s >
  2021. 69.45 s > test result: FAILED. 0 passed; 1 failed; 0 ignored; 0 measured; 128 filtered out; finished in 0.01s
  2022. 69.45 s > system-err
  2023. 69.45 s > thread 'tests::developer_architecture_is_classified_searchable_and_source_backed' (296) panicked at crates/alphal00p-docs-builder/src/lib.rs:12751:14:
  2024. 69.45 s > called `Result::unwrap()` on an `Err` value: failed to copy documentation asset crates/spynso3/typst/STIXTwoMath-Regular.woff2
  2025. 69.45 s >
  2026. 69.45 s > Caused by:
  2027. 69.45 s > No such file or directory (os error 2)
  2028. 69.45 s >
  2029. 69.45 s > Location:
  2030. 69.45 s > crates/alphal00p-docs-builder/src/lib.rs:2276:18
  2031. 69.45 s > stack backtrace:
  2032. 69.45 s > 0: __rustc::rust_begin_unwind
  2033. 69.45 s > 1: core::panicking::panic_fmt
  2034. 69.45 s > 2: core::result::unwrap_failed
  2035. 69.45 s > 3: alphal00p_docs_builder::tests::developer_architecture_is_classified_searchable_and_source_backed
  2036. 69.45 s > 4: <alphal00p_docs_builder::tests::developer_architecture_is_classified_searchable_and_source_backed::{closure#0} as core::ops::function::FnOnce<()>>::call_once
  2037. 69.45 s > note: Some details are omitted, run with `RUST_BACKTRACE=full` for a verbose backtrace.
  2038. 69.45 s >
  2039. 69.45 s > 2. alphal00p-docs-builder::tests::every_product_orients_rust_to_native_rustdoc_and_keeps_legacy_redirects
  2040. 69.45 s > failure: test failure with exit code 101
  2041. 69.45 s > thread 'tests::every_product_orients_rust_to_native_rustdoc_and_keeps_legacy_redirects' (307) panicked at crates/alphal00p-docs-builder/src/lib.rs:12555:46:
  2042. 69.45 s > called `Result::unwrap()` on an `Err` value: failed to copy documentation asset crates/spynso3/typst/STIXTwoMath-Regular.woff2
  2043. 69.45 s >
  2044. 69.45 s > Caused by:
  2045. 69.45 s > No such file or directory (os error 2)
  2046. 69.45 s >
  2047. 69.45 s > Location:
  2048. 69.45 s > crates/alphal00p-docs-builder/src/lib.rs:2276:18
  2049. 69.45 s > stack backtrace:
  2050. 69.45 s > 0: __rustc::rust_begin_unwind
  2051. 69.45 s > 1: core::panicking::panic_fmt
  2052. 69.45 s > 2: core::result::unwrap_failed
  2053. 69.45 s > 3: alphal00p_docs_builder::tests::every_product_orients_rust_to_native_rustdoc_and_keeps_legacy_redirects
  2054. 69.45 s > 4: <alphal00p_docs_builder::tests::every_product_orients_rust_to_native_rustdoc_and_keeps_legacy_redirects::{closure#0} as core::ops::function::FnOnce<()>>::call_once
  2055. 69.45 s > note: Some details are omitted, run with `RUST_BACKTRACE=full` for a verbose backtrace.
  2056. 69.45 s > system-out
  2057. 69.45 s > running 1 test
  2058. 69.45 s > test tests::every_product_orients_rust_to_native_rustdoc_and_keeps_legacy_redirects ... FAILED
  2059. 69.45 s >
  2060. 69.45 s > failures:
  2061. 69.45 s >
  2062. 69.45 s > failures:
  2063. 69.45 s > tests::every_product_orients_rust_to_native_rustdoc_and_keeps_legacy_redirects
  2064. 69.45 s >
  2065. 69.45 s > test result: FAILED. 0 passed; 1 failed; 0 ignored; 0 measured; 128 filtered out; finished in 0.01s
  2066. 69.45 s > system-err
  2067. 69.45 s > thread 'tests::every_product_orients_rust_to_native_rustdoc_and_keeps_legacy_redirects' (307) panicked at crates/alphal00p-docs-builder/src/lib.rs:12555:46:
  2068. 69.45 s > called `Result::unwrap()` on an `Err` value: failed to copy documentation asset crates/spynso3/typst/STIXTwoMath-Regular.woff2
  2069. 69.45 s >
  2070. 69.45 s > Caused by:
  2071. 69.45 s > No such file or directory (os error 2)
  2072. 69.45 s >
  2073. 69.45 s > Location:
  2074. 69.45 s > crates/alphal00p-docs-builder/src/lib.rs:2276:18
  2075. 69.45 s > stack backtrace:
  2076. 69.45 s > 0: __rustc::rust_begin_unwind
  2077. 69.45 s > 1: core::panicking::panic_fmt
  2078. 69.45 s > 2: core::result::unwrap_failed
  2079. 69.45 s > 3: alphal00p_docs_builder::tests::every_product_orients_rust_to_native_rustdoc_and_keeps_legacy_redirects
  2080. 69.45 s > 4: <alphal00p_docs_builder::tests::every_product_orients_rust_to_native_rustdoc_and_keeps_legacy_redirects::{closure#0} as core::ops::function::FnOnce<()>>::call_once
  2081. 69.45 s > note: Some details are omitted, run with `RUST_BACKTRACE=full` for a verbose backtrace.
  2082. 69.45 s >
  2083. 69.45 s > 3. alphal00p-docs-builder::tests::portal_and_developer_pages_use_federated_search_and_feedback
  2084. 69.45 s > failure: test failure with exit code 101
  2085. 69.45 s > thread 'tests::portal_and_developer_pages_use_federated_search_and_feedback' (420) panicked at crates/alphal00p-docs-builder/src/lib.rs:9684:14:
  2086. 69.45 s > called `Result::unwrap()` on an `Err` value: failed to copy documentation asset crates/spynso3/typst/STIXTwoMath-Regular.woff2
  2087. 69.45 s >
  2088. 69.45 s > Caused by:
  2089. 69.45 s > No such file or directory (os error 2)
  2090. 69.45 s >
  2091. 69.45 s > Location:
  2092. 69.45 s > crates/alphal00p-docs-builder/src/lib.rs:2276:18
  2093. 69.45 s > stack backtrace:
  2094. 69.45 s > 0: __rustc::rust_begin_unwind
  2095. 69.45 s > 1: core::panicking::panic_fmt
  2096. 69.45 s > 2: core::result::unwrap_failed
  2097. 69.45 s > 3: alphal00p_docs_builder::tests::write_test_portal
  2098. 69.45 s > 4: alphal00p_docs_builder::tests::portal_and_developer_pages_use_federated_search_and_feedback
  2099. 69.45 s > 5: <alphal00p_docs_builder::tests::portal_and_developer_pages_use_federated_search_and_feedback::{closure#0} as core::ops::function::FnOnce<()>>::call_once
  2100. 69.45 s > note: Some details are omitted, run with `RUST_BACKTRACE=full` for a verbose backtrace.
  2101. 69.45 s > system-out
  2102. 69.45 s > running 1 test
  2103. 69.45 s > test tests::portal_and_developer_pages_use_federated_search_and_feedback ... FAILED
  2104. 69.45 s >
  2105. 69.45 s > failures:
  2106. 69.45 s >
  2107. 69.45 s > failures:
  2108. 69.45 s > tests::portal_and_developer_pages_use_federated_search_and_feedback
  2109. 69.45 s >
  2110. 69.45 s > test result: FAILED. 0 passed; 1 failed; 0 ignored; 0 measured; 128 filtered out; finished in 0.01s
  2111. 69.45 s > system-err
  2112. 69.45 s > thread 'tests::portal_and_developer_pages_use_federated_search_and_feedback' (420) panicked at crates/alphal00p-docs-builder/src/lib.rs:9684:14:
  2113. 69.45 s > called `Result::unwrap()` on an `Err` value: failed to copy documentation asset crates/spynso3/typst/STIXTwoMath-Regular.woff2
  2114. 69.45 s >
  2115. 69.45 s > Caused by:
  2116. 69.45 s > No such file or directory (os error 2)
  2117. 69.45 s >
  2118. 69.45 s > Location:
  2119. 69.45 s > crates/alphal00p-docs-builder/src/lib.rs:2276:18
  2120. 69.45 s > stack backtrace:
  2121. 69.45 s > 0: __rustc::rust_begin_unwind
  2122. 69.45 s > 1: core::panicking::panic_fmt
  2123. 69.45 s > 2: core::result::unwrap_failed
  2124. 69.45 s > 3: alphal00p_docs_builder::tests::write_test_portal
  2125. 69.45 s > 4: alphal00p_docs_builder::tests::portal_and_developer_pages_use_federated_search_and_feedback
  2126. 69.45 s > 5: <alphal00p_docs_builder::tests::portal_and_developer_pages_use_federated_search_and_feedback::{closure#0} as core::ops::function::FnOnce<()>>::call_once
  2127. 69.45 s > note: Some details are omitted, run with `RUST_BACKTRACE=full` for a verbose backtrace.
  2128. 69.45 s >
  2129. 69.45 s > 4. alphal00p-docs-builder::tests::portal_emits_routes_and_valid_assets
  2130. 69.45 s > failure: test failure with exit code 101
  2131. 69.45 s > thread 'tests::portal_emits_routes_and_valid_assets' (431) panicked at crates/alphal00p-docs-builder/src/lib.rs:9684:14:
  2132. 69.45 s > called `Result::unwrap()` on an `Err` value: failed to copy documentation asset crates/spynso3/typst/STIXTwoMath-Regular.woff2
  2133. 69.45 s >
  2134. 69.45 s > Caused by:
  2135. 69.45 s > No such file or directory (os error 2)
  2136. 69.45 s >
  2137. 69.45 s > Location:
  2138. 69.45 s > crates/alphal00p-docs-builder/src/lib.rs:2276:18
  2139. 69.45 s > stack backtrace:
  2140. 69.45 s > 0: __rustc::rust_begin_unwind
  2141. 69.45 s > 1: core::panicking::panic_fmt
  2142. 69.45 s > 2: core::result::unwrap_failed
  2143. 69.45 s > 3: alphal00p_docs_builder::tests::write_test_portal
  2144. 69.45 s > 4: alphal00p_docs_builder::tests::portal_emits_routes_and_valid_assets
  2145. 69.45 s > 5: <alphal00p_docs_builder::tests::portal_emits_routes_and_valid_assets::{closure#0} as core::ops::function::FnOnce<()>>::call_once
  2146. 69.45 s > note: Some details are omitted, run with `RUST_BACKTRACE=full` for a verbose backtrace.
  2147. 69.45 s > system-out
  2148. 69.45 s > running 1 test
  2149. 69.45 s > test tests::portal_emits_routes_and_valid_assets ... FAILED
  2150. 69.45 s >
  2151. 69.45 s > failures:
  2152. 69.45 s >
  2153. 69.45 s > failures:
  2154. 69.45 s > tests::portal_emits_routes_and_valid_assets
  2155. 69.45 s >
  2156. 69.45 s > test result: FAILED. 0 passed; 1 failed; 0 ignored; 0 measured; 128 filtered out; finished in 0.01s
  2157. 69.45 s > system-err
  2158. 69.45 s > thread 'tests::portal_emits_routes_and_valid_assets' (431) panicked at crates/alphal00p-docs-builder/src/lib.rs:9684:14:
  2159. 69.45 s > called `Result::unwrap()` on an `Err` value: failed to copy documentation asset crates/spynso3/typst/STIXTwoMath-Regular.woff2
  2160. 69.45 s >
  2161. 69.45 s > Caused by:
  2162. 69.45 s > No such file or directory (os error 2)
  2163. 69.45 s >
  2164. 69.45 s > Location:
  2165. 69.45 s > crates/alphal00p-docs-builder/src/lib.rs:2276:18
  2166. 69.45 s > stack backtrace:
  2167. 69.45 s > 0: __rustc::rust_begin_unwind
  2168. 69.45 s > 1: core::panicking::panic_fmt
  2169. 69.45 s > 2: core::result::unwrap_failed
  2170. 69.45 s > 3: alphal00p_docs_builder::tests::write_test_portal
  2171. 69.45 s > 4: alphal00p_docs_builder::tests::portal_emits_routes_and_valid_assets
  2172. 69.45 s > 5: <alphal00p_docs_builder::tests::portal_emits_routes_and_valid_assets::{closure#0} as core::ops::function::FnOnce<()>>::call_once
  2173. 69.45 s > note: Some details are omitted, run with `RUST_BACKTRACE=full` for a verbose backtrace.
  2174. 69.45 s >
  2175. 69.45 s > 5. alphal00p-docs-builder::tests::portal_task_chooser_routes_each_goal_to_the_registered_quickstart
  2176. 69.45 s > failure: test failure with exit code 101
  2177. 69.46 s > thread 'tests::portal_task_chooser_routes_each_goal_to_the_registered_quickstart' (439) panicked at crates/alphal00p-docs-builder/src/lib.rs:9684:14:
  2178. 69.46 s > called `Result::unwrap()` on an `Err` value: failed to copy documentation asset crates/spynso3/typst/STIXTwoMath-Regular.woff2
  2179. 69.46 s >
  2180. 69.46 s > Caused by:
  2181. 69.46 s > No such file or directory (os error 2)
  2182. 69.46 s >
  2183. 69.46 s > Location:
  2184. 69.46 s > crates/alphal00p-docs-builder/src/lib.rs:2276:18
  2185. 69.46 s > stack backtrace:
  2186. 69.46 s > 0: __rustc::rust_begin_unwind
  2187. 69.46 s > 1: core::panicking::panic_fmt
  2188. 69.46 s > 2: core::result::unwrap_failed
  2189. 69.46 s > 3: alphal00p_docs_builder::tests::write_test_portal
  2190. 69.46 s > 4: alphal00p_docs_builder::tests::portal_task_chooser_routes_each_goal_to_the_registered_quickstart
  2191. 69.46 s > 5: <alphal00p_docs_builder::tests::portal_task_chooser_routes_each_goal_to_the_registered_quickstart::{closure#0} as core::ops::function::FnOnce<()>>::call_once
  2192. 69.46 s > note: Some details are omitted, run with `RUST_BACKTRACE=full` for a verbose backtrace.
  2193. 69.46 s > system-out
  2194. 69.46 s > running 1 test
  2195. 69.46 s > test tests::portal_task_chooser_routes_each_goal_to_the_registered_quickstart ... FAILED
  2196. 69.46 s >
  2197. 69.46 s > failures:
  2198. 69.46 s >
  2199. 69.46 s > failures:
  2200. 69.46 s > tests::portal_task_chooser_routes_each_goal_to_the_registered_quickstart
  2201. 69.46 s >
  2202. 69.46 s > test result: FAILED. 0 passed; 1 failed; 0 ignored; 0 measured; 128 filtered out; finished in 0.01s
  2203. 69.46 s > system-err
  2204. 69.46 s > thread 'tests::portal_task_chooser_routes_each_goal_to_the_registered_quickstart' (439) panicked at crates/alphal00p-docs-builder/src/lib.rs:9684:14:
  2205. 69.46 s > called `Result::unwrap()` on an `Err` value: failed to copy documentation asset crates/spynso3/typst/STIXTwoMath-Regular.woff2
  2206. 69.46 s >
  2207. 69.46 s > Caused by:
  2208. 69.46 s > No such file or directory (os error 2)
  2209. 69.46 s >
  2210. 69.46 s > Location:
  2211. 69.46 s > crates/alphal00p-docs-builder/src/lib.rs:2276:18
  2212. 69.46 s > stack backtrace:
  2213. 69.46 s > 0: __rustc::rust_begin_unwind
  2214. 69.46 s > 1: core::panicking::panic_fmt
  2215. 69.46 s > 2: core::result::unwrap_failed
  2216. 69.46 s > 3: alphal00p_docs_builder::tests::write_test_portal
  2217. 69.46 s > 4: alphal00p_docs_builder::tests::portal_task_chooser_routes_each_goal_to_the_registered_quickstart
  2218. 69.46 s > 5: <alphal00p_docs_builder::tests::portal_task_chooser_routes_each_goal_to_the_registered_quickstart::{closure#0} as core::ops::function::FnOnce<()>>::call_once
  2219. 69.46 s > note: Some details are omitted, run with `RUST_BACKTRACE=full` for a verbose backtrace.
  2220. 69.46 s >
  2221. 69.46 s > 6. alphal00p-docs-builder::tests::site_assets_replace_read_only_generated_files
  2222. 69.46 s > failure: test failure with exit code 101
  2223. 69.46 s > thread 'tests::site_assets_replace_read_only_generated_files' (657) panicked at crates/alphal00p-docs-builder/src/lib.rs:12305:50:
  2224. 69.46 s > called `Result::unwrap()` on an `Err` value: failed to copy documentation asset crates/spynso3/typst/STIXTwoMath-Regular.woff2
  2225. 69.46 s >
  2226. 69.46 s > Caused by:
  2227. 69.46 s > No such file or directory (os error 2)
  2228. 69.46 s >
  2229. 69.46 s > Location:
  2230. 69.46 s > crates/alphal00p-docs-builder/src/lib.rs:2276:18
  2231. 69.46 s > stack backtrace:
  2232. 69.46 s > 0: __rustc::rust_begin_unwind
  2233. 69.46 s > 1: core::panicking::panic_fmt
  2234. 69.46 s > 2: core::result::unwrap_failed
  2235. 69.46 s > 3: alphal00p_docs_builder::tests::site_assets_replace_read_only_generated_files
  2236. 69.46 s > 4: <alphal00p_docs_builder::tests::site_assets_replace_read_only_generated_files::{closure#0} as core::ops::function::FnOnce<()>>::call_once
  2237. 69.46 s > note: Some details are omitted, run with `RUST_BACKTRACE=full` for a verbose backtrace.
  2238. 69.46 s > system-out
  2239. 69.46 s > running 1 test
  2240. 69.46 s > test tests::site_assets_replace_read_only_generated_files ... FAILED
  2241. 69.46 s >
  2242. 69.46 s > failures:
  2243. 69.46 s >
  2244. 69.46 s > failures:
  2245. 69.46 s > tests::site_assets_replace_read_only_generated_files
  2246. 69.46 s >
  2247. 69.46 s > test result: FAILED. 0 passed; 1 failed; 0 ignored; 0 measured; 128 filtered out; finished in 0.00s
  2248. 69.46 s > system-err
  2249. 69.46 s > thread 'tests::site_assets_replace_read_only_generated_files' (657) panicked at crates/alphal00p-docs-builder/src/lib.rs:12305:50:
  2250. 69.46 s > called `Result::unwrap()` on an `Err` value: failed to copy documentation asset crates/spynso3/typst/STIXTwoMath-Regular.woff2
  2251. 69.46 s >
  2252. 69.46 s > Caused by:
  2253. 69.46 s > No such file or directory (os error 2)
  2254. 69.46 s >
  2255. 69.46 s > Location:
  2256. 69.46 s > crates/alphal00p-docs-builder/src/lib.rs:2276:18
  2257. 69.46 s > stack backtrace:
  2258. 69.46 s > 0: __rustc::rust_begin_unwind
  2259. 69.46 s > 1: core::panicking::panic_fmt
  2260. 69.46 s > 2: core::result::unwrap_failed
  2261. 69.46 s > 3: alphal00p_docs_builder::tests::site_assets_replace_read_only_generated_files
  2262. 69.46 s > 4: <alphal00p_docs_builder::tests::site_assets_replace_read_only_generated_files::{closure#0} as core::ops::function::FnOnce<()>>::call_once
  2263. 69.46 s > note: Some details are omitted, run with `RUST_BACKTRACE=full` for a verbose backtrace.
  2264. 69.46 s >
  2265. 69.46 s > 7. alphal00p-docs-builder::tests::checked_in_registry_is_valid
  2266. 69.46 s > failure: test failure with exit code 101
  2267. 69.46 s > thread 'tests::checked_in_registry_is_valid' (195) panicked at crates/alphal00p-docs-builder/src/lib.rs:12260:50:
  2268. 69.46 s > called `Result::unwrap()` on an `Err` value: required documentation source is missing: /build/source/crates/spynso3/typst/STIXTwoMath-Regular.woff2
  2269. 69.46 s >
  2270. 69.46 s > Location:
  2271. 69.46 s > crates/alphal00p-docs-builder/src/lib.rs:5103:9
  2272. 69.46 s > stack backtrace:
  2273. 69.46 s > 0: __rustc::rust_begin_unwind
  2274. 69.46 s > 1: core::panicking::panic_fmt
  2275. 69.46 s > 2: core::result::unwrap_failed
  2276. 69.46 s > 3: alphal00p_docs_builder::tests::checked_in_registry_is_valid
  2277. 69.46 s > 4: <alphal00p_docs_builder::tests::checked_in_registry_is_valid::{closure#0} as core::ops::function::FnOnce<()>>::call_once
  2278. 69.46 s > note: Some details are omitted, run with `RUST_BACKTRACE=full` for a verbose backtrace.
  2279. 69.46 s > system-out
  2280. 69.46 s > running 1 test
  2281. 69.46 s > test tests::checked_in_registry_is_valid ... FAILED
  2282. 69.46 s >
  2283. 69.46 s > failures:
  2284. 69.46 s >
  2285. 69.46 s > failures:
  2286. 69.46 s > tests::checked_in_registry_is_valid
  2287. 69.46 s >
  2288. 69.46 s > test result: FAILED. 0 passed; 1 failed; 0 ignored; 0 measured; 128 filtered out; finished in 0.12s
  2289. 69.46 s > system-err
  2290. 69.46 s > thread 'tests::checked_in_registry_is_valid' (195) panicked at crates/alphal00p-docs-builder/src/lib.rs:12260:50:
  2291. 69.46 s > called `Result::unwrap()` on an `Err` value: required documentation source is missing: /build/source/crates/spynso3/typst/STIXTwoMath-Regular.woff2
  2292. 69.46 s >
  2293. 69.46 s > Location:
  2294. 69.46 s > crates/alphal00p-docs-builder/src/lib.rs:5103:9
  2295. 69.46 s > stack backtrace:
  2296. 69.46 s > 0: __rustc::rust_begin_unwind
  2297. 69.46 s > 1: core::panicking::panic_fmt
  2298. 69.46 s > 2: core::result::unwrap_failed
  2299. 69.46 s > 3: alphal00p_docs_builder::tests::checked_in_registry_is_valid
  2300. 69.46 s > 4: <alphal00p_docs_builder::tests::checked_in_registry_is_valid::{closure#0} as core::ops::function::FnOnce<()>>::call_once
  2301. 69.46 s > note: Some details are omitted, run with `RUST_BACKTRACE=full` for a verbose backtrace.
  2302. 69.46 s >
  2303. 69.46 s > 8. alphal00p-docs-builder::provenance_tests::each_build_captures_one_revision_before_rendering
  2304. 69.46 s > failure: test failure with exit code 101
  2305. 69.46 s > thread 'provenance_tests::each_build_captures_one_revision_before_rendering' (192) panicked at crates/alphal00p-docs-builder/src/provenance_tests.rs:274:9:
  2306. 69.46 s > assertion failed: command.status().unwrap().success()
  2307. 69.46 s > stack backtrace:
  2308. 69.46 s > 0: __rustc::rust_begin_unwind
  2309. 69.46 s > 1: core::panicking::panic_fmt
  2310. 69.46 s > 2: core::panicking::panic
  2311. 69.46 s > 3: alphal00p_docs_builder::provenance_tests::each_build_captures_one_revision_before_rendering
  2312. 69.46 s > 4: <alphal00p_docs_builder::provenance_tests::each_build_captures_one_revision_before_rendering::{closure#0} as core::ops::function::FnOnce<()>>::call_once
  2313. 69.46 s > note: Some details are omitted, run with `RUST_BACKTRACE=full` for a verbose backtrace.
  2314. 69.46 s > system-out
  2315. 69.46 s > running 1 test
  2316. 69.46 s >
  2317. 69.46 s > running 1 test
  2318. 69.46 s > test provenance_tests::each_build_captures_one_revision_before_rendering ... FAILED
  2319. 69.46 s >
  2320. 69.46 s > failures:
  2321. 69.46 s >
  2322. 69.46 s > failures:
  2323. 69.46 s > provenance_tests::each_build_captures_one_revision_before_rendering
  2324. 69.46 s >
  2325. 69.46 s > test result: FAILED. 0 passed; 1 failed; 0 ignored; 0 measured; 128 filtered out; finished in 0.12s
  2326. 69.46 s >
  2327. 69.46 s > test provenance_tests::each_build_captures_one_revision_before_rendering ... FAILED
  2328. 69.46 s >
  2329. 69.46 s > failures:
  2330. 69.46 s >
  2331. 69.46 s > failures:
  2332. 69.46 s > provenance_tests::each_build_captures_one_revision_before_rendering
  2333. 69.46 s >
  2334. 69.46 s > test result: FAILED. 0 passed; 1 failed; 0 ignored; 0 measured; 128 filtered out; finished in 0.13s
  2335. 69.46 s > system-err
  2336. 69.46 s > thread 'provenance_tests::each_build_captures_one_revision_before_rendering' (250) panicked at crates/alphal00p-docs-builder/src/provenance_tests.rs:297:14:
  2337. 69.46 s > called `Result::unwrap()` on an `Err` value: required documentation source is missing: /build/source/target/nix-ci-tmp/.tmpH2EaaK/checkout/crates/spynso3/typst/STIXTwoMath-Regular.woff2
  2338. 69.46 s >
  2339. 69.46 s > Location:
  2340. 69.46 s > crates/alphal00p-docs-builder/src/lib.rs:5103:9
  2341. 69.46 s > stack backtrace:
  2342. 69.46 s > 0: __rustc::rust_begin_unwind
  2343. 69.46 s > 1: core::panicking::panic_fmt
  2344. 69.46 s > 2: core::result::unwrap_failed
  2345. 69.46 s > 3: alphal00p_docs_builder::provenance_tests::each_build_captures_one_revision_before_rendering
  2346. 69.46 s > 4: <alphal00p_docs_builder::provenance_tests::each_build_captures_one_revision_before_rendering::{closure#0} as core::ops::function::FnOnce<()>>::call_once
  2347. 69.46 s > note: Some details are omitted, run with `RUST_BACKTRACE=full` for a verbose backtrace.
  2348. 69.46 s >
  2349. 69.46 s > thread 'provenance_tests::each_build_captures_one_revision_before_rendering' (192) panicked at crates/alphal00p-docs-builder/src/provenance_tests.rs:274:9:
  2350. 69.46 s > assertion failed: command.status().unwrap().success()
  2351. 69.46 s > stack backtrace:
  2352. 69.46 s > 0: __rustc::rust_begin_unwind
  2353. 69.46 s > 1: core::panicking::panic_fmt
  2354. 69.46 s > 2: core::panicking::panic
  2355. 69.46 s > 3: alphal00p_docs_builder::provenance_tests::each_build_captures_one_revision_before_rendering
  2356. 69.46 s > 4: <alphal00p_docs_builder::provenance_tests::each_build_captures_one_revision_before_rendering::{closure#0} as core::ops::function::FnOnce<()>>::call_once
  2357. 69.46 s > note: Some details are omitted, run with `RUST_BACKTRACE=full` for a verbose backtrace.
  2358. 69.46 s >
  2359. 69.46 s > 9. alphal00p-docs-builder::tests::developer_scope_ranges_ignore_unrelated_edits_and_warn_only_while_watching
  2360. 69.46 s > failure: test failure with exit code 101
  2361. 69.46 s > thread 'tests::developer_scope_ranges_ignore_unrelated_edits_and_warn_only_while_watching' (285) panicked at crates/alphal00p-docs-builder/src/lib.rs:12350:29:
  2362. 69.46 s > called `Result::unwrap()` on an `Err` value: required documentation source is missing: /build/source/crates/spynso3/typst/STIXTwoMath-Regular.woff2
  2363. 69.46 s >
  2364. 69.46 s > Location:
  2365. 69.46 s > crates/alphal00p-docs-builder/src/lib.rs:5103:9
  2366. 69.46 s > stack backtrace:
  2367. 69.46 s > 0: __rustc::rust_begin_unwind
  2368. 69.46 s > 1: core::panicking::panic_fmt
  2369. 69.46 s > 2: core::result::unwrap_failed
  2370. 69.46 s > 3: alphal00p_docs_builder::tests::developer_scope_ranges_ignore_unrelated_edits_and_warn_only_while_watching
  2371. 69.46 s > 4: <alphal00p_docs_builder::tests::developer_scope_ranges_ignore_unrelated_edits_and_warn_only_while_watching::{closure#0} as core::ops::function::FnOnce<()>>::call_once
  2372. 69.46 s > note: Some details are omitted, run with `RUST_BACKTRACE=full` for a verbose backtrace.
  2373. 69.46 s > system-out
  2374. 69.46 s > running 1 test
  2375. 69.46 s > test tests::developer_scope_ranges_ignore_unrelated_edits_and_warn_only_while_watching ... FAILED
  2376. 69.46 s >
  2377. 69.46 s > failures:
  2378. 69.46 s >
  2379. 69.46 s > failures:
  2380. 69.46 s > tests::developer_scope_ranges_ignore_unrelated_edits_and_warn_only_while_watching
  2381. 69.46 s >
  2382. 69.46 s > test result: FAILED. 0 passed; 1 failed; 0 ignored; 0 measured; 128 filtered out; finished in 0.12s
  2383. 69.46 s > system-err
  2384. 69.46 s > thread 'tests::developer_scope_ranges_ignore_unrelated_edits_and_warn_only_while_watching' (285) panicked at crates/alphal00p-docs-builder/src/lib.rs:12350:29:
  2385. 69.46 s > called `Result::unwrap()` on an `Err` value: required documentation source is missing: /build/source/crates/spynso3/typst/STIXTwoMath-Regular.woff2
  2386. 69.46 s >
  2387. 69.46 s > Location:
  2388. 69.46 s > crates/alphal00p-docs-builder/src/lib.rs:5103:9
  2389. 69.46 s > stack backtrace:
  2390. 69.46 s > 0: __rustc::rust_begin_unwind
  2391. 69.46 s > 1: core::panicking::panic_fmt
  2392. 69.46 s > 2: core::result::unwrap_failed
  2393. 69.46 s > 3: alphal00p_docs_builder::tests::developer_scope_ranges_ignore_unrelated_edits_and_warn_only_while_watching
  2394. 69.46 s > 4: <alphal00p_docs_builder::tests::developer_scope_ranges_ignore_unrelated_edits_and_warn_only_while_watching::{closure#0} as core::ops::function::FnOnce<()>>::call_once
  2395. 69.46 s > note: Some details are omitted, run with `RUST_BACKTRACE=full` for a verbose backtrace.
  2396. 69.46 s >
  2397. 69.46 s > 10. alphal00p-docs-builder::tests::every_product_requires_a_task_chooser_and_each_supported_interface
  2398. 69.46 s > failure: test failure with exit code 101
  2399. 69.46 s > thread 'tests::every_product_requires_a_task_chooser_and_each_supported_interface' (312) panicked at crates/alphal00p-docs-builder/src/lib.rs:12274:9:
  2400. 69.46 s > assertion failed: format!("{error:#}").contains("has no quickstart page")
  2401. 69.46 s > stack backtrace:
  2402. 69.46 s > 0: __rustc::rust_begin_unwind
  2403. 69.46 s > 1: core::panicking::panic_fmt
  2404. 69.46 s > 2: core::panicking::panic
  2405. 69.46 s > 3: alphal00p_docs_builder::tests::every_product_requires_a_task_chooser_and_each_supported_interface
  2406. 69.46 s > 4: <alphal00p_docs_builder::tests::every_product_requires_a_task_chooser_and_each_supported_interface::{closure#0} as core::ops::function::FnOnce<()>>::call_once
  2407. 69.46 s > note: Some details are omitted, run with `RUST_BACKTRACE=full` for a verbose backtrace.
  2408. 69.46 s > system-out
  2409. 69.46 s > running 1 test
  2410. 69.46 s > test tests::every_product_requires_a_task_chooser_and_each_supported_interface ... FAILED
  2411. 69.46 s >
  2412. 69.46 s > failures:
  2413. 69.46 s >
  2414. 69.46 s > failures:
  2415. 69.46 s > tests::every_product_requires_a_task_chooser_and_each_supported_interface
  2416. 69.46 s >
  2417. 69.46 s > test result: FAILED. 0 passed; 1 failed; 0 ignored; 0 measured; 128 filtered out; finished in 0.12s
  2418. 69.46 s > system-err
  2419. 69.46 s > thread 'tests::every_product_requires_a_task_chooser_and_each_supported_interface' (312) panicked at crates/alphal00p-docs-builder/src/lib.rs:12274:9:
  2420. 69.46 s > assertion failed: format!("{error:#}").contains("has no quickstart page")
  2421. 69.46 s > stack backtrace:
  2422. 69.46 s > 0: __rustc::rust_begin_unwind
  2423. 69.46 s > 1: core::panicking::panic_fmt
  2424. 69.46 s > 2: core::panicking::panic
  2425. 69.46 s > 3: alphal00p_docs_builder::tests::every_product_requires_a_task_chooser_and_each_supported_interface
  2426. 69.46 s > 4: <alphal00p_docs_builder::tests::every_product_requires_a_task_chooser_and_each_supported_interface::{closure#0} as core::ops::function::FnOnce<()>>::call_once
  2427. 69.46 s > note: Some details are omitted, run with `RUST_BACKTRACE=full` for a verbose backtrace.
  2428. 69.46 s >
  2429. 69.46 s > 11. alphal00p-docs-builder::tests::pdf_manual_chapter_order_must_match_the_page_registry
  2430. 69.46 s > failure: test failure with exit code 101
  2431. 69.46 s > thread 'tests::pdf_manual_chapter_order_must_match_the_page_registry' (393) panicked at crates/alphal00p-docs-builder/src/lib.rs:12330:9:
  2432. 69.46 s > assertion failed: format!("{error:#}").contains("PDF manual chapter order differs")
  2433. 69.46 s > stack backtrace:
  2434. 69.46 s > 0: __rustc::rust_begin_unwind
  2435. 69.46 s > 1: core::panicking::panic_fmt
  2436. 69.46 s > 2: core::panicking::panic
  2437. 69.46 s > 3: alphal00p_docs_builder::tests::pdf_manual_chapter_order_must_match_the_page_registry
  2438. 69.46 s > 4: <alphal00p_docs_builder::tests::pdf_manual_chapter_order_must_match_the_page_registry::{closure#0} as core::ops::function::FnOnce<()>>::call_once
  2439. 69.46 s > note: Some details are omitted, run with `RUST_BACKTRACE=full` for a verbose backtrace.
  2440. 69.46 s > system-out
  2441. 69.46 s > running 1 test
  2442. 69.46 s > test tests::pdf_manual_chapter_order_must_match_the_page_registry ... FAILED
  2443. 69.46 s >
  2444. 69.46 s > failures:
  2445. 69.46 s >
  2446. 69.46 s > failures:
  2447. 69.46 s > tests::pdf_manual_chapter_order_must_match_the_page_registry
  2448. 69.46 s >
  2449. 69.46 s > test result: FAILED. 0 passed; 1 failed; 0 ignored; 0 measured; 128 filtered out; finished in 0.11s
  2450. 69.46 s > system-err
  2451. 69.46 s > thread 'tests::pdf_manual_chapter_order_must_match_the_page_registry' (393) panicked at crates/alphal00p-docs-builder/src/lib.rs:12330:9:
  2452. 69.46 s > assertion failed: format!("{error:#}").contains("PDF manual chapter order differs")
  2453. 69.46 s > stack backtrace:
  2454. 69.46 s > 0: __rustc::rust_begin_unwind
  2455. 69.46 s > 1: core::panicking::panic_fmt
  2456. 69.46 s > 2: core::panicking::panic
  2457. 69.46 s > 3: alphal00p_docs_builder::tests::pdf_manual_chapter_order_must_match_the_page_registry
  2458. 69.46 s > 4: <alphal00p_docs_builder::tests::pdf_manual_chapter_order_must_match_the_page_registry::{closure#0} as core::ops::function::FnOnce<()>>::call_once
  2459. 69.46 s > note: Some details are omitted, run with `RUST_BACKTRACE=full` for a verbose backtrace.
  2460. 69.46 s > =========================================
  2461. 69.46 s > Extracting 2 binaries to /build/source
  2462. 69.46 s > Extracted 5 files to /build/source in 0.04s
  2463. 69.46 s > ------------
  2464. 69.46 s > Nextest run ID c85bfe55-2751-452c-a6f5-63723ac9c32c with nextest profile: ci_gammaloop
  2465. 69.46 s > Starting 22 tests across 2 binaries
  2466. 69.46 s > ------------
  2467. 69.46 s > Summary [ 0.019s] 22 tests run: 22 passed, 0 skipped
  2468. 69.46 s >
  2469. 69.46 s > ========== nextest test summary ==========
  2470. 69.46 s > report: target/nextest/ci_gammaloop/junit.xml
  2471. 69.46 s > tests: 22, failures: 0, errors: 0
  2472. 69.46 s > No failing testcases found.
  2473. 69.46 s > =========================================
  2474. 69.46 s > Extracting 3 binaries (including 2 non-test binaries), 1 build script output directory, and 2 linked paths to /build/source
  2475. 69.46 s > Extracted 22 files to /build/source in 0.25s
  2476. 69.46 s > ------------
  2477. 69.46 s > Nextest run ID 3cb74e23-7de6-44e7-b908-d735912a69bb with nextest profile: ci_gammaloop
  2478. 69.46 s > Starting 89 tests across 1 binary
  2479. 69.46 s > ------------
  2480. 69.46 s > Summary [ 0.044s] 89 tests run: 89 passed, 0 skipped
  2481. 69.46 s >
  2482. 69.46 s > ========== nextest test summary ==========
  2483. 69.46 s > report: target/nextest/ci_gammaloop/junit.xml
  2484. 69.46 s > tests: 89, failures: 0, errors: 0
  2485. 69.46 s > No failing testcases found.
  2486. 69.46 s > =========================================
  2487. 69.46 s > Extracting 2 binaries to /build/source
  2488. 69.46 s > Extracted 5 files to /build/source in 0.04s
  2489. 69.46 s > ------------
  2490. 69.46 s > Nextest run ID 2ccc36a9-9ef3-4cff-bf63-f78f60cf6d63 with nextest profile: ci_gammaloop
  2491. 69.46 s > Starting 10 tests across 2 binaries
  2492. 69.46 s > ------------
  2493. 69.46 s > Summary [ 12.226s] 10 tests run: 10 passed, 0 skipped
  2494. 69.46 s >
  2495. 69.46 s > ========== nextest test summary ==========
  2496. 69.46 s > report: target/nextest/ci_gammaloop/junit.xml
  2497. 69.46 s > tests: 10, failures: 0, errors: 0
  2498. 69.46 s > No failing testcases found.
  2499. 69.46 s > =========================================
  2500. 69.46 s > Extracting 1 binary to /build/source
  2501. 69.46 s > Extracted 4 files to /build/source in 0.03s
  2502. 69.46 s > ------------
  2503. 69.46 s > Nextest run ID 42c549a1-e0e2-44c0-9447-a3d4c21c7b6d with nextest profile: ci_gammaloop
  2504. 69.46 s > Starting 0 tests across 1 binary
  2505. 69.46 s > ------------
  2506. 69.46 s > Summary [ 0.000s] 0 tests run: 0 passed, 0 skipped
  2507. 69.46 s >
  2508. 69.46 s > ========== nextest test summary ==========
  2509. 69.46 s > report: target/nextest/ci_gammaloop/junit.xml
  2510. 69.46 s > tests: 0, failures: 0, errors: 0
  2511. 69.46 s > No failing testcases found.
  2512. 69.46 s > =========================================
  2513. 69.46 s > Extracting 1 binary to /build/source
  2514. 69.46 s > Extracted 4 files to /build/source in 0.04s
  2515. 69.46 s > ------------
  2516. 69.46 s > Nextest run ID 43b03e6b-ed68-4614-be20-9bb70c2474fd with nextest profile: ci_gammaloop
  2517. 69.46 s > Starting 5 tests across 1 binary
  2518. 69.46 s > ------------
  2519. 69.46 s > Summary [ 0.005s] 5 tests run: 5 passed, 0 skipped
  2520. 69.46 s >
  2521. 69.46 s > ========== nextest test summary ==========
  2522. 69.46 s > report: target/nextest/ci_gammaloop/junit.xml
  2523. 69.46 s > tests: 5, failures: 0, errors: 0
  2524. 69.46 s > No failing testcases found.
  2525. 69.46 s > =========================================
  2526. 69.46 s For full logs, run:
  2527. 69.46 s nix log /nix/store/lss98va6a34sawhfmb9hflr4awgmkih4-gammaloop-nextest-docs.drv
  2528. 69.63 s [3 built (1 failed), 109Run failed.