1. 0.00 s $ /nix/store/61685rbaxmpigwi3z23i33sv3jyfl70q-coreutils-9.11/bin/timeout --kill-after=15s 7200s /nix/store/wknkybkzrc16r11vk5vrykh4wmw7a353-nix-2.34.8/bin/nix --extra-experimental-features nix-command --extra-experimental-features flakes flake clone git+https://github.com/alphal00p/gammaloop --dest /tmp/nix-ci-worker/stable-pwd/repo/
  2. 0.07 s Cloning into '/tmp/nix-ci-worker/stable-pwd/repo'...
  3. 1.12 s remote: Enumerating objects: 103784, done.
  4. 1.70 s remote: Counting objects: 0% (1/9451) remote: Counting objects: 1% (95/9451) remote: Counting objects: 2% (190/9451) remote: Counting objects: 3% (284/9451) remote: Counting objects: 4% (379/9451) remote: Counting objects: 5% (473/9451) remote: Counting objects: 6% (568/9451) remote: Counting objects: 7% (662/9451) remote: Counting objects: 8% (757/9451) remote: Counting objects: 9% (851/9451) remote: Counting objects: 10% (946/9451) remote: Counting objects: 11% (1040/9451) remote: Counting objects: 12% (1135/9451) remote: Counting objects: 13% (1229/9451) remote: Counting objects: 14% (1324/9451) remote: Counting objects: 15% (1418/9451) remote: Counting objects: 16% (1513/9451) remote: Counting objects: 17% (1607/9451) remote: Counting objects: 18% (1702/9451) remote: Counting objects: 19% (1796/9451) remote: Counting objects: 20% (1891/9451) remote: Counting objects: 21% (1985/9451) remote: Counting objects: 22% (2080/9451) remote: Counting objects: 23% (2174/9451) remote: Counting objects: 24% (2269/9451) remote: Counting objects: 25% (2363/9451) remote: Counting objects: 26% (2458/9451) remote: Counting objects: 27% (2552/9451) remote: Counting objects: 28% (2647/9451) remote: Counting objects: 29% (2741/9451) remote: Counting objects: 30% (2836/9451) remote: Counting objects: 31% (2930/9451) remote: Counting objects: 32% (3025/9451) remote: Counting objects: 33% (3119/9451) remote: Counting objects: 34% (3214/9451) remote: Counting objects: 35% (3308/9451) remote: Counting objects: 36% (3403/9451) remote: Counting objects: 37% (3497/9451) remote: Counting objects: 38% (3592/9451) remote: Counting objects: 39% (3686/9451) remote: Counting objects: 40% (3781/9451) remote: Counting objects: 41% (3875/9451) remote: Counting objects: 42% (3970/9451) remote: Counting objects: 43% (4064/9451) remote: Counting objects: 44% (4159/9451) remote: Counting objects: 45% (4253/9451) remote: Counting objects: 46% (4348/9451) remote: Counting objects: 47% (4442/9451) remote: Counting objects: 48% (4537/9451) remote: Counting objects: 49% (4631/9451) remote: Counting objects: 50% (4726/9451) remote: Counting objects: 51% (4821/9451) remote: Counting objects: 52% (4915/9451) remote: Counting objects: 53% (5010/9451) remote: Counting objects: 54% (5104/9451) remote: Counting objects: 55% (5199/9451) remote: Counting objects: 56% (5293/9451) remote: Counting objects: 57% (5388/9451) remote: Counting objects: 58% (5482/9451) remote: Counting objects: 59% (5577/9451) remote: Counting objects: 60% (5671/9451) remote: Counting objects: 61% (5766/9451) remote: Counting objects: 62% (5860/9451) remote: Counting objects: 63% (5955/9451) remote: Counting objects: 64% (6049/9451) remote: Counting objects: 65% (6144/9451) remote: Counting objects: 66% (6238/9451) remote: Counting objects: 67% (6333/9451) remote: Counting objects: 68% (6427/9451) remote: Counting objects: 69% (6522/9451) remote: Counting objects: 70% (6616/9451) remote: Counting objects: 71% (6711/9451) remote: Counting objects: 72% (6805/9451) remote: Counting objects: 73% (6900/9451) remote: Counting objects: 74% (6994/9451) remote: Counting objects: 75% (7089/9451) remote: Counting objects: 76% (7183/9451) remote: Counting objects: 77% (7278/9451) remote: Counting objects: 78% (7372/9451) remote: Counting objects: 79% (7467/9451) remote: Counting objects: 80% (7561/9451) remote: Counting objects: 81% (7656/9451) remote: Counting objects: 82% (7750/9451) remote: Counting objects: 83% (7845/9451) remote: Counting objects: 84% (7939/9451) remote: Counting objects: 85% (8034/9451) remote: Counting objects: 86% (8128/9451) remote: Counting objects: 87% (8223/9451) remote: Counting objects: 88% (8317/9451) remote: Counting objects: 89% (8412/9451) remote: Counting objects: 90% (8506/9451) remote: Counting objects: 91% (8601/9451) remote: Counting objects: 92% (8695/9451) remote: Counting objects: 93% (8790/9451) remote: Counting objects: 94% (8884/9451) remote: Counting objects: 95% (8979/9451) remote: Counting objects: 96% (9073/9451) remote: Counting objects: 97% (9168/9451) remote: Counting objects: 98% (9262/9451) remote: Counting objects: 99% (9357/9451) remote: Counting objects: 100% (9451/9451) remote: Counting objects: 100% (9451/9451), done.
  5. 3.25 s remote: Compressing objects: 0% (1/2031) remote: Compressing objects: 1% (21/2031) remote: Compressing objects: 2% (41/2031) remote: Compressing objects: 3% (61/2031) remote: Compressing objects: 4% (82/2031) remote: Compressing objects: 5% (102/2031) remote: Compressing objects: 6% (122/2031) remote: Compressing objects: 7% (143/2031) remote: Compressing objects: 8% (163/2031) remote: Compressing objects: 9% (183/2031) remote: Compressing objects: 10% (204/2031) remote: Compressing objects: 10% (215/2031) remote: Compressing objects: 11% (224/2031) remote: Compressing objects: 12% (244/2031) remote: Compressing objects: 13% (265/2031) remote: Compressing objects: 14% (285/2031) remote: Compressing objects: 15% (305/2031) remote: Compressing objects: 16% (325/2031) remote: Compressing objects: 17% (346/2031) remote: Compressing objects: 18% (366/2031) remote: Compressing objects: 19% (386/2031) remote: Compressing objects: 20% (407/2031) remote: Compressing objects: 21% (427/2031) remote: Compressing objects: 22% (447/2031) remote: Compressing objects: 23% (468/2031) remote: Compressing objects: 24% (488/2031) remote: Compressing objects: 25% (508/2031) remote: Compressing objects: 26% (529/2031) remote: Compressing objects: 27% (549/2031) remote: Compressing objects: 28% (569/2031) remote: Compressing objects: 29% (589/2031) remote: Compressing objects: 30% (610/2031) remote: Compressing objects: 31% (630/2031) remote: Compressing objects: 31% (635/2031) remote: Compressing objects: 32% (650/2031) remote: Compressing objects: 33% (671/2031) remote: Compressing objects: 34% (691/2031) remote: Compressing objects: 35% (711/2031) remote: Compressing objects: 36% (732/2031) remote: Compressing objects: 37% (752/2031) remote: Compressing objects: 38% (772/2031) remote: Compressing objects: 39% (793/2031) remote: Compressing objects: 40% (813/2031) remote: Compressing objects: 41% (833/2031) remote: Compressing objects: 42% (854/2031) remote: Compressing objects: 43% (874/2031) remote: Compressing objects: 44% (894/2031) remote: Compressing objects: 45% (914/2031) remote: Compressing objects: 46% (935/2031) remote: Compressing objects: 47% (955/2031) remote: Compressing objects: 48% (975/2031) remote: Compressing objects: 49% (996/2031) remote: Compressing objects: 50% (1016/2031) remote: Compressing objects: 51% (1036/2031) remote: Compressing objects: 52% (1057/2031) remote: Compressing objects: 53% (1077/2031) remote: Compressing objects: 54% (1097/2031) remote: Compressing objects: 55% (1118/2031) remote: Compressing objects: 56% (1138/2031) remote: Compressing objects: 57% (1158/2031) remote: Compressing objects: 58% (1178/2031) remote: Compressing objects: 59% (1199/2031) remote: Compressing objects: 60% (1219/2031) remote: Compressing objects: 61% (1239/2031) remote: Compressing objects: 62% (1260/2031) remote: Compressing objects: 63% (1280/2031) remote: Compressing objects: 64% (1300/2031) remote: Compressing objects: 65% (1321/2031) remote: Compressing objects: 66% (1341/2031) remote: Compressing objects: 67% (1361/2031) remote: Compressing objects: 68% (1382/2031) remote: Compressing objects: 69% (1402/2031) remote: Compressing objects: 70% (1422/2031) remote: Compressing objects: 71% (1443/2031) remote: Compressing objects: 72% (1463/2031) remote: Compressing objects: 73% (1483/2031) remote: Compressing objects: 74% (1503/2031) remote: Compressing objects: 75% (1524/2031) remote: Compressing objects: 76% (1544/2031) remote: Compressing objects: 77% (1564/2031) remote: Compressing objects: 78% (1585/2031) remote: Compressing objects: 79% (1605/2031) remote: Compressing objects: 80% (1625/2031) remote: Compressing objects: 81% (1646/2031) remote: Compressing objects: 82% (1666/2031) remote: Compressing objects: 83% (1686/2031) remote: Compressing objects: 84% (1707/2031) remote: Compressing objects: 85% (1727/2031) remote: Compressing objects: 86% (1747/2031) remote: Compressing objects: 87% (1767/2031) remote: Compressing objects: 88% (1788/2031) remote: Compressing objects: 89% (1808/2031) remote: Compressing objects: 90% (1828/2031) remote: Compressing objects: 91% (1849/2031) remote: Compressing objects: 92% (1869/2031) remote: Compressing objects: 93% (1889/2031) remote: Compressing objects: 94% (1910/2031) remote: Compressing objects: 95% (1930/2031) remote: Compressing objects: 96% (1950/2031) remote: Compressing objects: 97% (1971/2031) remote: Compressing objects: 98% (1991/2031) remote: Compressing objects: 99% (2011/2031) remote: Compressing objects: 100% (2031/2031) remote: Compressing objects: 100% (2031/2031), done.
  6. 17.38 s Receiving objects: 0% (1/103784) Receiving objects: 1% (1038/103784) Receiving objects: 2% (2076/103784) Receiving objects: 3% (3114/103784), 7.22 MiB | 14.37 MiB/s Receiving objects: 4% (4152/103784), 7.22 MiB | 14.37 MiB/s Receiving objects: 5% (5190/103784), 7.22 MiB | 14.37 MiB/s Receiving objects: 6% (6228/103784), 7.22 MiB | 14.37 MiB/s Receiving objects: 6% (7233/103784), 16.79 MiB | 16.74 MiB/s Receiving objects: 7% (7265/103784), 16.79 MiB | 16.74 MiB/s Receiving objects: 8% (8303/103784), 16.79 MiB | 16.74 MiB/s Receiving objects: 9% (9341/103784), 16.79 MiB | 16.74 MiB/s Receiving objects: 10% (10379/103784), 16.79 MiB | 16.74 MiB/s Receiving objects: 11% (11417/103784), 16.79 MiB | 16.74 MiB/s Receiving objects: 12% (12455/103784), 16.79 MiB | 16.74 MiB/s Receiving objects: 13% (13492/103784), 16.79 MiB | 16.74 MiB/s Receiving objects: 14% (14530/103784), 16.79 MiB | 16.74 MiB/s Receiving objects: 15% (15568/103784), 16.79 MiB | 16.74 MiB/s Receiving objects: 16% (16606/103784), 16.79 MiB | 16.74 MiB/s Receiving objects: 17% (17644/103784), 16.79 MiB | 16.74 MiB/s Receiving objects: 18% (18682/103784), 16.79 MiB | 16.74 MiB/s Receiving objects: 19% (19719/103784), 16.79 MiB | 16.74 MiB/s Receiving objects: 20% (20757/103784), 16.79 MiB | 16.74 MiB/s Receiving objects: 21% (21795/103784), 16.79 MiB | 16.74 MiB/s Receiving objects: 22% (22833/103784), 16.79 MiB | 16.74 MiB/s Receiving objects: 23% (23871/103784), 16.79 MiB | 16.74 MiB/s Receiving objects: 24% (24909/103784), 16.79 MiB | 16.74 MiB/s Receiving objects: 25% (25946/103784), 16.79 MiB | 16.74 MiB/s Receiving objects: 26% (26984/103784), 16.79 MiB | 16.74 MiB/s Receiving objects: 27% (28022/103784), 16.79 MiB | 16.74 MiB/s Receiving objects: 28% (29060/103784), 16.79 MiB | 16.74 MiB/s Receiving objects: 29% (30098/103784), 16.79 MiB | 16.74 MiB/s Receiving objects: 30% (31136/103784), 16.79 MiB | 16.74 MiB/s Receiving objects: 31% (32174/103784), 16.79 MiB | 16.74 MiB/s Receiving objects: 32% (33211/103784), 30.91 MiB | 20.57 MiB/s Receiving objects: 33% (34249/103784), 30.91 MiB | 20.57 MiB/s Receiving objects: 34% (35287/103784), 30.91 MiB | 20.57 MiB/s Receiving objects: 35% (36325/103784), 30.91 MiB | 20.57 MiB/s Receiving objects: 36% (37363/103784), 30.91 MiB | 20.57 MiB/s Receiving objects: 37% (38401/103784), 30.91 MiB | 20.57 MiB/s Receiving objects: 38% (39438/103784), 30.91 MiB | 20.57 MiB/s Receiving objects: 38% (39568/103784), 30.91 MiB | 20.57 MiB/s Receiving objects: 39% (40476/103784), 45.99 MiB | 22.97 MiB/s Receiving objects: 40% (41514/103784), 45.99 MiB | 22.97 MiB/s Receiving objects: 41% (42552/103784), 45.99 MiB | 22.97 MiB/s Receiving objects: 42% (43590/103784), 45.99 MiB | 22.97 MiB/s Receiving objects: 43% (44628/103784), 45.99 MiB | 22.97 MiB/s Receiving objects: 44% (45665/103784), 45.99 MiB | 22.97 MiB/s Receiving objects: 45% (46703/103784), 45.99 MiB | 22.97 MiB/s Receiving objects: 46% (47741/103784), 45.99 MiB | 22.97 MiB/s Receiving objects: 47% (48779/103784), 61.37 MiB | 24.53 MiB/s Receiving objects: 48% (49817/103784), 61.37 MiB | 24.53 MiB/s Receiving objects: 49% (50855/103784), 61.37 MiB | 24.53 MiB/s Receiving objects: 50% (51892/103784), 61.37 MiB | 24.53 MiB/s Receiving objects: 51% (52930/103784), 61.37 MiB | 24.53 MiB/s Receiving objects: 51% (53700/103784), 78.11 MiB | 26.02 MiB/s Receiving objects: 52% (53968/103784), 78.11 MiB | 26.02 MiB/s Receiving objects: 53% (55006/103784), 78.11 MiB | 26.02 MiB/s Receiving objects: 54% (56044/103784), 78.11 MiB | 26.02 MiB/s Receiving objects: 55% (57082/103784), 78.11 MiB | 26.02 MiB/s Receiving objects: 55% (57268/103784), 110.73 MiB | 27.67 MiB/s Receiving objects: 56% (58120/103784), 127.04 MiB | 28.22 MiB/s Receiving objects: 57% (59157/103784), 127.04 MiB | 28.22 MiB/s Receiving objects: 58% (60195/103784), 127.04 MiB | 28.22 MiB/s Receiving objects: 58% (60721/103784), 143.04 MiB | 30.18 MiB/s Receiving objects: 59% (61233/103784), 143.04 MiB | 30.18 MiB/s Receiving objects: 60% (62271/103784), 143.04 MiB | 30.18 MiB/s Receiving objects: 61% (63309/103784), 143.04 MiB | 30.18 MiB/s Receiving objects: 61% (64240/103784), 175.50 MiB | 32.09 MiB/s Receiving objects: 62% (64347/103784), 175.50 MiB | 32.09 MiB/s Receiving objects: 63% (65384/103784), 191.47 MiB | 32.28 MiB/s Receiving objects: 63% (66154/103784), 208.23 MiB | 32.58 MiB/s Receiving objects: 64% (66422/103784), 224.38 MiB | 32.45 MiB/s Receiving objects: 64% (67150/103784), 240.49 MiB | 32.41 MiB/s Receiving objects: 64% (67220/103784), 257.04 MiB | 32.44 MiB/s Receiving objects: 64% (67351/103784), 306.38 MiB | 32.60 MiB/s Receiving objects: 65% (67460/103784), 306.38 MiB | 32.60 MiB/s Receiving objects: 65% (67765/103784), 322.52 MiB | 32.54 MiB/s Receiving objects: 66% (68498/103784), 338.49 MiB | 32.55 MiB/s Receiving objects: 67% (69536/103784), 338.49 MiB | 32.55 MiB/s Receiving objects: 68% (70574/103784), 338.49 MiB | 32.55 MiB/s Receiving objects: 69% (71611/103784), 338.49 MiB | 32.55 MiB/s Receiving objects: 70% (72649/103784), 338.49 MiB | 32.55 MiB/s Receiving objects: 71% (73687/103784), 355.27 MiB | 32.56 MiB/s Receiving objects: 72% (74725/103784), 355.27 MiB | 32.56 MiB/s Receiving objects: 73% (75763/103784), 355.27 MiB | 32.56 MiB/s Receiving objects: 74% (76801/103784), 355.27 MiB | 32.56 MiB/s Receiving objects: 75% (77838/103784), 355.27 MiB | 32.56 MiB/s Receiving objects: 76% (78876/103784), 355.27 MiB | 32.56 MiB/s Receiving objects: 76% (78949/103784), 355.27 MiB | 32.56 MiB/s Receiving objects: 77% (79914/103784), 355.27 MiB | 32.56 MiB/s Receiving objects: 78% (80952/103784), 371.75 MiB | 32.58 MiB/s Receiving objects: 79% (81990/103784), 371.75 MiB | 32.58 MiB/s Receiving objects: 80% (83028/103784), 371.75 MiB | 32.58 MiB/s Receiving objects: 81% (84066/103784), 371.75 MiB | 32.58 MiB/s Receiving objects: 82% (85103/103784), 371.75 MiB | 32.58 MiB/s Receiving objects: 83% (86141/103784), 388.07 MiB | 32.65 MiB/s Receiving objects: 83% (87127/103784), 388.07 MiB | 32.65 MiB/s Receiving objects: 84% (87179/103784), 403.97 MiB | 32.50 MiB/s Receiving objects: 85% (88217/103784), 403.97 MiB | 32.50 MiB/s Receiving objects: 86% (89255/103784), 403.97 MiB | 32.50 MiB/s Receiving objects: 87% (90293/103784), 403.97 MiB | 32.50 MiB/s Receiving objects: 88% (91330/103784), 403.97 MiB | 32.50 MiB/s Receiving objects: 89% (92368/103784), 420.39 MiB | 32.51 MiB/s Receiving objects: 90% (93406/103784), 420.39 MiB | 32.51 MiB/s Receiving objects: 91% (94444/103784), 420.39 MiB | 32.51 MiB/s Receiving objects: 92% (95482/103784), 420.39 MiB | 32.51 MiB/s Receiving objects: 93% (96520/103784), 420.39 MiB | 32.51 MiB/s Receiving objects: 94% (97557/103784), 420.39 MiB | 32.51 MiB/s Receiving objects: 95% (98595/103784), 420.39 MiB | 32.51 MiB/s Receiving objects: 96% (99633/103784), 420.39 MiB | 32.51 MiB/s Receiving objects: 97% (100671/103784), 420.39 MiB | 32.51 MiB/s Receiving objects: 97% (100936/103784), 420.39 MiB | 32.51 MiB/s Receiving objects: 98% (101709/103784), 420.39 MiB | 32.51 MiB/s Receiving objects: 99% (102747/103784), 420.39 MiB | 32.51 MiB/s remote: Total 103784 (delta 8180), reused 7483 (delta 7414), pack-reused 94333 (from 4)
  7. 17.38 s Receiving objects: 100% (103784/103784), 436.98 MiB | 32.66 MiB/s Receiving objects: 100% (103784/103784), 439.18 MiB | 31.11 MiB/s, done.
  8. 18.54 s Resolving deltas: 0% (0/67929) Resolving deltas: 1% (681/67929) Resolving deltas: 2% (1359/67929) Resolving deltas: 3% (2039/67929) Resolving deltas: 4% (2718/67929) Resolving deltas: 5% (3399/67929) Resolving deltas: 6% (4076/67929) Resolving deltas: 7% (4756/67929) Resolving deltas: 8% (5435/67929) Resolving deltas: 9% (6114/67929) Resolving deltas: 10% (6793/67929) Resolving deltas: 11% (7473/67929) Resolving deltas: 12% (8152/67929) Resolving deltas: 13% (8831/67929) Resolving deltas: 14% (9511/67929) Resolving deltas: 15% (10190/67929) Resolving deltas: 16% (10869/67929) Resolving deltas: 17% (11548/67929) Resolving deltas: 18% (12229/67929) Resolving deltas: 19% (12907/67929) Resolving deltas: 20% (13586/67929) Resolving deltas: 21% (14266/67929) Resolving deltas: 22% (14945/67929) Resolving deltas: 23% (15624/67929) Resolving deltas: 24% (16304/67929) Resolving deltas: 25% (16987/67929) Resolving deltas: 26% (17662/67929) Resolving deltas: 27% (18341/67929) Resolving deltas: 28% (19021/67929) Resolving deltas: 29% (19700/67929) Resolving deltas: 30% (20383/67929) Resolving deltas: 31% (21060/67929) Resolving deltas: 32% (21738/67929) Resolving deltas: 33% (22417/67929) Resolving deltas: 34% (23097/67929) Resolving deltas: 35% (23776/67929) Resolving deltas: 36% (24455/67929) Resolving deltas: 37% (25134/67929) Resolving deltas: 38% (25814/67929) Resolving deltas: 39% (26493/67929) Resolving deltas: 40% (27172/67929) Resolving deltas: 41% (27854/67929) Resolving deltas: 42% (28531/67929) Resolving deltas: 43% (29210/67929) Resolving deltas: 44% (29890/67929) Resolving deltas: 45% (30569/67929) Resolving deltas: 46% (31248/67929) Resolving deltas: 47% (31927/67929) Resolving deltas: 48% (32606/67929) Resolving deltas: 49% (33286/67929) Resolving deltas: 50% (33965/67929) Resolving deltas: 51% (34644/67929) Resolving deltas: 52% (35324/67929) Resolving deltas: 53% (36004/67929) Resolving deltas: 54% (36682/67929) Resolving deltas: 55% (37361/67929) Resolving deltas: 56% (38042/67929) Resolving deltas: 57% (38720/67929) Resolving deltas: 58% (39399/67929) Resolving deltas: 59% (40079/67929) Resolving deltas: 60% (40758/67929) Resolving deltas: 61% (41437/67929) Resolving deltas: 62% (42116/67929) Resolving deltas: 63% (42796/67929) Resolving deltas: 64% (43475/67929) Resolving deltas: 65% (44154/67929) Resolving deltas: 66% (44834/67929) Resolving deltas: 67% (45513/67929) Resolving deltas: 68% (46192/67929) Resolving deltas: 69% (46872/67929) Resolving deltas: 70% (47551/67929) Resolving deltas: 71% (48230/67929) Resolving deltas: 72% (48909/67929) Resolving deltas: 73% (49592/67929) Resolving deltas: 74% (50269/67929) Resolving deltas: 75% (50947/67929) Resolving deltas: 76% (51627/67929) Resolving deltas: 77% (52306/67929) Resolving deltas: 78% (52985/67929) Resolving deltas: 79% (53664/67929) Resolving deltas: 80% (54344/67929) Resolving deltas: 81% (55023/67929) Resolving deltas: 82% (55702/67929) Resolving deltas: 83% (56383/67929) Resolving deltas: 84% (57061/67929) Resolving deltas: 84% (57311/67929) Resolving deltas: 85% (57740/67929) Resolving deltas: 86% (58419/67929) Resolving deltas: 87% (59099/67929) Resolving deltas: 88% (59778/67929) Resolving deltas: 89% (60457/67929) Resolving deltas: 90% (61137/67929) Resolving deltas: 91% (61816/67929) Resolving deltas: 92% (62495/67929) Resolving deltas: 93% (63174/67929) Resolving deltas: 94% (63854/67929) Resolving deltas: 95% (64534/67929) Resolving deltas: 96% (65212/67929) Resolving deltas: 97% (65892/67929) Resolving deltas: 98% (66571/67929) Resolving deltas: 99% (67250/67929) Resolving deltas: 100% (67929/67929) Resolving deltas: 100% (67929/67929), done.
  9. 19.21 s Fetching commit 58aaf5380023d118a91aa4083c01395586246f14 for feynkit ...
  10. 19.21 s $ /nix/store/5vpcfsdx1lcnlb2y4k7xyc74shp5qwbh-git-2.54.0/bin/git fetch origin 58aaf5380023d118a91aa4083c01395586246f14
  11. 19.63 s From https://github.com/alphal00p/gammaloop
  12. 19.63 s * branch 58aaf5380023d118a91aa4083c01395586246f14 -> FETCH_HEAD
  13. 19.64 s $ /nix/store/61685rbaxmpigwi3z23i33sv3jyfl70q-coreutils-9.11/bin/timeout --kill-after=15s 7200s /nix/store/5vpcfsdx1lcnlb2y4k7xyc74shp5qwbh-git-2.54.0/bin/git -c advice.detachedHead=false checkout 58aaf5380023d118a91aa4083c01395586246f14
  14. 19.87 s HEAD is now at 58aaf5380 share physics layout across graph renderers
  15. 19.87 s $ /nix/store/61685rbaxmpigwi3z23i33sv3jyfl70q-coreutils-9.11/bin/timeout --kill-after=15s 7200s /nix/store/wknkybkzrc16r11vk5vrykh4wmw7a353-nix-2.34.8/bin/nix --extra-experimental-features nix-command --extra-experimental-features flakes --log-format internal-json run .#packages.x86_64-linux.nix-ci-check-gammaloop-nextest-core --print-build-logs
  16. 20.01 s warning: ignoring untrusted flake configuration setting 'extra-substituters'.
  17. 20.01 s Pass '--accept-flake-config' to trust it
  18. 20.01 s warning: ignoring untrusted flake configuration setting 'extra-trusted-public-keys'.
  19. 20.01 s Pass '--accept-flake-config' to trust it
  20. 20.01 s
  21. 20.22 s evaluating derivation 'gdo you want to allow configuration setting 'extra-substituters' to be set to 'https://cache.nix-ci.com' (y/N)? do you want to permanently mark this value as untrusted (y/N)? warning: ignoring untrusted flake configuration setting 'extra-substituters'.
  22. 20.22 s Pass '--accept-flake-config' to trust it
  23. 20.22 s do you want to allow configuration setting 'extra-trusted-public-keys' to be set to 'nix-ci:g3xV5BDTLtIBZr/A00IU1x0EtKKlb7YLgBN2SgYgM6A=' (y/N)? do you want to permanently mark this value as untrusted (y/N)? warning: ignoring untrusted flake configuration setting 'extra-trusted-public-keys'.
  24. 20.22 s Pass '--accept-flake-config' to trust it
  25. 24.80 s copying '/nix/store/566x evaluating derivation 'g copying '/nix/store/566x evaluating derivation 'g copying '/nix/store/566x evaluating derivation 'g copying '/nix/store/566x evaluating derivation 'g copying '/nix/store/566x evaluating derivation 'g copying '/nix/store/566x evaluating derivation 'g copying '/nix/store/566x evaluating derivation 'g copying '/nix/store/566x evaluating derivation 'g [0/1 built] [1/0/1 built] building ggammaloop-nextest-core> Extracting 4 binaries (including 2 non-test binaries), 1 build script output directory, and 2 linked paths to /build/source
  26. 25.29 s gammaloop-nextest-core> Extracted 20 files to /build/source in 0.49s
  27. 25.30 s gammaloop-nextest-core> ------------
  28. 25.30 s gammaloop-nextest-core> Nextest run ID fe978ad6-d9eb-4352-ad2a-45e5cc42e9ca with nextest profile: ci_gammaloop
  29. 25.30 s gammaloop-nextest-core> Starting 341 tests across 2 binaries (1 test skipped)
  30. 25.69 s gammaloop-nextest-core> ------------
  31. 25.69 s gammaloop-nextest-core> Summary [ 0.392s] 341 tests run: 341 passed, 1 skipped
  32. 25.72 s gammaloop-nextest-core>
  33. 25.72 s gammaloop-nextest-core> ========== nextest test summary ==========
  34. 25.72 s gammaloop-nextest-core> report: target/nextest/ci_gammaloop/junit.xml
  35. 25.72 s gammaloop-nextest-core> tests: 341, failures: 0, errors: 0
  36. 25.72 s gammaloop-nextest-core> No failing testcases found.
  37. 25.72 s gammaloop-nextest-core> =========================================
  38. 25.73 s gammaloop-nextest-core> Extracting 1 binary and 1 linked path to /build/source
  39. 25.81 s gammaloop-nextest-core> Extracted 7 files to /build/source in 0.07s
  40. 25.81 s gammaloop-nextest-core> ------------
  41. 25.81 s gammaloop-nextest-core> Nextest run ID 9c8ad635-d762-41fc-addc-dba72c93c879 with nextest profile: ci_gammaloop
  42. 25.81 s gammaloop-nextest-core> Starting 19 tests across 1 binary
  43. 25.82 s gammaloop-nextest-core> ------------
  44. 25.82 s gammaloop-nextest-core> Summary [ 0.010s] 19 tests run: 19 passed, 0 skipped
  45. 25.85 s gammaloop-nextest-core>
  46. 25.85 s gammaloop-nextest-core> ========== nextest test summary ==========
  47. 25.85 s gammaloop-nextest-core> report: target/nextest/ci_gammaloop/junit.xml
  48. 25.85 s gammaloop-nextest-core> tests: 19, failures: 0, errors: 0
  49. 25.85 s gammaloop-nextest-core> No failing testcases found.
  50. 25.85 s gammaloop-nextest-core> =========================================
  51. 25.86 s gammaloop-nextest-core> Extracting 1 binary to /build/source
  52. 25.89 s gammaloop-nextest-core> Extracted 4 files to /build/source in 0.03s
  53. 25.90 s gammaloop-nextest-core> ------------
  54. 25.90 s gammaloop-nextest-core> Nextest run ID 204a7fbe-d74c-4928-beaf-d4aaf6e4fa98 with nextest profile: ci_gammaloop
  55. 25.90 s gammaloop-nextest-core> Starting 0 tests across 1 binary
  56. 25.90 s gammaloop-nextest-core> ------------
  57. 25.90 s gammaloop-nextest-core> Summary [ 0.000s] 0 tests run: 0 passed, 0 skipped
  58. 25.93 s gammaloop-nextest-core>
  59. 25.93 s gammaloop-nextest-core> ========== nextest test summary ==========
  60. 25.93 s gammaloop-nextest-core> report: target/nextest/ci_gammaloop/junit.xml
  61. 25.93 s gammaloop-nextest-core> tests: 0, failures: 0, errors: 0
  62. 25.93 s gammaloop-nextest-core> No failing testcases found.
  63. 25.93 s gammaloop-nextest-core> =========================================
  64. 25.94 s gammaloop-nextest-core> Extracting 4 binaries (including 1 non-test binary), 1 build script output directory, and 2 linked paths to /build/source
  65. 26.42 s gammaloop-nextest-core> Extracted 19 files to /build/source in 0.48s
  66. 26.43 s gammaloop-nextest-core> ------------
  67. 26.43 s gammaloop-nextest-core> Nextest run ID 71f37d44-2965-493d-8cf5-99d946497830 with nextest profile: ci_gammaloop
  68. 26.43 s gammaloop-nextest-core> Starting 421 tests across 3 binaries (31 tests skipped, including 30 tests via profile.ci_gammaloop.default-filter)
  69. 26.93 s gammaloop-nextest-core> FAIL [ 0.056s] (367/421) gammalooprs utils::test_utils::normalization
  70. 26.93 s gammaloop-nextest-core> stdout ---
  71. 26.93 s gammaloop-nextest-core>
  72. 26.93 s gammaloop-nextest-core> running 1 test
  73. 26.93 s gammaloop-nextest-core> ━━━━━━━━━━━━━━━━━━━━━━━━━━━━━━━ Snapshot Summary ━━━━━━━━━━━━━━━━━━━━━━━━━━━━━━━
  74. 26.93 s gammaloop-nextest-core> Snapshot: normalization-2
  75. 26.93 s gammaloop-nextest-core> Source: crates/gammalooprs/src/utils/test_utils.rs:44
  76. 26.93 s gammaloop-nextest-core> ────────────────────────────────────────────────────────────────────────────────
  77. 26.93 s gammaloop-nextest-core> Expression: b.to_canonical_string()
  78. 26.93 s gammaloop-nextest-core> ────────────────────────────────────────────────────────────────────────────────
  79. 26.93 s gammaloop-nextest-core> -old snapshot
  80. 26.93 s gammaloop-nextest-core> +new results
  81. 26.93 s gammaloop-nextest-core> ────────────┬───────────────────────────────────────────────────────────────────
  82. 26.93 s gammaloop-nextest-core> 1 │-gammalooprs::{spenso::rank1,spenso::tensor}::Q(1,spenso::{}::cind(1))
  83. 26.93 s gammaloop-nextest-core> 1 │+gammalooprs::{spenso::rank1,spenso::tensor,spenso::tensor-label:q}::Q(1,spenso::{}::cind(1))
  84. 26.93 s gammaloop-nextest-core> ────────────┴───────────────────────────────────────────────────────────────────
  85. 26.93 s gammaloop-nextest-core> To update snapshots run `cargo insta review`
  86. 26.93 s gammaloop-nextest-core> Stopped on the first failure. Run `cargo insta test` to run all snapshots.
  87. 26.93 s gammaloop-nextest-core> test utils::test_utils::normalization ... FAILED
  88. 26.93 s gammaloop-nextest-core>
  89. 26.93 s gammaloop-nextest-core> failures:
  90. 26.93 s gammaloop-nextest-core>
  91. 26.93 s gammaloop-nextest-core> failures:
  92. 26.93 s gammaloop-nextest-core> utils::test_utils::normalization
  93. 26.93 s gammaloop-nextest-core>
  94. 26.93 s gammaloop-nextest-core> test result: FAILED. 0 passed; 1 failed; 0 ignored; 0 measured; 445 filtered out; finished in 0.05s
  95. 26.93 s gammaloop-nextest-core>
  96. 26.93 s gammaloop-nextest-core> stderr ---
  97. 26.93 s gammaloop-nextest-core>
  98. 26.93 s gammaloop-nextest-core> thread 'utils::test_utils::normalization' (2240) panicked at /nix/store/c7lwckzlfrfsdw1ay0aqz4dpc2j7ry8d-vendor-cargo-deps/c19b7c6f923b580ac259164a89f2577984ad5ab09ee9d583b888f934adbbe8d0/insta-1.47.2/src/runtime.rs:719:13:
  99. 26.93 s gammaloop-nextest-core> snapshot assertion for 'normalization-2' failed in line 44
  100. 26.93 s gammaloop-nextest-core> stack backtrace:
  101. 26.93 s gammaloop-nextest-core> 0: __rustc::rust_begin_unwind
  102. 26.93 s gammaloop-nextest-core> 1: core::panicking::panic_fmt
  103. 26.93 s gammaloop-nextest-core> 2: insta::runtime::assert_snapshot
  104. 26.93 s gammaloop-nextest-core> 3: gammalooprs::utils::test_utils::normalization
  105. 26.93 s gammaloop-nextest-core> 4: <gammalooprs::utils::test_utils::normalization::{closure#0} as core::ops::function::FnOnce<()>>::call_once
  106. 26.93 s gammaloop-nextest-core> note: Some details are omitted, run with `RUST_BACKTRACE=full` for a verbose backtrace.
  107. 26.93 s gammaloop-nextest-core>
  108. 33.10 s gammaloop-nextest-core> ------------
  109. 33.10 s gammaloop-nextest-core> Summary [ 6.677s] 421 tests run: 420 passed, 1 failed, 31 skipped
  110. 33.10 s gammaloop-nextest-core> FAIL [ 0.056s] (367/421) gammalooprs utils::test_utils::normalization
  111. 33.10 s gammaloop-nextest-core> stdout ---
  112. 33.10 s gammaloop-nextest-core>
  113. 33.10 s gammaloop-nextest-core> running 1 test
  114. 33.10 s gammaloop-nextest-core> ━━━━━━━━━━━━━━━━━━━━━━━━━━━━━━━ Snapshot Summary ━━━━━━━━━━━━━━━━━━━━━━━━━━━━━━━
  115. 33.10 s gammaloop-nextest-core> Snapshot: normalization-2
  116. 33.10 s gammaloop-nextest-core> Source: crates/gammalooprs/src/utils/test_utils.rs:44
  117. 33.10 s gammaloop-nextest-core> ────────────────────────────────────────────────────────────────────────────────
  118. 33.10 s gammaloop-nextest-core> Expression: b.to_canonical_string()
  119. 33.10 s gammaloop-nextest-core> ────────────────────────────────────────────────────────────────────────────────
  120. 33.10 s gammaloop-nextest-core> -old snapshot
  121. 33.10 s gammaloop-nextest-core> +new results
  122. 33.10 s gammaloop-nextest-core> ────────────┬───────────────────────────────────────────────────────────────────
  123. 33.10 s gammaloop-nextest-core> 1 │-gammalooprs::{spenso::rank1,spenso::tensor}::Q(1,spenso::{}::cind(1))
  124. 33.10 s gammaloop-nextest-core> 1 │+gammalooprs::{spenso::rank1,spenso::tensor,spenso::tensor-label:q}::Q(1,spenso::{}::cind(1))
  125. 33.10 s gammaloop-nextest-core> ────────────┴───────────────────────────────────────────────────────────────────
  126. 33.10 s gammaloop-nextest-core> To update snapshots run `cargo insta review`
  127. 33.10 s gammaloop-nextest-core> Stopped on the first failure. Run `cargo insta test` to run all snapshots.
  128. 33.10 s gammaloop-nextest-core> test utils::test_utils::normalization ... FAILED
  129. 33.10 s gammaloop-nextest-core>
  130. 33.10 s gammaloop-nextest-core> failures:
  131. 33.10 s gammaloop-nextest-core>
  132. 33.10 s gammaloop-nextest-core> failures:
  133. 33.10 s gammaloop-nextest-core> utils::test_utils::normalization
  134. 33.10 s gammaloop-nextest-core>
  135. 33.10 s gammaloop-nextest-core> test result: FAILED. 0 passed; 1 failed; 0 ignored; 0 measured; 445 filtered out; finished in 0.05s
  136. 33.10 s gammaloop-nextest-core>
  137. 33.10 s gammaloop-nextest-core> stderr ---
  138. 33.10 s gammaloop-nextest-core>
  139. 33.10 s gammaloop-nextest-core> thread 'utils::test_utils::normalization' (2240) panicked at /nix/store/c7lwckzlfrfsdw1ay0aqz4dpc2j7ry8d-vendor-cargo-deps/c19b7c6f923b580ac259164a89f2577984ad5ab09ee9d583b888f934adbbe8d0/insta-1.47.2/src/runtime.rs:719:13:
  140. 33.10 s gammaloop-nextest-core> snapshot assertion for 'normalization-2' failed in line 44
  141. 33.10 s gammaloop-nextest-core> stack backtrace:
  142. 33.10 s gammaloop-nextest-core> 0: __rustc::rust_begin_unwind
  143. 33.10 s gammaloop-nextest-core> 1: core::panicking::panic_fmt
  144. 33.10 s gammaloop-nextest-core> 2: insta::runtime::assert_snapshot
  145. 33.10 s gammaloop-nextest-core> 3: gammalooprs::utils::test_utils::normalization
  146. 33.10 s gammaloop-nextest-core> 4: <gammalooprs::utils::test_utils::normalization::{closure#0} as core::ops::function::FnOnce<()>>::call_once
  147. 33.10 s gammaloop-nextest-core> note: Some details are omitted, run with `RUST_BACKTRACE=full` for a verbose backtrace.
  148. 33.10 s gammaloop-nextest-core>
  149. 33.11 s gammaloop-nextest-core> error: test run failed
  150. 33.14 s gammaloop-nextest-core>
  151. 33.14 s gammaloop-nextest-core> ========== nextest test summary ==========
  152. 33.14 s gammaloop-nextest-core> report: target/nextest/ci_gammaloop/junit.xml
  153. 33.14 s gammaloop-nextest-core> tests: 421, failures: 1, errors: 0
  154. 33.14 s gammaloop-nextest-core>
  155. 33.14 s gammaloop-nextest-core> 1. gammalooprs::utils::test_utils::normalization
  156. 33.14 s gammaloop-nextest-core> failure: test failure with exit code 101
  157. 33.14 s gammaloop-nextest-core> thread 'utils::test_utils::normalization' (2240) panicked at /nix/store/c7lwckzlfrfsdw1ay0aqz4dpc2j7ry8d-vendor-cargo-deps/c19b7c6f923b580ac259164a89f2577984ad5ab09ee9d583b888f934adbbe8d0/insta-1.47.2/src/runtime.rs:719:13:
  158. 33.14 s gammaloop-nextest-core> snapshot assertion for 'normalization-2' failed in line 44
  159. 33.14 s gammaloop-nextest-core> stack backtrace:
  160. 33.14 s gammaloop-nextest-core> 0: __rustc::rust_begin_unwind
  161. 33.14 s gammaloop-nextest-core> 1: core::panicking::panic_fmt
  162. 33.14 s gammaloop-nextest-core> 2: insta::runtime::assert_snapshot
  163. 33.14 s gammaloop-nextest-core> 3: gammalooprs::utils::test_utils::normalization
  164. 33.14 s gammaloop-nextest-core> 4: <gammalooprs::utils::test_utils::normalization::{closure#0} as core::ops::function::FnOnce<()>>::call_once
  165. 33.14 s gammaloop-nextest-core> note: Some details are omitted, run with `RUST_BACKTRACE=full` for a verbose backtrace.
  166. 33.14 s gammaloop-nextest-core> system-out
  167. 33.14 s gammaloop-nextest-core> running 1 test
  168. 33.14 s gammaloop-nextest-core> ━━━━━━━━━━━━━━━━━━━━━━━━━━━━━━━ Snapshot Summary ━━━━━━━━━━━━━━━━━━━━━━━━━━━━━━━
  169. 33.14 s gammaloop-nextest-core> Snapshot: normalization-2
  170. 33.14 s gammaloop-nextest-core> Source: crates/gammalooprs/src/utils/test_utils.rs:44
  171. 33.14 s gammaloop-nextest-core> ────────────────────────────────────────────────────────────────────────────────
  172. 33.14 s gammaloop-nextest-core> Expression: b.to_canonical_string()
  173. 33.14 s gammaloop-nextest-core> ────────────────────────────────────────────────────────────────────────────────
  174. 33.14 s gammaloop-nextest-core> -old snapshot
  175. 33.14 s gammaloop-nextest-core> +new results
  176. 33.14 s gammaloop-nextest-core> ────────────┬───────────────────────────────────────────────────────────────────
  177. 33.14 s gammaloop-nextest-core> 1 │-gammalooprs::{spenso::rank1,spenso::tensor}::Q(1,spenso::{}::cind(1))
  178. 33.14 s gammaloop-nextest-core> 1 │+gammalooprs::{spenso::rank1,spenso::tensor,spenso::tensor-label:q}::Q(1,spenso::{}::cind(1))
  179. 33.14 s gammaloop-nextest-core> ────────────┴───────────────────────────────────────────────────────────────────
  180. 33.14 s gammaloop-nextest-core> To update snapshots run `cargo insta review`
  181. 33.14 s gammaloop-nextest-core> Stopped on the first failure. Run `cargo insta test` to run all snapshots.
  182. 33.14 s gammaloop-nextest-core> test utils::test_utils::normalization ... FAILED
  183. 33.14 s gammaloop-nextest-core>
  184. 33.14 s gammaloop-nextest-core> failures:
  185. 33.14 s gammaloop-nextest-core>
  186. 33.14 s gammaloop-nextest-core> failures:
  187. 33.14 s gammaloop-nextest-core> utils::test_utils::normalization
  188. 33.14 s gammaloop-nextest-core>
  189. 33.14 s gammaloop-nextest-core> test result: FAILED. 0 passed; 1 failed; 0 ignored; 0 measured; 445 filtered out; finished in 0.05s
  190. 33.14 s gammaloop-nextest-core> system-err
  191. 33.14 s gammaloop-nextest-core> thread 'utils::test_utils::normalization' (2240) panicked at /nix/store/c7lwckzlfrfsdw1ay0aqz4dpc2j7ry8d-vendor-cargo-deps/c19b7c6f923b580ac259164a89f2577984ad5ab09ee9d583b888f934adbbe8d0/insta-1.47.2/src/runtime.rs:719:13:
  192. 33.14 s gammaloop-nextest-core> snapshot assertion for 'normalization-2' failed in line 44
  193. 33.14 s gammaloop-nextest-core> stack backtrace:
  194. 33.14 s gammaloop-nextest-core> 0: __rustc::rust_begin_unwind
  195. 33.14 s gammaloop-nextest-core> 1: core::panicking::panic_fmt
  196. 33.14 s gammaloop-nextest-core> 2: insta::runtime::assert_snapshot
  197. 33.14 s gammaloop-nextest-core> 3: gammalooprs::utils::test_utils::normalization
  198. 33.14 s gammaloop-nextest-core> 4: <gammalooprs::utils::test_utils::normalization::{closure#0} as core::ops::function::FnOnce<()>>::call_once
  199. 33.14 s gammaloop-nextest-core> note: Some details are omitted, run with `RUST_BACKTRACE=full` for a verbose backtrace.
  200. 33.14 s gammaloop-nextest-core> =========================================
  201. 33.30 s error: Cannot build '/nix/store/ckg96rv0lgqlnyry3xsk00acwpalk4w6-gammaloop-nextest-core.drv'.
  202. 33.30 s Reason: builder failed with exit code 100.
  203. 33.30 s Output paths:
  204. 33.30 s /nix/store/m5zprznfnxr4a6ajrvihg6dqgfmv2ncg-gammaloop-nextest-core
  205. 33.30 s Last 176 log lines:
  206. 33.30 s > Extracting 4 binaries (including 2 non-test binaries), 1 build script output directory, and 2 linked paths to /build/source
  207. 33.30 s > Extracted 20 files to /build/source in 0.49s
  208. 33.30 s > ------------
  209. 33.30 s > Nextest run ID fe978ad6-d9eb-4352-ad2a-45e5cc42e9ca with nextest profile: ci_gammaloop
  210. 33.30 s > Starting 341 tests across 2 binaries (1 test skipped)
  211. 33.30 s > ------------
  212. 33.30 s > Summary [ 0.392s] 341 tests run: 341 passed, 1 skipped
  213. 33.30 s >
  214. 33.30 s > ========== nextest test summary ==========
  215. 33.30 s > report: target/nextest/ci_gammaloop/junit.xml
  216. 33.30 s > tests: 341, failures: 0, errors: 0
  217. 33.30 s > No failing testcases found.
  218. 33.30 s > =========================================
  219. 33.30 s > Extracting 1 binary and 1 linked path to /build/source
  220. 33.30 s > Extracted 7 files to /build/source in 0.07s
  221. 33.30 s > ------------
  222. 33.30 s > Nextest run ID 9c8ad635-d762-41fc-addc-dba72c93c879 with nextest profile: ci_gammaloop
  223. 33.30 s > Starting 19 tests across 1 binary
  224. 33.30 s > ------------
  225. 33.30 s > Summary [ 0.010s] 19 tests run: 19 passed, 0 skipped
  226. 33.30 s >
  227. 33.30 s > ========== nextest test summary ==========
  228. 33.30 s > report: target/nextest/ci_gammaloop/junit.xml
  229. 33.30 s > tests: 19, failures: 0, errors: 0
  230. 33.30 s > No failing testcases found.
  231. 33.30 s > =========================================
  232. 33.30 s > Extracting 1 binary to /build/source
  233. 33.30 s > Extracted 4 files to /build/source in 0.03s
  234. 33.30 s > ------------
  235. 33.30 s > Nextest run ID 204a7fbe-d74c-4928-beaf-d4aaf6e4fa98 with nextest profile: ci_gammaloop
  236. 33.30 s > Starting 0 tests across 1 binary
  237. 33.30 s > ------------
  238. 33.30 s > Summary [ 0.000s] 0 tests run: 0 passed, 0 skipped
  239. 33.30 s >
  240. 33.30 s > ========== nextest test summary ==========
  241. 33.30 s > report: target/nextest/ci_gammaloop/junit.xml
  242. 33.30 s > tests: 0, failures: 0, errors: 0
  243. 33.30 s > No failing testcases found.
  244. 33.30 s > =========================================
  245. 33.30 s > Extracting 4 binaries (including 1 non-test binary), 1 build script output directory, and 2 linked paths to /build/source
  246. 33.30 s > Extracted 19 files to /build/source in 0.48s
  247. 33.30 s > ------------
  248. 33.30 s > Nextest run ID 71f37d44-2965-493d-8cf5-99d946497830 with nextest profile: ci_gammaloop
  249. 33.30 s > Starting 421 tests across 3 binaries (31 tests skipped, including 30 tests via profile.ci_gammaloop.default-filter)
  250. 33.30 s > FAIL [ 0.056s] (367/421) gammalooprs utils::test_utils::normalization
  251. 33.30 s > stdout ---
  252. 33.30 s >
  253. 33.30 s > running 1 test
  254. 33.30 s > ━━━━━━━━━━━━━━━━━━━━━━━━━━━━━━━ Snapshot Summary ━━━━━━━━━━━━━━━━━━━━━━━━━━━━━━━
  255. 33.30 s > Snapshot: normalization-2
  256. 33.30 s > Source: crates/gammalooprs/src/utils/test_utils.rs:44
  257. 33.30 s > ────────────────────────────────────────────────────────────────────────────────
  258. 33.30 s > Expression: b.to_canonical_string()
  259. 33.30 s > ────────────────────────────────────────────────────────────────────────────────
  260. 33.30 s > -old snapshot
  261. 33.30 s > +new results
  262. 33.30 s > ────────────┬───────────────────────────────────────────────────────────────────
  263. 33.30 s > 1 │-gammalooprs::{spenso::rank1,spenso::tensor}::Q(1,spenso::{}::cind(1))
  264. 33.30 s > 1 │+gammalooprs::{spenso::rank1,spenso::tensor,spenso::tensor-label:q}::Q(1,spenso::{}::cind(1))
  265. 33.30 s > ────────────┴───────────────────────────────────────────────────────────────────
  266. 33.30 s > To update snapshots run `cargo insta review`
  267. 33.30 s > Stopped on the first failure. Run `cargo insta test` to run all snapshots.
  268. 33.30 s > test utils::test_utils::normalization ... FAILED
  269. 33.30 s >
  270. 33.30 s > failures:
  271. 33.30 s >
  272. 33.30 s > failures:
  273. 33.30 s > utils::test_utils::normalization
  274. 33.30 s >
  275. 33.30 s > test result: FAILED. 0 passed; 1 failed; 0 ignored; 0 measured; 445 filtered out; finished in 0.05s
  276. 33.30 s >
  277. 33.30 s > stderr ---
  278. 33.30 s >
  279. 33.30 s > thread 'utils::test_utils::normalization' (2240) panicked at /nix/store/c7lwckzlfrfsdw1ay0aqz4dpc2j7ry8d-vendor-cargo-deps/c19b7c6f923b580ac259164a89f2577984ad5ab09ee9d583b888f934adbbe8d0/insta-1.47.2/src/runtime.rs:719:13:
  280. 33.30 s > snapshot assertion for 'normalization-2' failed in line 44
  281. 33.30 s > stack backtrace:
  282. 33.30 s > 0: __rustc::rust_begin_unwind
  283. 33.30 s > 1: core::panicking::panic_fmt
  284. 33.30 s > 2: insta::runtime::assert_snapshot
  285. 33.30 s > 3: gammalooprs::utils::test_utils::normalization
  286. 33.30 s > 4: <gammalooprs::utils::test_utils::normalization::{closure#0} as core::ops::function::FnOnce<()>>::call_once
  287. 33.30 s > note: Some details are omitted, run with `RUST_BACKTRACE=full` for a verbose backtrace.
  288. 33.30 s >
  289. 33.30 s > ------------
  290. 33.30 s > Summary [ 6.677s] 421 tests run: 420 passed, 1 failed, 31 skipped
  291. 33.30 s > FAIL [ 0.056s] (367/421) gammalooprs utils::test_utils::normalization
  292. 33.30 s > stdout ---
  293. 33.30 s >
  294. 33.30 s > running 1 test
  295. 33.30 s > ━━━━━━━━━━━━━━━━━━━━━━━━━━━━━━━ Snapshot Summary ━━━━━━━━━━━━━━━━━━━━━━━━━━━━━━━
  296. 33.30 s > Snapshot: normalization-2
  297. 33.30 s > Source: crates/gammalooprs/src/utils/test_utils.rs:44
  298. 33.30 s > ────────────────────────────────────────────────────────────────────────────────
  299. 33.30 s > Expression: b.to_canonical_string()
  300. 33.30 s > ────────────────────────────────────────────────────────────────────────────────
  301. 33.30 s > -old snapshot
  302. 33.30 s > +new results
  303. 33.30 s > ────────────┬───────────────────────────────────────────────────────────────────
  304. 33.30 s > 1 │-gammalooprs::{spenso::rank1,spenso::tensor}::Q(1,spenso::{}::cind(1))
  305. 33.30 s > 1 │+gammalooprs::{spenso::rank1,spenso::tensor,spenso::tensor-label:q}::Q(1,spenso::{}::cind(1))
  306. 33.30 s > ────────────┴───────────────────────────────────────────────────────────────────
  307. 33.30 s > To update snapshots run `cargo insta review`
  308. 33.30 s > Stopped on the first failure. Run `cargo insta test` to run all snapshots.
  309. 33.30 s > test utils::test_utils::normalization ... FAILED
  310. 33.30 s >
  311. 33.30 s > failures:
  312. 33.30 s >
  313. 33.30 s > failures:
  314. 33.30 s > utils::test_utils::normalization
  315. 33.30 s >
  316. 33.30 s > test result: FAILED. 0 passed; 1 failed; 0 ignored; 0 measured; 445 filtered out; finished in 0.05s
  317. 33.30 s >
  318. 33.30 s > stderr ---
  319. 33.30 s >
  320. 33.30 s > thread 'utils::test_utils::normalization' (2240) panicked at /nix/store/c7lwckzlfrfsdw1ay0aqz4dpc2j7ry8d-vendor-cargo-deps/c19b7c6f923b580ac259164a89f2577984ad5ab09ee9d583b888f934adbbe8d0/insta-1.47.2/src/runtime.rs:719:13:
  321. 33.30 s > snapshot assertion for 'normalization-2' failed in line 44
  322. 33.30 s > stack backtrace:
  323. 33.30 s > 0: __rustc::rust_begin_unwind
  324. 33.30 s > 1: core::panicking::panic_fmt
  325. 33.30 s > 2: insta::runtime::assert_snapshot
  326. 33.30 s > 3: gammalooprs::utils::test_utils::normalization
  327. 33.30 s > 4: <gammalooprs::utils::test_utils::normalization::{closure#0} as core::ops::function::FnOnce<()>>::call_once
  328. 33.30 s > note: Some details are omitted, run with `RUST_BACKTRACE=full` for a verbose backtrace.
  329. 33.30 s >
  330. 33.30 s > error: test run failed
  331. 33.30 s >
  332. 33.30 s > ========== nextest test summary ==========
  333. 33.30 s > report: target/nextest/ci_gammaloop/junit.xml
  334. 33.30 s > tests: 421, failures: 1, errors: 0
  335. 33.30 s >
  336. 33.30 s > 1. gammalooprs::utils::test_utils::normalization
  337. 33.30 s > failure: test failure with exit code 101
  338. 33.30 s > thread 'utils::test_utils::normalization' (2240) panicked at /nix/store/c7lwckzlfrfsdw1ay0aqz4dpc2j7ry8d-vendor-cargo-deps/c19b7c6f923b580ac259164a89f2577984ad5ab09ee9d583b888f934adbbe8d0/insta-1.47.2/src/runtime.rs:719:13:
  339. 33.30 s > snapshot assertion for 'normalization-2' failed in line 44
  340. 33.30 s > stack backtrace:
  341. 33.30 s > 0: __rustc::rust_begin_unwind
  342. 33.30 s > 1: core::panicking::panic_fmt
  343. 33.30 s > 2: insta::runtime::assert_snapshot
  344. 33.30 s > 3: gammalooprs::utils::test_utils::normalization
  345. 33.30 s > 4: <gammalooprs::utils::test_utils::normalization::{closure#0} as core::ops::function::FnOnce<()>>::call_once
  346. 33.30 s > note: Some details are omitted, run with `RUST_BACKTRACE=full` for a verbose backtrace.
  347. 33.30 s > system-out
  348. 33.30 s > running 1 test
  349. 33.30 s > ━━━━━━━━━━━━━━━━━━━━━━━━━━━━━━━ Snapshot Summary ━━━━━━━━━━━━━━━━━━━━━━━━━━━━━━━
  350. 33.30 s > Snapshot: normalization-2
  351. 33.30 s > Source: crates/gammalooprs/src/utils/test_utils.rs:44
  352. 33.30 s > ────────────────────────────────────────────────────────────────────────────────
  353. 33.30 s > Expression: b.to_canonical_string()
  354. 33.30 s > ────────────────────────────────────────────────────────────────────────────────
  355. 33.30 s > -old snapshot
  356. 33.30 s > +new results
  357. 33.30 s > ────────────┬───────────────────────────────────────────────────────────────────
  358. 33.30 s > 1 │-gammalooprs::{spenso::rank1,spenso::tensor}::Q(1,spenso::{}::cind(1))
  359. 33.30 s > 1 │+gammalooprs::{spenso::rank1,spenso::tensor,spenso::tensor-label:q}::Q(1,spenso::{}::cind(1))
  360. 33.30 s > ────────────┴───────────────────────────────────────────────────────────────────
  361. 33.30 s > To update snapshots run `cargo insta review`
  362. 33.30 s > Stopped on the first failure. Run `cargo insta test` to run all snapshots.
  363. 33.30 s > test utils::test_utils::normalization ... FAILED
  364. 33.30 s >
  365. 33.30 s > failures:
  366. 33.30 s >
  367. 33.30 s > failures:
  368. 33.30 s > utils::test_utils::normalization
  369. 33.30 s >
  370. 33.30 s > test result: FAILED. 0 passed; 1 failed; 0 ignored; 0 measured; 445 filtered out; finished in 0.05s
  371. 33.30 s > system-err
  372. 33.30 s > thread 'utils::test_utils::normalization' (2240) panicked at /nix/store/c7lwckzlfrfsdw1ay0aqz4dpc2j7ry8d-vendor-cargo-deps/c19b7c6f923b580ac259164a89f2577984ad5ab09ee9d583b888f934adbbe8d0/insta-1.47.2/src/runtime.rs:719:13:
  373. 33.30 s > snapshot assertion for 'normalization-2' failed in line 44
  374. 33.30 s > stack backtrace:
  375. 33.30 s > 0: __rustc::rust_begin_unwind
  376. 33.30 s > 1: core::panicking::panic_fmt
  377. 33.30 s > 2: insta::runtime::assert_snapshot
  378. 33.30 s > 3: gammalooprs::utils::test_utils::normalization
  379. 33.30 s > 4: <gammalooprs::utils::test_utils::normalization::{closure#0} as core::ops::function::FnOnce<()>>::call_once
  380. 33.30 s > note: Some details are omitted, run with `RUST_BACKTRACE=full` for a verbose backtrace.
  381. 33.30 s > =========================================
  382. 33.30 s For full logs, run:
  383. 33.30 s nix log /nix/store/ckg96rv0lgqlnyry3xsk00acwpalk4w6-gammaloop-nextest-core.drv
  384. 33.48 s [0 built (1 failed)]Run failed.