0.07 s
$ /nix/store/61685rbaxmpigwi3z23i33sv3jyfl70q-coreutils-9.11/bin/timeout --kill-after=15s 7200s /nix/store/wknkybkzrc16r11vk5vrykh4wmw7a353-nix-2.34.8/bin/nix --extra-experimental-features nix-command --extra-experimental-features flakes flake clone git+https://github.com/alphal00p/gammaloop --dest /tmp/nix-ci-worker/stable-pwd/repo/
0.15 s
Cloning into '/tmp/nix-ci-worker/stable-pwd/repo'...
0.94 s
remote: Enumerating objects: 103784, done.
1.06 s
remote: Counting objects: 0% (1/9421)
remote: Counting objects: 1% (95/9421)
remote: Counting objects: 2% (189/9421)
remote: Counting objects: 3% (283/9421)
remote: Counting objects: 4% (377/9421)
remote: Counting objects: 5% (472/9421)
remote: Counting objects: 6% (566/9421)
remote: Counting objects: 7% (660/9421)
remote: Counting objects: 8% (754/9421)
remote: Counting objects: 9% (848/9421)
remote: Counting objects: 10% (943/9421)
remote: Counting objects: 11% (1037/9421)
remote: Counting objects: 12% (1131/9421)
remote: Counting objects: 13% (1225/9421)
remote: Counting objects: 14% (1319/9421)
remote: Counting objects: 15% (1414/9421)
remote: Counting objects: 16% (1508/9421)
remote: Counting objects: 17% (1602/9421)
remote: Counting objects: 18% (1696/9421)
remote: Counting objects: 19% (1790/9421)
remote: Counting objects: 20% (1885/9421)
remote: Counting objects: 21% (1979/9421)
remote: Counting objects: 22% (2073/9421)
remote: Counting objects: 23% (2167/9421)
remote: Counting objects: 24% (2262/9421)
remote: Counting objects: 25% (2356/9421)
remote: Counting objects: 26% (2450/9421)
remote: Counting objects: 27% (2544/9421)
remote: Counting objects: 28% (2638/9421)
remote: Counting objects: 29% (2733/9421)
remote: Counting objects: 30% (2827/9421)
remote: Counting objects: 31% (2921/9421)
remote: Counting objects: 32% (3015/9421)
remote: Counting objects: 33% (3109/9421)
remote: Counting objects: 34% (3204/9421)
remote: Counting objects: 35% (3298/9421)
remote: Counting objects: 36% (3392/9421)
remote: Counting objects: 37% (3486/9421)
remote: Counting objects: 38% (3580/9421)
remote: Counting objects: 39% (3675/9421)
remote: Counting objects: 40% (3769/9421)
remote: Counting objects: 41% (3863/9421)
remote: Counting objects: 42% (3957/9421)
remote: Counting objects: 43% (4052/9421)
remote: Counting objects: 44% (4146/9421)
remote: Counting objects: 45% (4240/9421)
remote: Counting objects: 46% (4334/9421)
remote: Counting objects: 47% (4428/9421)
remote: Counting objects: 48% (4523/9421)
remote: Counting objects: 49% (4617/9421)
remote: Counting objects: 50% (4711/9421)
remote: Counting objects: 51% (4805/9421)
remote: Counting objects: 52% (4899/9421)
remote: Counting objects: 53% (4994/9421)
remote: Counting objects: 54% (5088/9421)
remote: Counting objects: 55% (5182/9421)
remote: Counting objects: 56% (5276/9421)
remote: Counting objects: 57% (5370/9421)
remote: Counting objects: 58% (5465/9421)
remote: Counting objects: 59% (5559/9421)
remote: Counting objects: 60% (5653/9421)
remote: Counting objects: 61% (5747/9421)
remote: Counting objects: 62% (5842/9421)
remote: Counting objects: 63% (5936/9421)
remote: Counting objects: 64% (6030/9421)
remote: Counting objects: 65% (6124/9421)
remote: Counting objects: 66% (6218/9421)
remote: Counting objects: 67% (6313/9421)
remote: Counting objects: 68% (6407/9421)
remote: Counting objects: 69% (6501/9421)
remote: Counting objects: 70% (6595/9421)
remote: Counting objects: 71% (6689/9421)
remote: Counting objects: 72% (6784/9421)
remote: Counting objects: 73% (6878/9421)
remote: Counting objects: 74% (6972/9421)
remote: Counting objects: 75% (7066/9421)
remote: Counting objects: 76% (7160/9421)
remote: Counting objects: 77% (7255/9421)
remote: Counting objects: 78% (7349/9421)
remote: Counting objects: 79% (7443/9421)
remote: Counting objects: 80% (7537/9421)
remote: Counting objects: 81% (7632/9421)
remote: Counting objects: 82% (7726/9421)
remote: Counting objects: 83% (7820/9421)
remote: Counting objects: 84% (7914/9421)
remote: Counting objects: 85% (8008/9421)
remote: Counting objects: 86% (8103/9421)
remote: Counting objects: 87% (8197/9421)
remote: Counting objects: 88% (8291/9421)
remote: Counting objects: 89% (8385/9421)
remote: Counting objects: 90% (8479/9421)
remote: Counting objects: 91% (8574/9421)
remote: Counting objects: 92% (8668/9421)
remote: Counting objects: 93% (8762/9421)
remote: Counting objects: 94% (8856/9421)
remote: Counting objects: 95% (8950/9421)
remote: Counting objects: 96% (9045/9421)
remote: Counting objects: 97% (9139/9421)
remote: Counting objects: 98% (9233/9421)
remote: Counting objects: 99% (9327/9421)
remote: Counting objects: 100% (9421/9421)
remote: Counting objects: 100% (9421/9421), done.
3.08 s
remote: Compressing objects: 0% (1/2027)
remote: Compressing objects: 1% (21/2027)
remote: Compressing objects: 2% (41/2027)
remote: Compressing objects: 3% (61/2027)
remote: Compressing objects: 4% (82/2027)
remote: Compressing objects: 5% (102/2027)
remote: Compressing objects: 6% (122/2027)
remote: Compressing objects: 7% (142/2027)
remote: Compressing objects: 8% (163/2027)
remote: Compressing objects: 9% (183/2027)
remote: Compressing objects: 10% (203/2027)
remote: Compressing objects: 10% (212/2027)
remote: Compressing objects: 11% (223/2027)
remote: Compressing objects: 12% (244/2027)
remote: Compressing objects: 13% (264/2027)
remote: Compressing objects: 14% (284/2027)
remote: Compressing objects: 15% (305/2027)
remote: Compressing objects: 16% (325/2027)
remote: Compressing objects: 17% (345/2027)
remote: Compressing objects: 18% (365/2027)
remote: Compressing objects: 19% (386/2027)
remote: Compressing objects: 20% (406/2027)
remote: Compressing objects: 21% (426/2027)
remote: Compressing objects: 22% (446/2027)
remote: Compressing objects: 23% (467/2027)
remote: Compressing objects: 24% (487/2027)
remote: Compressing objects: 25% (507/2027)
remote: Compressing objects: 26% (528/2027)
remote: Compressing objects: 27% (548/2027)
remote: Compressing objects: 28% (568/2027)
remote: Compressing objects: 29% (588/2027)
remote: Compressing objects: 29% (594/2027)
remote: Compressing objects: 30% (609/2027)
remote: Compressing objects: 31% (629/2027)
remote: Compressing objects: 32% (649/2027)
remote: Compressing objects: 33% (669/2027)
remote: Compressing objects: 34% (690/2027)
remote: Compressing objects: 35% (710/2027)
remote: Compressing objects: 36% (730/2027)
remote: Compressing objects: 37% (750/2027)
remote: Compressing objects: 38% (771/2027)
remote: Compressing objects: 39% (791/2027)
remote: Compressing objects: 40% (811/2027)
remote: Compressing objects: 41% (832/2027)
remote: Compressing objects: 42% (852/2027)
remote: Compressing objects: 43% (872/2027)
remote: Compressing objects: 44% (892/2027)
remote: Compressing objects: 45% (913/2027)
remote: Compressing objects: 46% (933/2027)
remote: Compressing objects: 47% (953/2027)
remote: Compressing objects: 48% (973/2027)
remote: Compressing objects: 49% (994/2027)
remote: Compressing objects: 50% (1014/2027)
remote: Compressing objects: 51% (1034/2027)
remote: Compressing objects: 52% (1055/2027)
remote: Compressing objects: 53% (1075/2027)
remote: Compressing objects: 54% (1095/2027)
remote: Compressing objects: 55% (1115/2027)
remote: Compressing objects: 56% (1136/2027)
remote: Compressing objects: 57% (1156/2027)
remote: Compressing objects: 58% (1176/2027)
remote: Compressing objects: 59% (1196/2027)
remote: Compressing objects: 60% (1217/2027)
remote: Compressing objects: 61% (1237/2027)
remote: Compressing objects: 62% (1257/2027)
remote: Compressing objects: 63% (1278/2027)
remote: Compressing objects: 64% (1298/2027)
remote: Compressing objects: 65% (1318/2027)
remote: Compressing objects: 66% (1338/2027)
remote: Compressing objects: 67% (1359/2027)
remote: Compressing objects: 68% (1379/2027)
remote: Compressing objects: 69% (1399/2027)
remote: Compressing objects: 70% (1419/2027)
remote: Compressing objects: 71% (1440/2027)
remote: Compressing objects: 72% (1460/2027)
remote: Compressing objects: 73% (1480/2027)
remote: Compressing objects: 74% (1500/2027)
remote: Compressing objects: 75% (1521/2027)
remote: Compressing objects: 76% (1541/2027)
remote: Compressing objects: 77% (1561/2027)
remote: Compressing objects: 78% (1582/2027)
remote: Compressing objects: 79% (1602/2027)
remote: Compressing objects: 80% (1622/2027)
remote: Compressing objects: 81% (1642/2027)
remote: Compressing objects: 82% (1663/2027)
remote: Compressing objects: 83% (1683/2027)
remote: Compressing objects: 84% (1703/2027)
remote: Compressing objects: 85% (1723/2027)
remote: Compressing objects: 86% (1744/2027)
remote: Compressing objects: 87% (1764/2027)
remote: Compressing objects: 88% (1784/2027)
remote: Compressing objects: 89% (1805/2027)
remote: Compressing objects: 90% (1825/2027)
remote: Compressing objects: 91% (1845/2027)
remote: Compressing objects: 92% (1865/2027)
remote: Compressing objects: 93% (1886/2027)
remote: Compressing objects: 94% (1906/2027)
remote: Compressing objects: 95% (1926/2027)
remote: Compressing objects: 96% (1946/2027)
remote: Compressing objects: 97% (1967/2027)
remote: Compressing objects: 98% (1987/2027)
remote: Compressing objects: 99% (2007/2027)
remote: Compressing objects: 100% (2027/2027)
remote: Compressing objects: 100% (2027/2027), done.
16.63 s
Receiving objects: 0% (1/103784)
Receiving objects: 1% (1038/103784)
Receiving objects: 2% (2076/103784)
Receiving objects: 3% (3114/103784)
Receiving objects: 4% (4152/103784)
Receiving objects: 5% (5190/103784)
Receiving objects: 6% (6228/103784)
Receiving objects: 7% (7265/103784), 15.82 MiB | 31.62 MiB/s
Receiving objects: 8% (8303/103784), 15.82 MiB | 31.62 MiB/s
Receiving objects: 9% (9341/103784), 15.82 MiB | 31.62 MiB/s
Receiving objects: 10% (10379/103784), 15.82 MiB | 31.62 MiB/s
Receiving objects: 11% (11417/103784), 15.82 MiB | 31.62 MiB/s
Receiving objects: 12% (12455/103784), 15.82 MiB | 31.62 MiB/s
Receiving objects: 13% (13492/103784), 15.82 MiB | 31.62 MiB/s
Receiving objects: 14% (14530/103784), 15.82 MiB | 31.62 MiB/s
Receiving objects: 15% (15568/103784), 15.82 MiB | 31.62 MiB/s
Receiving objects: 16% (16606/103784), 15.82 MiB | 31.62 MiB/s
Receiving objects: 17% (17644/103784), 15.82 MiB | 31.62 MiB/s
Receiving objects: 18% (18682/103784), 15.82 MiB | 31.62 MiB/s
Receiving objects: 19% (19719/103784), 15.82 MiB | 31.62 MiB/s
Receiving objects: 20% (20757/103784), 15.82 MiB | 31.62 MiB/s
Receiving objects: 21% (21795/103784), 15.82 MiB | 31.62 MiB/s
Receiving objects: 22% (22833/103784), 15.82 MiB | 31.62 MiB/s
Receiving objects: 23% (23871/103784), 15.82 MiB | 31.62 MiB/s
Receiving objects: 24% (24909/103784), 15.82 MiB | 31.62 MiB/s
Receiving objects: 25% (25946/103784), 15.82 MiB | 31.62 MiB/s
Receiving objects: 26% (26984/103784), 15.82 MiB | 31.62 MiB/s
Receiving objects: 27% (28022/103784), 15.82 MiB | 31.62 MiB/s
Receiving objects: 28% (29060/103784), 15.82 MiB | 31.62 MiB/s
Receiving objects: 29% (30098/103784), 15.82 MiB | 31.62 MiB/s
Receiving objects: 30% (31136/103784), 15.82 MiB | 31.62 MiB/s
Receiving objects: 31% (32174/103784), 15.82 MiB | 31.62 MiB/s
Receiving objects: 32% (33211/103784), 15.82 MiB | 31.62 MiB/s
Receiving objects: 33% (34249/103784), 15.82 MiB | 31.62 MiB/s
Receiving objects: 33% (34351/103784), 33.29 MiB | 33.28 MiB/s
Receiving objects: 34% (35287/103784), 33.29 MiB | 33.28 MiB/s
Receiving objects: 35% (36325/103784), 33.29 MiB | 33.28 MiB/s
Receiving objects: 36% (37363/103784), 33.29 MiB | 33.28 MiB/s
Receiving objects: 37% (38401/103784), 33.29 MiB | 33.28 MiB/s
Receiving objects: 38% (39438/103784), 33.29 MiB | 33.28 MiB/s
Receiving objects: 39% (40476/103784), 33.29 MiB | 33.28 MiB/s
Receiving objects: 40% (41514/103784), 49.71 MiB | 32.34 MiB/s
Receiving objects: 41% (42552/103784), 49.71 MiB | 32.34 MiB/s
Receiving objects: 42% (43590/103784), 49.71 MiB | 32.34 MiB/s
Receiving objects: 43% (44628/103784), 49.71 MiB | 32.34 MiB/s
Receiving objects: 44% (45665/103784), 49.71 MiB | 32.34 MiB/s
Receiving objects: 45% (46703/103784), 49.71 MiB | 32.34 MiB/s
Receiving objects: 46% (47741/103784), 49.71 MiB | 32.34 MiB/s
Receiving objects: 46% (48736/103784), 66.00 MiB | 32.39 MiB/s
Receiving objects: 47% (48779/103784), 66.00 MiB | 32.39 MiB/s
Receiving objects: 48% (49817/103784), 66.00 MiB | 32.39 MiB/s
Receiving objects: 49% (50855/103784), 66.00 MiB | 32.39 MiB/s
Receiving objects: 50% (51892/103784), 66.00 MiB | 32.39 MiB/s
Receiving objects: 51% (52930/103784), 66.00 MiB | 32.39 MiB/s
Receiving objects: 52% (53968/103784), 66.00 MiB | 32.39 MiB/s
Receiving objects: 53% (55006/103784), 66.00 MiB | 32.39 MiB/s
Receiving objects: 54% (56044/103784), 66.00 MiB | 32.39 MiB/s
Receiving objects: 54% (57017/103784), 99.69 MiB | 32.35 MiB/s
Receiving objects: 55% (57082/103784), 116.91 MiB | 32.65 MiB/s
Receiving objects: 55% (58014/103784), 116.91 MiB | 32.65 MiB/s
Receiving objects: 55% (58083/103784), 149.99 MiB | 32.74 MiB/s
Receiving objects: 56% (58120/103784), 165.89 MiB | 32.63 MiB/s
Receiving objects: 56% (58214/103784), 199.46 MiB | 32.82 MiB/s
Receiving objects: 56% (58616/103784), 215.36 MiB | 32.74 MiB/s
Receiving objects: 57% (59157/103784), 215.36 MiB | 32.74 MiB/s
Receiving objects: 58% (60195/103784), 230.80 MiB | 32.40 MiB/s
Receiving objects: 59% (61233/103784), 230.80 MiB | 32.40 MiB/s
Receiving objects: 60% (62271/103784), 230.80 MiB | 32.40 MiB/s
Receiving objects: 61% (63309/103784), 230.80 MiB | 32.40 MiB/s
Receiving objects: 62% (64347/103784), 230.80 MiB | 32.40 MiB/s
Receiving objects: 63% (65384/103784), 247.41 MiB | 32.69 MiB/s
Receiving objects: 64% (66422/103784), 247.41 MiB | 32.69 MiB/s
Receiving objects: 65% (67460/103784), 247.41 MiB | 32.69 MiB/s
Receiving objects: 66% (68498/103784), 247.41 MiB | 32.69 MiB/s
Receiving objects: 67% (69536/103784), 247.41 MiB | 32.69 MiB/s
Receiving objects: 67% (70400/103784), 247.41 MiB | 32.69 MiB/s
Receiving objects: 68% (70574/103784), 247.41 MiB | 32.69 MiB/s
Receiving objects: 69% (71611/103784), 247.41 MiB | 32.69 MiB/s
Receiving objects: 70% (72649/103784), 247.41 MiB | 32.69 MiB/s
Receiving objects: 71% (73687/103784), 247.41 MiB | 32.69 MiB/s
Receiving objects: 72% (74725/103784), 264.06 MiB | 32.57 MiB/s
Receiving objects: 73% (75763/103784), 264.06 MiB | 32.57 MiB/s
Receiving objects: 74% (76801/103784), 264.06 MiB | 32.57 MiB/s
Receiving objects: 75% (77838/103784), 280.90 MiB | 32.43 MiB/s
Receiving objects: 75% (77979/103784), 280.90 MiB | 32.43 MiB/s
Receiving objects: 76% (78876/103784), 296.50 MiB | 32.43 MiB/s
Receiving objects: 77% (79914/103784), 296.50 MiB | 32.43 MiB/s
Receiving objects: 78% (80952/103784), 296.50 MiB | 32.43 MiB/s
Receiving objects: 79% (81990/103784), 296.50 MiB | 32.43 MiB/s
Receiving objects: 80% (83028/103784), 296.50 MiB | 32.43 MiB/s
Receiving objects: 81% (84066/103784), 313.06 MiB | 32.61 MiB/s
Receiving objects: 82% (85103/103784), 313.06 MiB | 32.61 MiB/s
Receiving objects: 82% (85479/103784), 329.16 MiB | 32.49 MiB/s
Receiving objects: 82% (85502/103784), 345.35 MiB | 32.32 MiB/s
Receiving objects: 83% (86141/103784), 361.35 MiB | 32.33 MiB/s
Receiving objects: 84% (87179/103784), 361.35 MiB | 32.33 MiB/s
Receiving objects: 85% (88217/103784), 361.35 MiB | 32.33 MiB/s
Receiving objects: 86% (89255/103784), 377.31 MiB | 32.32 MiB/s
Receiving objects: 87% (90293/103784), 377.31 MiB | 32.32 MiB/s
Receiving objects: 88% (91330/103784), 377.31 MiB | 32.32 MiB/s
Receiving objects: 88% (92036/103784), 377.31 MiB | 32.32 MiB/s
Receiving objects: 89% (92368/103784), 393.01 MiB | 32.12 MiB/s
Receiving objects: 89% (92662/103784), 410.79 MiB | 32.35 MiB/s
Receiving objects: 90% (93406/103784), 426.98 MiB | 32.19 MiB/s
Receiving objects: 91% (94444/103784), 426.98 MiB | 32.19 MiB/s
Receiving objects: 92% (95482/103784), 426.98 MiB | 32.19 MiB/s
Receiving objects: 93% (96520/103784), 426.98 MiB | 32.19 MiB/s
Receiving objects: 94% (97557/103784), 426.98 MiB | 32.19 MiB/s
Receiving objects: 95% (98595/103784), 426.98 MiB | 32.19 MiB/s
Receiving objects: 96% (99633/103784), 426.98 MiB | 32.19 MiB/s
Receiving objects: 97% (100671/103784), 426.98 MiB | 32.19 MiB/s
Receiving objects: 98% (101709/103784), 426.98 MiB | 32.19 MiB/s
Receiving objects: 99% (102747/103784), 426.98 MiB | 32.19 MiB/s
remote: Total 103784 (delta 8150), reused 7457 (delta 7388), pack-reused 94363 (from 4)
16.63 s
Receiving objects: 100% (103784/103784), 426.98 MiB | 32.19 MiB/s
Receiving objects: 100% (103784/103784), 439.18 MiB | 32.42 MiB/s, done.
18.31 s
Resolving deltas: 0% (0/67929)
Resolving deltas: 1% (680/67929)
Resolving deltas: 2% (1359/67929)
Resolving deltas: 3% (2040/67929)
Resolving deltas: 4% (2718/67929)
Resolving deltas: 5% (3398/67929)
Resolving deltas: 6% (4076/67929)
Resolving deltas: 7% (4756/67929)
Resolving deltas: 8% (5435/67929)
Resolving deltas: 9% (6114/67929)
Resolving deltas: 10% (6793/67929)
Resolving deltas: 11% (7473/67929)
Resolving deltas: 12% (8152/67929)
Resolving deltas: 13% (8831/67929)
Resolving deltas: 14% (9511/67929)
Resolving deltas: 15% (10191/67929)
Resolving deltas: 16% (10869/67929)
Resolving deltas: 17% (11548/67929)
Resolving deltas: 18% (12228/67929)
Resolving deltas: 19% (12907/67929)
Resolving deltas: 20% (13586/67929)
Resolving deltas: 21% (14266/67929)
Resolving deltas: 22% (14946/67929)
Resolving deltas: 23% (15624/67929)
Resolving deltas: 24% (16303/67929)
Resolving deltas: 25% (16983/67929)
Resolving deltas: 26% (17662/67929)
Resolving deltas: 27% (18342/67929)
Resolving deltas: 28% (19021/67929)
Resolving deltas: 29% (19700/67929)
Resolving deltas: 30% (20379/67929)
Resolving deltas: 31% (21058/67929)
Resolving deltas: 32% (21740/67929)
Resolving deltas: 33% (22417/67929)
Resolving deltas: 34% (23098/67929)
Resolving deltas: 35% (23776/67929)
Resolving deltas: 36% (24456/67929)
Resolving deltas: 37% (25134/67929)
Resolving deltas: 38% (25814/67929)
Resolving deltas: 39% (26493/67929)
Resolving deltas: 40% (27172/67929)
Resolving deltas: 41% (27851/67929)
Resolving deltas: 42% (28531/67929)
Resolving deltas: 43% (29214/67929)
Resolving deltas: 44% (29890/67929)
Resolving deltas: 45% (30569/67929)
Resolving deltas: 46% (31252/67929)
Resolving deltas: 47% (31927/67929)
Resolving deltas: 48% (32606/67929)
Resolving deltas: 49% (33286/67929)
Resolving deltas: 50% (33965/67929)
Resolving deltas: 51% (34644/67929)
Resolving deltas: 52% (35324/67929)
Resolving deltas: 53% (36005/67929)
Resolving deltas: 54% (36683/67929)
Resolving deltas: 55% (37361/67929)
Resolving deltas: 56% (38041/67929)
Resolving deltas: 57% (38721/67929)
Resolving deltas: 58% (39399/67929)
Resolving deltas: 59% (40079/67929)
Resolving deltas: 60% (40759/67929)
Resolving deltas: 61% (41437/67929)
Resolving deltas: 62% (42116/67929)
Resolving deltas: 63% (42796/67929)
Resolving deltas: 64% (43475/67929)
Resolving deltas: 65% (44154/67929)
Resolving deltas: 66% (44834/67929)
Resolving deltas: 67% (45514/67929)
Resolving deltas: 67% (46001/67929)
Resolving deltas: 68% (46192/67929)
Resolving deltas: 69% (46874/67929)
Resolving deltas: 70% (47551/67929)
Resolving deltas: 71% (48232/67929)
Resolving deltas: 72% (48909/67929)
Resolving deltas: 73% (49589/67929)
Resolving deltas: 74% (50268/67929)
Resolving deltas: 75% (50947/67929)
Resolving deltas: 76% (51627/67929)
Resolving deltas: 77% (52309/67929)
Resolving deltas: 78% (52985/67929)
Resolving deltas: 79% (53665/67929)
Resolving deltas: 80% (54344/67929)
Resolving deltas: 81% (55023/67929)
Resolving deltas: 82% (55702/67929)
Resolving deltas: 83% (56382/67929)
Resolving deltas: 84% (57062/67929)
Resolving deltas: 85% (57740/67929)
Resolving deltas: 86% (58419/67929)
Resolving deltas: 87% (59099/67929)
Resolving deltas: 88% (59778/67929)
Resolving deltas: 89% (60457/67929)
Resolving deltas: 90% (61137/67929)
Resolving deltas: 91% (61816/67929)
Resolving deltas: 92% (62495/67929)
Resolving deltas: 93% (63174/67929)
Resolving deltas: 94% (63854/67929)
Resolving deltas: 95% (64533/67929)
Resolving deltas: 96% (65213/67929)
Resolving deltas: 97% (65892/67929)
Resolving deltas: 98% (66572/67929)
Resolving deltas: 99% (67250/67929)
Resolving deltas: 100% (67929/67929)
Resolving deltas: 100% (67929/67929), done.
19.12 s
Fetching commit 58aaf5380023d118a91aa4083c01395586246f14 for feynkit ...
19.12 s
$ /nix/store/5vpcfsdx1lcnlb2y4k7xyc74shp5qwbh-git-2.54.0/bin/git fetch origin 58aaf5380023d118a91aa4083c01395586246f14
19.56 s
From https://github.com/alphal00p/gammaloop
19.56 s
* branch 58aaf5380023d118a91aa4083c01395586246f14 -> FETCH_HEAD
19.58 s
$ /nix/store/61685rbaxmpigwi3z23i33sv3jyfl70q-coreutils-9.11/bin/timeout --kill-after=15s 7200s /nix/store/5vpcfsdx1lcnlb2y4k7xyc74shp5qwbh-git-2.54.0/bin/git -c advice.detachedHead=false checkout 58aaf5380023d118a91aa4083c01395586246f14
19.90 s
HEAD is now at 58aaf5380 share physics layout across graph renderers
19.91 s
$ /nix/store/61685rbaxmpigwi3z23i33sv3jyfl70q-coreutils-9.11/bin/timeout --kill-after=15s 7200s /nix/store/wknkybkzrc16r11vk5vrykh4wmw7a353-nix-2.34.8/bin/nix --extra-experimental-features nix-command --extra-experimental-features flakes --log-format internal-json run .#packages.x86_64-linux.nix-ci-check-gammaloop-nextest-feynkit --print-build-logs
20.51 s
warning: ignoring untrusted flake configuration setting 'extra-substituters'.
20.51 s
Pass '--accept-flake-config' to trust it
20.51 s
warning: ignoring untrusted flake configuration setting 'extra-trusted-public-keys'.
20.51 s
Pass '--accept-flake-config' to trust it
20.56 s
21.24 s
Downloading cached source from https://cache.nix-ci.com
30.87 s
Downloaded cached source (204.9 MiB) in 9.6s
30.87 s
Progress: 1 of 1 downloaded from cache
53.39 s
53.40 s
Downloading cached xgcc-15.3.0-libgcc from https://cache.nix-ci.com
53.40 s
Downloading cached busybox from https://cache.nix-ci.com
53.40 s
Downloading cached gcc-15.3.0-libgcc from https://cache.nix-ci.com
53.40 s
Downloading cached libunistring from https://cache.nix-ci.com
53.40 s
Downloading cached publicsuffix-list-0-unstable-2026-09 from https://cache.nix-ci.com
53.42 s
Downloaded cached xgcc-15.3.0-libgcc (193 KiB) in 14ms
53.42 s
Progress: 0 of 1 built, 1 of 65 downloaded from cache (4 downloading)
53.42 s
Downloaded cached busybox (230 KiB) in 14ms
53.42 s
Progress: 0 of 1 built, 2 of 65 downloaded from cache (3 downloading)
53.42 s
Downloaded cached gcc-15.3.0-libgcc (193 KiB) in 15ms
53.42 s
Progress: 0 of 1 built, 3 of 65 downloaded from cache (2 downloading)
53.42 s
Downloaded cached publicsuffix-list-0-unstable-2026-09 (330 KiB) in 14ms
53.42 s
Progress: 0 of 1 built, 4 of 65 downloaded from cache (1 downloading)
53.43 s
Downloaded cached libunistring (2 MiB) in 28ms
53.43 s
Progress: 0 of 1 built, 5 of 65 downloaded from cache
53.43 s
Downloading cached libidn2 from https://cache.nix-ci.com
53.45 s
Downloaded cached libidn2 (359 KiB) in 18ms
53.45 s
Progress: 0 of 1 built, 6 of 65 downloaded from cache
53.45 s
Downloading cached glibc-2.42 from https://cache.nix-ci.com
53.60 s
Downloaded cached glibc-2.42 (33.4 MiB) in 144ms
53.60 s
Progress: 0 of 1 built, 7 of 65 downloaded from cache
53.60 s
Downloading cached acl from https://cache.nix-ci.com
53.60 s
Downloading cached aws-c-common from https://cache.nix-ci.com
53.60 s
Downloading cached bash from https://cache.nix-ci.com
53.60 s
Downloading cached brotli-1.2.0-lib from https://cache.nix-ci.com
53.60 s
Downloading cached bzip2 from https://cache.nix-ci.com
53.60 s
Downloading cached editline-1.17.1-unstable-2025-05 from https://cache.nix-ci.com
53.60 s
Downloading cached gcc-15.3.0-lib from https://cache.nix-ci.com
53.60 s
Downloading cached hwloc-2.14.0-lib from https://cache.nix-ci.com
53.60 s
Downloading cached keyutils-1.6.3-lib from https://cache.nix-ci.com
53.60 s
Downloading cached libcpuid from https://cache.nix-ci.com
53.60 s
Downloading cached libpsl from https://cache.nix-ci.com
53.60 s
Downloading cached libseccomp-2.6.1-lib from https://cache.nix-ci.com
53.60 s
Downloading cached libsodium-1.0.22-unstable-2026-08 from https://cache.nix-ci.com
53.60 s
Downloading cached libxml2 from https://cache.nix-ci.com
53.60 s
Downloading cached llhttp from https://cache.nix-ci.com
53.60 s
Downloading cached lowdown-3.0.1-lib from https://cache.nix-ci.com
53.61 s
Downloaded cached editline-1.17.1-unstable-2025-05 (58 KiB) in 14ms
53.61 s
Progress: 0 of 1 built, 8 of 65 downloaded from cache (15 downloading)
53.61 s
Downloading cached nghttp2-1.70.0-lib from https://cache.nix-ci.com
53.62 s
Downloaded cached bash (1.8 MiB) in 25ms
53.62 s
Progress: 0 of 1 built, 9 of 65 downloaded from cache (15 downloading)
53.62 s
Downloading cached nghttp3 from https://cache.nix-ci.com
53.62 s
Downloaded cached keyutils-1.6.3-lib (41 KiB) in 27ms
53.62 s
Progress: 0 of 1 built, 10 of 65 downloaded from cache (15 downloading)
53.62 s
Downloading cached openssl from https://cache.nix-ci.com
53.64 s
Downloaded cached acl (134 KiB) in 41ms
53.64 s
Progress: 0 of 1 built, 11 of 65 downloaded from cache (15 downloading)
53.64 s
Downloading cached pcre2 from https://cache.nix-ci.com
53.64 s
Downloaded cached brotli-1.2.0-lib (961 KiB) in 43ms
53.64 s
Progress: 0 of 1 built, 12 of 65 downloaded from cache (15 downloading)
53.64 s
Downloading cached xz from https://cache.nix-ci.com
53.64 s
Downloaded cached hwloc-2.14.0-lib (458 KiB) in 46ms
53.64 s
Progress: 0 of 1 built, 13 of 65 downloaded from cache (15 downloading)
53.64 s
Downloading cached zlib from https://cache.nix-ci.com
53.64 s
Downloaded cached bzip2 (86 KiB) in 47ms
53.64 s
Progress: 0 of 1 built, 14 of 65 downloaded from cache (15 downloading)
53.64 s
Downloaded cached libseccomp-2.6.1-lib (189 KiB) in 47ms
53.64 s
Progress: 0 of 1 built, 15 of 65 downloaded from cache (14 downloading)
53.65 s
Downloaded cached aws-c-common (1.1 MiB) in 51ms
53.65 s
Progress: 0 of 1 built, 16 of 65 downloaded from cache (13 downloading)
53.65 s
Downloading cached aws-c-compression from https://cache.nix-ci.com
53.65 s
Downloading cached aws-c-sdkutils from https://cache.nix-ci.com
53.65 s
Downloading cached aws-checksums from https://cache.nix-ci.com
53.65 s
Downloaded cached libpsl (114 KiB) in 58ms
53.65 s
Progress: 0 of 1 built, 17 of 65 downloaded from cache (15 downloading)
53.66 s
Downloaded cached libcpuid (326 KiB) in 63ms
53.66 s
Progress: 0 of 1 built, 18 of 65 downloaded from cache (14 downloading)
53.66 s
Downloaded cached lowdown-3.0.1-lib (341 KiB) in 64ms
53.66 s
Progress: 0 of 1 built, 19 of 65 downloaded from cache (13 downloading)
53.66 s
Downloaded cached llhttp (89 KiB) in 65ms
53.66 s
Progress: 0 of 1 built, 20 of 65 downloaded from cache (12 downloading)
53.67 s
Downloaded cached libxml2 (1.4 MiB) in 70ms
53.67 s
Progress: 0 of 1 built, 21 of 65 downloaded from cache (11 downloading)
53.67 s
Downloaded cached nghttp2-1.70.0-lib (225 KiB) in 56ms
53.67 s
Progress: 0 of 1 built, 22 of 65 downloaded from cache (10 downloading)
53.67 s
Downloaded cached nghttp3 (228 KiB) in 46ms
53.67 s
Progress: 0 of 1 built, 23 of 65 downloaded from cache (9 downloading)
53.67 s
Downloaded cached libsodium-1.0.22-unstable-2026-08 (669 KiB) in 76ms
53.67 s
Progress: 0 of 1 built, 24 of 65 downloaded from cache (8 downloading)
53.68 s
Downloaded cached zlib (129 KiB) in 35ms
53.68 s
Progress: 0 of 1 built, 25 of 65 downloaded from cache (7 downloading)
53.68 s
Downloading cached sqlite from https://cache.nix-ci.com
53.68 s
Downloaded cached aws-c-compression (31 KiB) in 34ms
53.68 s
Progress: 0 of 1 built, 26 of 65 downloaded from cache (7 downloading)
53.68 s
Downloaded cached xz (837 KiB) in 43ms
53.68 s
Progress: 0 of 1 built, 27 of 65 downloaded from cache (6 downloading)
53.68 s
Downloaded cached gcc-15.3.0-lib (9.8 MiB) in 88ms
53.68 s
Progress: 0 of 1 built, 28 of 65 downloaded from cache (5 downloading)
53.69 s
Downloading cached boehm-gc from https://cache.nix-ci.com
53.69 s
Downloading cached icu4c from https://cache.nix-ci.com
53.69 s
Downloading cached onetbb from https://cache.nix-ci.com
53.69 s
Downloading cached zstd from https://cache.nix-ci.com
53.69 s
Downloaded cached aws-checksums (86 KiB) in 36ms
53.69 s
Progress: 0 of 1 built, 29 of 65 downloaded from cache (8 downloading)
53.69 s
Downloaded cached aws-c-sdkutils (155 KiB) in 37ms
53.69 s
Progress: 0 of 1 built, 30 of 65 downloaded from cache (7 downloading)
53.69 s
Downloaded cached pcre2 (2 MiB) in 56ms
53.69 s
Progress: 0 of 1 built, 31 of 65 downloaded from cache (6 downloading)
53.72 s
Downloaded cached openssl (8.9 MiB) in 92ms
53.72 s
Progress: 0 of 1 built, 32 of 65 downloaded from cache (5 downloading)
53.72 s
Downloading cached aws-c-cal from https://cache.nix-ci.com
53.72 s
Downloading cached krb5-1.22.2-lib from https://cache.nix-ci.com
53.72 s
Downloading cached libssh2 from https://cache.nix-ci.com
53.72 s
Downloading cached ngtcp2 from https://cache.nix-ci.com
53.72 s
Downloading cached s2n-tls from https://cache.nix-ci.com
53.72 s
Downloaded cached boehm-gc (312 KiB) in 39ms
53.72 s
Progress: 0 of 1 built, 33 of 65 downloaded from cache (9 downloading)
53.73 s
Downloaded cached onetbb (626 KiB) in 45ms
53.73 s
Progress: 0 of 1 built, 34 of 65 downloaded from cache (8 downloading)
53.73 s
Downloading cached libblake3 from https://cache.nix-ci.com
53.73 s
Downloaded cached zstd (1.1 MiB) in 47ms
53.73 s
Progress: 0 of 1 built, 35 of 65 downloaded from cache (8 downloading)
53.73 s
Downloading cached libarchive-3.8.9-lib from https://cache.nix-ci.com
53.75 s
Downloaded cached sqlite (5.7 MiB) in 70ms
53.75 s
Progress: 0 of 1 built, 36 of 65 downloaded from cache (8 downloading)
53.75 s
Downloaded cached aws-c-cal (158 KiB) in 33ms
53.75 s
Progress: 0 of 1 built, 37 of 65 downloaded from cache (7 downloading)
53.75 s
Downloaded cached libssh2 (330 KiB) in 37ms
53.75 s
Progress: 0 of 1 built, 38 of 65 downloaded from cache (6 downloading)
53.76 s
Downloading cached libgit2-1.9.7-lib from https://cache.nix-ci.com
53.76 s
Downloaded cached ngtcp2 (515 KiB) in 45ms
53.76 s
Progress: 0 of 1 built, 39 of 65 downloaded from cache (6 downloading)
53.76 s
Downloaded cached libblake3 (117 KiB) in 33ms
53.76 s
Progress: 0 of 1 built, 40 of 65 downloaded from cache (5 downloading)
53.77 s
Downloaded cached s2n-tls (1.3 MiB) in 50ms
53.77 s
Progress: 0 of 1 built, 41 of 65 downloaded from cache (4 downloading)
53.77 s
Downloading cached aws-c-io from https://cache.nix-ci.com
53.78 s
Downloaded cached libarchive-3.8.9-lib (961 KiB) in 42ms
53.78 s
Progress: 0 of 1 built, 42 of 65 downloaded from cache (4 downloading)
53.78 s
Downloaded cached krb5-1.22.2-lib (2.7 MiB) in 64ms
53.78 s
Progress: 0 of 1 built, 43 of 65 downloaded from cache (3 downloading)
53.78 s
Downloading cached curl from https://cache.nix-ci.com
53.80 s
Downloaded cached libgit2-1.9.7-lib (1.6 MiB) in 44ms
53.80 s
Progress: 0 of 1 built, 44 of 65 downloaded from cache (3 downloading)
53.80 s
Downloaded cached aws-c-io (648 KiB) in 33ms
53.80 s
Progress: 0 of 1 built, 45 of 65 downloaded from cache (2 downloading)
53.80 s
Downloading cached aws-c-event-stream from https://cache.nix-ci.com
53.80 s
Downloading cached aws-c-http from https://cache.nix-ci.com
53.82 s
Downloaded cached curl (1.2 MiB) in 39ms
53.82 s
Progress: 0 of 1 built, 46 of 65 downloaded from cache (3 downloading)
53.83 s
Downloaded cached aws-c-event-stream (176 KiB) in 31ms
53.83 s
Progress: 0 of 1 built, 47 of 65 downloaded from cache (2 downloading)
53.84 s
Downloaded cached aws-c-http (641 KiB) in 35ms
53.84 s
Progress: 0 of 1 built, 48 of 65 downloaded from cache (1 downloading)
53.84 s
Downloading cached aws-c-auth from https://cache.nix-ci.com
53.84 s
Downloading cached aws-c-mqtt from https://cache.nix-ci.com
53.87 s
Downloaded cached aws-c-mqtt (557 KiB) in 34ms
53.87 s
Progress: 0 of 1 built, 49 of 65 downloaded from cache (2 downloading)
53.87 s
Downloaded cached aws-c-auth (387 KiB) in 35ms
53.87 s
Progress: 0 of 1 built, 50 of 65 downloaded from cache (1 downloading)
53.87 s
Downloading cached aws-c-s3 from https://cache.nix-ci.com
53.91 s
Downloaded cached icu4c (39.5 MiB) in 223ms
53.91 s
Progress: 0 of 1 built, 51 of 65 downloaded from cache (1 downloading)
53.91 s
Downloading cached boost from https://cache.nix-ci.com
53.91 s
Downloaded cached aws-c-s3 (384 KiB) in 36ms
53.91 s
Progress: 0 of 1 built, 52 of 65 downloaded from cache (1 downloading)
53.91 s
Downloading cached aws-crt-cpp from https://cache.nix-ci.com
53.93 s
Downloaded cached aws-crt-cpp (979 KiB) in 21ms
53.93 s
Progress: 0 of 1 built, 53 of 65 downloaded from cache (1 downloading)
53.97 s
Downloaded cached boost (14.5 MiB) in 62ms
53.97 s
Progress: 0 of 1 built, 54 of 65 downloaded from cache
53.97 s
Downloading cached nix-util from https://cache.nix-ci.com
53.99 s
Downloaded cached nix-util (2.4 MiB) in 20ms
53.99 s
Progress: 0 of 1 built, 55 of 65 downloaded from cache
53.99 s
Downloading cached nix-nswrapper from https://cache.nix-ci.com
53.99 s
Downloading cached nix-store from https://cache.nix-ci.com
54.01 s
Downloaded cached nix-nswrapper (131 KiB) in 14ms
54.01 s
Progress: 0 of 1 built, 56 of 65 downloaded from cache (1 downloading)
54.02 s
Downloaded cached nix-store (5.8 MiB) in 30ms
54.02 s
Progress: 0 of 1 built, 57 of 65 downloaded from cache
54.02 s
Downloading cached nix-fetchers from https://cache.nix-ci.com
54.02 s
Downloading cached nix-main from https://cache.nix-ci.com
54.04 s
Downloaded cached nix-main (393 KiB) in 14ms
54.04 s
Progress: 0 of 1 built, 58 of 65 downloaded from cache (1 downloading)
54.05 s
Downloaded cached nix-fetchers (1.5 MiB) in 23ms
54.05 s
Progress: 0 of 1 built, 59 of 65 downloaded from cache
54.05 s
Downloading cached nix-expr from https://cache.nix-ci.com
54.07 s
Downloaded cached nix-expr (3.3 MiB) in 21ms
54.07 s
Progress: 0 of 1 built, 60 of 65 downloaded from cache
54.07 s
Downloading cached nix-flake from https://cache.nix-ci.com
54.08 s
Downloaded cached nix-flake (956 KiB) in 15ms
54.08 s
Progress: 0 of 1 built, 61 of 65 downloaded from cache
54.08 s
Downloading cached nix-cmd from https://cache.nix-ci.com
54.10 s
Downloaded cached nix-cmd (1 MiB) in 16ms
54.10 s
Progress: 0 of 1 built, 62 of 65 downloaded from cache
54.10 s
Downloading cached nix from https://cache.nix-ci.com
54.13 s
Downloaded cached nix (3.9 MiB) in 30ms
54.13 s
Progress: 0 of 1 built, 63 of 65 downloaded from cache
54.13 s
Downloading cached nix from https://cache.nix-ci.com
54.15 s
Downloaded cached nix (8848 B) in 13ms
54.15 s
Progress: 0 of 1 built, 64 of 65 downloaded from cache
54.15 s
Downloading cached nix-ci-check-gammaloop-nextest-feynkit from https://cache.nix-ci.com
54.15 s
Downloaded cached nix-ci-check-gammaloop-nextest-feynkit (1128 B) in 4ms
54.15 s
Progress: 0 of 1 built, 65 of 65 downloaded from cache
54.31 s
evaluating derivation 'gdo you want to allow configuration setting 'extra-substituters' to be set to 'https://cache.nix-ci.com ' (y/N)? do you want to permanently mark this value as untrusted (y/N)? warning: ignoring untrusted flake configuration setting 'extra-substituters'.
54.31 s
Pass '--accept-flake-config' to trust it
54.31 s
do you want to allow configuration setting 'extra-trusted-public-keys' to be set to 'nix-ci:g3xV5BDTLtIBZr/A00IU1x0EtKKlb7YLgBN2SgYgM6A= ' (y/N)? do you want to permanently mark this value as untrusted (y/N)? warning: ignoring untrusted flake configuration setting 'extra-trusted-public-keys'.
54.31 s
Pass '--accept-flake-config' to trust it
60.63 s
copying '/nix/store/566x
evaluating derivation 'g
copying '/nix/store/566x
evaluating derivation 'g
copying '/nix/store/566x
evaluating derivation 'g
copying '/nix/store/566x
evaluating derivation 'g
querying gammaloop-nexte
[27.7 KiB DL] querying b
[0 /31 built, 0 /60 copied
[0 /32 built, 16 /8 /73 cop
[0 /31 built, 16 /12 /73 co
[0 /31 built, 16 /14 /73 co
[0 /30 built, 16 /17 /73 co
[0 /30 built, 16 /19 /73 co
[0 /30 built, 16 /22 /73 co
[0 /30 built, 16 /27 /73 co
[0 /30 built, 16 /29 /73 co
[0 /30 built, 16 /33 /73 co
[0 /28 built, 16 /38 /73 co
[0 /27 built, 16 /40 /73 co
[0 /26 built, 16 /42 /73 co
[0 /26 built, 16 /43 /73 co
[0 /25 built, 16 /49 /73 co
[0 /25 built, 16 /50 /73 co
[0 /25 built, 16 /51 /73 co
[0 /25 built, 16 /52 /73 co
[0 /24 built, 15 /54 /73 co
[0 /22 built, 13 /56 /73 cocrane-dummy-cargo-target.rs> structuredAttrs is enabled
60.66 s
[2 /0 /22 built, 9 /60 /73 c
[2 /0 /19 built, 10 /60 /73 crane-dummy-cargo-target.rs (post)> Uploading to the NixCI cache: /nix/store/h9idxv2cp1lvcmhzmgqyh438ad00r3gj-crane-dummy-cargo-target.rs
60.73 s
crane-dummy-cargo-target.rs (post)> warning: 'warn-short-path-literals' is deprecated, use 'lint-short-path-literals = ignore' instead
60.79 s
crane-dummy-cargo-target.rs (post)> copying 0 paths...
60.86 s
crane-dummy-cargo-target.rs (post)> warning: 'warn-short-path-literals' is deprecated, use 'lint-short-path-literals = ignore' instead
61.85 s
crane-dummy-cargo-target.rs (post)> copying 0 paths...
61.86 s
crane-dummy-proc-macro-cargo-target.rs> structuredAttrs is enabled
61.88 s
[1 /1 /19 built, 5 /65 /73 ccrane-dummy-proc-macro-cargo-target.rs (post)> Uploading to the NixCI cache: /nix/store/pqldjybaz45ml2lph0qcpw3vpa5j90n9-crane-dummy-proc-macro-cargo-target.rs
61.92 s
[1 /1 /15 built, 7 /65 /73 ccrane-dummy-proc-macro-cargo-target.rs (post)> warning: 'warn-short-path-literals' is deprecated, use 'lint-short-path-literals = ignore' instead
61.96 s
crane-dummy-proc-macro-cargo-target.rs (post)> copying 0 paths...
62.02 s
crane-dummy-proc-macro-cargo-target.rs (post)> warning: 'warn-short-path-literals' is deprecated, use 'lint-short-path-literals = ignore' instead
62.08 s
crane-dummy-proc-macro-cargo-target.rs (post)> copying 0 paths...
63.89 s
[2 /12 built, 4 /68 /73 cop
[2 /11 built, 3 /69 /73 cop
[2 /10 built, 2 /70 /73 cop
[1 /2 /9 built, 1 /71 /73 cogammaloop-nextest-binaries-feynkit (post)> Uploading to the NixCI cache: /nix/store/b0ni761scdpg1cxcd0yqiswk04l8lsh2-gammaloop-nextest-binaries-feynkit
63.95 s
gammaloop-nextest-binaries-feynkit (post)> warning: 'warn-short-path-literals' is deprecated, use 'lint-short-path-literals = ignore' instead
64.00 s
gammaloop-nextest-binaries-feynkit (post)> copying 0 paths...
64.09 s
gammaloop-nextest-binaries-feynkit (post)> warning: 'warn-short-path-literals' is deprecated, use 'lint-short-path-literals = ignore' instead
67.96 s
gammaloop-nextest-binaries-feynkit (post)> copying 0 paths...
68.51 s
[3 /8 built, 1 /72 /73 copi
[1 /3 /8 built, 1 /72 /73 co
[2 /3 /8 built, 1 /72 /73 co
[2 /3 /7 built, 73 copied rust-stable-with-std (post)> Uploading to the NixCI cache: /nix/store/wg9kw4yhn1jn01mjs8cwx5mz69l1s64z-rust-stable-with-std-2026-09-03
68.58 s
rust-stable-with-std (post)> warning: 'warn-short-path-literals' is deprecated, use 'lint-short-path-literals = ignore' instead
68.63 s
rust-stable-with-std (post)> copying 0 paths...
68.71 s
rust-stable-with-std (post)> warning: 'warn-short-path-literals' is deprecated, use 'lint-short-path-literals = ignore' instead
68.77 s
rust-stable-with-std (post)> copying 0 paths...
68.99 s
[1 /4 /8 built, 73 copied clippy-stable-with-std (post)> Uploading to the NixCI cache: /nix/store/s9nslw8h7m9vh88zd2hilmjb298pfca4-clippy-stable-with-std-2026-09-03
69.05 s
clippy-stable-with-std (post)> warning: 'warn-short-path-literals' is deprecated, use 'lint-short-path-literals = ignore' instead
69.10 s
clippy-stable-with-std (post)> copying 0 paths...
69.18 s
clippy-stable-with-std (post)> warning: 'warn-short-path-literals' is deprecated, use 'lint-short-path-literals = ignore' instead
69.25 s
clippy-stable-with-std (post)> copying 0 paths...
69.39 s
[5 /8 built, 73 copied (1
[1 /5 /7 built, 73 copied rust-stable-with-components> /nix/store/wg9kw4yhn1jn01mjs8cwx5mz69l1s64z-rust-stable-with-std-2026-09-03/lib:
69.39 s
rust-stable-with-components> librustc_driver-eaf3ed1d23ca5027.so: Keeping existing link to /nix/store/s9nslw8h7m9vh88zd2hilmjb298pfca4-clippy-stable-with-std-2026-09-03/lib/librustc_driver-eaf3ed1d23ca5027.so
69.39 s
rust-stable-with-components> /nix/store/wg9kw4yhn1jn01mjs8cwx5mz69l1s64z-rust-stable-with-std-2026-09-03/bin:
69.39 s
rust-stable-with-components> rust-lldb: Keeping existing link to /nix/store/s9nslw8h7m9vh88zd2hilmjb298pfca4-clippy-stable-with-std-2026-09-03/bin/rust-lldb
69.39 s
rust-stable-with-components> rustdoc: Keeping existing link to /nix/store/s9nslw8h7m9vh88zd2hilmjb298pfca4-clippy-stable-with-std-2026-09-03/bin/rustdoc
69.39 s
rust-stable-with-components> rustc: Keeping existing link to /nix/store/s9nslw8h7m9vh88zd2hilmjb298pfca4-clippy-stable-with-std-2026-09-03/bin/rustc
69.39 s
rust-stable-with-components> rust-gdb: Keeping existing link to /nix/store/s9nslw8h7m9vh88zd2hilmjb298pfca4-clippy-stable-with-std-2026-09-03/bin/rust-gdb
69.39 s
rust-stable-with-components> rust-gdbgui: Keeping existing link to /nix/store/s9nslw8h7m9vh88zd2hilmjb298pfca4-clippy-stable-with-std-2026-09-03/bin/rust-gdbgui
70.04 s
rust-stable-with-components (post)> Uploading to the NixCI cache: /nix/store/c3bpv60f5wgp4pmgsifaykxk214h6463-rust-stable-with-components-2026-09-03
70.11 s
rust-stable-with-components (post)> warning: 'warn-short-path-literals' is deprecated, use 'lint-short-path-literals = ignore' instead
70.16 s
rust-stable-with-components (post)> copying 0 paths...
70.24 s
rust-stable-with-components (post)> warning: 'warn-short-path-literals' is deprecated, use 'lint-short-path-literals = ignore' instead
70.31 s
rust-stable-with-components (post)> copying 0 paths...
70.77 s
[6 /8 built, 73 copied (1
[1 /6 /7 built, 73 copied gammaloop-nextest-feynkit> Extracting 1 binary and 2 linked paths to /build/source
70.89 s
gammaloop-nextest-feynkit> Extracted 15 files to /build/source in 0.12s
70.91 s
gammaloop-nextest-feynkit> ------------
70.91 s
gammaloop-nextest-feynkit> Nextest run ID 8441c8c3-a6f3-4ff9-81e6-40fc3b9a7333 with nextest profile: ci_gammaloop
70.91 s
gammaloop-nextest-feynkit> Starting 1 test across 1 binary
70.91 s
gammaloop-nextest-feynkit> ------------
70.91 s
gammaloop-nextest-feynkit> Summary [ 0.008s] 1 test run: 1 passed , 0 skipped
70.97 s
gammaloop-nextest-feynkit>
70.97 s
gammaloop-nextest-feynkit> ========== nextest test summary ==========
70.97 s
gammaloop-nextest-feynkit> report: target/nextest/ci_gammaloop/junit.xml
70.97 s
gammaloop-nextest-feynkit> tests: 1, failures: 0, errors: 0
70.97 s
gammaloop-nextest-feynkit> No failing testcases found.
70.97 s
gammaloop-nextest-feynkit> =========================================
70.99 s
gammaloop-nextest-feynkit> Extracting 1 binary and 2 linked paths to /build/source
71.12 s
gammaloop-nextest-feynkit> Extracted 15 files to /build/source in 0.14s
71.14 s
gammaloop-nextest-feynkit> ------------
71.14 s
gammaloop-nextest-feynkit> Nextest run ID 6c579f66-d6bd-493f-845c-18e991544f13 with nextest profile: ci_gammaloop
71.14 s
gammaloop-nextest-feynkit> Starting 33 tests across 1 binary
71.17 s
gammaloop-nextest-feynkit> ------------
71.17 s
gammaloop-nextest-feynkit> Summary [ 0.030s] 33 tests run: 33 passed , 0 skipped
71.22 s
gammaloop-nextest-feynkit>
71.22 s
gammaloop-nextest-feynkit> ========== nextest test summary ==========
71.22 s
gammaloop-nextest-feynkit> report: target/nextest/ci_gammaloop/junit.xml
71.22 s
gammaloop-nextest-feynkit> tests: 33, failures: 0, errors: 0
71.22 s
gammaloop-nextest-feynkit> No failing testcases found.
71.22 s
gammaloop-nextest-feynkit> =========================================
71.24 s
gammaloop-nextest-feynkit> Extracting 2 binaries and 2 linked paths to /build/source
71.45 s
gammaloop-nextest-feynkit> Extracted 16 files to /build/source in 0.21s
71.46 s
gammaloop-nextest-feynkit> ------------
71.46 s
gammaloop-nextest-feynkit> Nextest run ID 628f1e64-9d85-4835-af0a-1a4c90848eb4 with nextest profile: ci_gammaloop
71.46 s
gammaloop-nextest-feynkit> Starting 60 tests across 2 binaries
71.52 s
gammaloop-nextest-feynkit> ------------
71.52 s
gammaloop-nextest-feynkit> Summary [ 0.058s] 60 tests run: 60 passed , 0 skipped
71.57 s
gammaloop-nextest-feynkit>
71.58 s
gammaloop-nextest-feynkit> ========== nextest test summary ==========
71.58 s
gammaloop-nextest-feynkit> report: target/nextest/ci_gammaloop/junit.xml
71.58 s
gammaloop-nextest-feynkit> tests: 60, failures: 0, errors: 0
71.58 s
gammaloop-nextest-feynkit> No failing testcases found.
71.58 s
gammaloop-nextest-feynkit> =========================================
71.60 s
gammaloop-nextest-feynkit> Extracting 1 binary and 2 linked paths to /build/source
71.73 s
gammaloop-nextest-feynkit> Extracted 15 files to /build/source in 0.14s
71.75 s
gammaloop-nextest-feynkit> ------------
71.75 s
gammaloop-nextest-feynkit> Nextest run ID aa7d4a02-1017-4eda-b230-b794a47632ec with nextest profile: ci_gammaloop
71.75 s
gammaloop-nextest-feynkit> Starting 28 tests across 1 binary
71.78 s
gammaloop-nextest-feynkit> ------------
71.78 s
gammaloop-nextest-feynkit> Summary [ 0.030s] 28 tests run: 28 passed , 0 skipped
71.83 s
gammaloop-nextest-feynkit>
71.83 s
gammaloop-nextest-feynkit> ========== nextest test summary ==========
71.83 s
gammaloop-nextest-feynkit> report: target/nextest/ci_gammaloop/junit.xml
71.83 s
gammaloop-nextest-feynkit> tests: 28, failures: 0, errors: 0
71.83 s
gammaloop-nextest-feynkit> No failing testcases found.
71.83 s
gammaloop-nextest-feynkit> =========================================
71.85 s
gammaloop-nextest-feynkit> Extracting 1 binary and 1 linked path to /build/source
71.95 s
gammaloop-nextest-feynkit> Extracted 7 files to /build/source in 0.11s
71.97 s
gammaloop-nextest-feynkit> ------------
71.97 s
gammaloop-nextest-feynkit> Nextest run ID 4c9286c6-f286-4af4-974b-89778c1d6615 with nextest profile: ci_gammaloop
71.97 s
gammaloop-nextest-feynkit> Starting 21 tests across 1 binary
71.98 s
gammaloop-nextest-feynkit> ------------
71.98 s
gammaloop-nextest-feynkit> Summary [ 0.015s] 21 tests run: 21 passed , 0 skipped
72.03 s
gammaloop-nextest-feynkit>
72.03 s
gammaloop-nextest-feynkit> ========== nextest test summary ==========
72.03 s
gammaloop-nextest-feynkit> report: target/nextest/ci_gammaloop/junit.xml
72.03 s
gammaloop-nextest-feynkit> tests: 21, failures: 0, errors: 0
72.03 s
gammaloop-nextest-feynkit> No failing testcases found.
72.03 s
gammaloop-nextest-feynkit> =========================================
72.06 s
gammaloop-nextest-feynkit> Extracting 2 binaries and 2 linked paths to /build/source
72.25 s
gammaloop-nextest-feynkit> Extracted 16 files to /build/source in 0.20s
72.27 s
gammaloop-nextest-feynkit> ------------
72.27 s
gammaloop-nextest-feynkit> Nextest run ID df53fee9-9658-4c89-917b-d3b5fd1f1cd7 with nextest profile: ci_gammaloop
72.27 s
gammaloop-nextest-feynkit> Starting 14 tests across 2 binaries
72.28 s
gammaloop-nextest-feynkit> ------------
72.28 s
gammaloop-nextest-feynkit> Summary [ 0.015s] 14 tests run: 14 passed , 0 skipped
72.34 s
gammaloop-nextest-feynkit>
72.34 s
gammaloop-nextest-feynkit> ========== nextest test summary ==========
72.34 s
gammaloop-nextest-feynkit> report: target/nextest/ci_gammaloop/junit.xml
72.34 s
gammaloop-nextest-feynkit> tests: 14, failures: 0, errors: 0
72.34 s
gammaloop-nextest-feynkit> No failing testcases found.
72.34 s
gammaloop-nextest-feynkit> =========================================
72.36 s
gammaloop-nextest-feynkit> Extracting 5 binaries (including 3 non-test binaries) and 2 linked paths to /build/source
73.32 s
gammaloop-nextest-feynkit> Extracted 22 files to /build/source in 0.97s
73.34 s
gammaloop-nextest-feynkit> ------------
73.34 s
gammaloop-nextest-feynkit> Nextest run ID 85083179-f7bc-41e8-b1ab-1dce20aa000d with nextest profile: ci_gammaloop
73.34 s
gammaloop-nextest-feynkit> Starting 15 tests across 2 binaries
73.42 s
gammaloop-nextest-feynkit> FAIL [ 0.084s] (10/15) feynkit-py tests :: standalone_python_pipeline_covers_generation_graphs_cff_and_kinematics
73.42 s
gammaloop-nextest-feynkit> stdout ---
73.42 s
gammaloop-nextest-feynkit>
73.42 s
gammaloop-nextest-feynkit> running 1 test
73.42 s
gammaloop-nextest-feynkit> test tests::standalone_python_pipeline_covers_generation_graphs_cff_and_kinematics ... FAILED
73.42 s
gammaloop-nextest-feynkit>
73.42 s
gammaloop-nextest-feynkit> failures:
73.42 s
gammaloop-nextest-feynkit>
73.42 s
gammaloop-nextest-feynkit> failures:
73.42 s
gammaloop-nextest-feynkit> tests::standalone_python_pipeline_covers_generation_graphs_cff_and_kinematics
73.42 s
gammaloop-nextest-feynkit>
73.42 s
gammaloop-nextest-feynkit> test result: FAILED. 0 passed; 1 failed; 0 ignored; 0 measured; 13 filtered out; finished in 0.07s
73.42 s
gammaloop-nextest-feynkit>
73.42 s
gammaloop-nextest-feynkit> stderr ---
73.42 s
gammaloop-nextest-feynkit>
73.42 s
gammaloop-nextest-feynkit> thread 'tests::standalone_python_pipeline_covers_generation_graphs_cff_and_kinematics' (907) panicked at crates/feynkit-py/src/lib.rs:453:57:
73.42 s
gammaloop-nextest-feynkit> called `Result::unwrap()` on an `Err` value: PyErr { type: <class 'AssertionError'>, value: AssertionError(), traceback: Some("Traceback (most recent call last):\n File \"<string>\", line 39, in <module>\n") }
73.42 s
gammaloop-nextest-feynkit> stack backtrace:
73.42 s
gammaloop-nextest-feynkit> 0: __rustc::rust_begin_unwind
73.42 s
gammaloop-nextest-feynkit> 1: core::panicking::panic_fmt
73.42 s
gammaloop-nextest-feynkit> 2: core::result::unwrap_failed
73.42 s
gammaloop-nextest-feynkit> 3: feynkit_py::tests::standalone_python_pipeline_covers_generation_graphs_cff_and_kinematics
73.43 s
gammaloop-nextest-feynkit> 4: <feynkit_py::tests::standalone_python_pipeline_covers_generation_graphs_cff_and_kinematics::{closure#0} as core::ops::function::FnOnce<()>>::call_once
73.43 s
gammaloop-nextest-feynkit> note: Some details are omitted, run with `RUST_BACKTRACE=full` for a verbose backtrace.
73.43 s
gammaloop-nextest-feynkit>
74.02 s
gammaloop-nextest-feynkit> ------------
74.02 s
gammaloop-nextest-feynkit> Summary [ 0.680s] 15 tests run: 14 passed , 1 failed , 0 skipped
74.02 s
gammaloop-nextest-feynkit> FAIL [ 0.084s] (10/15) feynkit-py tests :: standalone_python_pipeline_covers_generation_graphs_cff_and_kinematics
74.02 s
gammaloop-nextest-feynkit> stdout ---
74.02 s
gammaloop-nextest-feynkit>
74.02 s
gammaloop-nextest-feynkit> running 1 test
74.02 s
gammaloop-nextest-feynkit> test tests::standalone_python_pipeline_covers_generation_graphs_cff_and_kinematics ... FAILED
74.02 s
gammaloop-nextest-feynkit>
74.02 s
gammaloop-nextest-feynkit> failures:
74.02 s
gammaloop-nextest-feynkit>
74.02 s
gammaloop-nextest-feynkit> failures:
74.02 s
gammaloop-nextest-feynkit> tests::standalone_python_pipeline_covers_generation_graphs_cff_and_kinematics
74.02 s
gammaloop-nextest-feynkit>
74.02 s
gammaloop-nextest-feynkit> test result: FAILED. 0 passed; 1 failed; 0 ignored; 0 measured; 13 filtered out; finished in 0.07s
74.02 s
gammaloop-nextest-feynkit>
74.02 s
gammaloop-nextest-feynkit> stderr ---
74.02 s
gammaloop-nextest-feynkit>
74.02 s
gammaloop-nextest-feynkit> thread 'tests::standalone_python_pipeline_covers_generation_graphs_cff_and_kinematics' (907) panicked at crates/feynkit-py/src/lib.rs:453:57:
74.02 s
gammaloop-nextest-feynkit> called `Result::unwrap()` on an `Err` value: PyErr { type: <class 'AssertionError'>, value: AssertionError(), traceback: Some("Traceback (most recent call last):\n File \"<string>\", line 39, in <module>\n") }
74.02 s
gammaloop-nextest-feynkit> stack backtrace:
74.02 s
gammaloop-nextest-feynkit> 0: __rustc::rust_begin_unwind
74.02 s
gammaloop-nextest-feynkit> 1: core::panicking::panic_fmt
74.02 s
gammaloop-nextest-feynkit> 2: core::result::unwrap_failed
74.02 s
gammaloop-nextest-feynkit> 3: feynkit_py::tests::standalone_python_pipeline_covers_generation_graphs_cff_and_kinematics
74.02 s
gammaloop-nextest-feynkit> 4: <feynkit_py::tests::standalone_python_pipeline_covers_generation_graphs_cff_and_kinematics::{closure#0} as core::ops::function::FnOnce<()>>::call_once
74.02 s
gammaloop-nextest-feynkit> note: Some details are omitted, run with `RUST_BACKTRACE=full` for a verbose backtrace.
74.02 s
gammaloop-nextest-feynkit>
74.03 s
gammaloop-nextest-feynkit> error : test run failed
74.07 s
gammaloop-nextest-feynkit>
74.07 s
gammaloop-nextest-feynkit> ========== nextest test summary ==========
74.07 s
gammaloop-nextest-feynkit> report: target/nextest/ci_gammaloop/junit.xml
74.07 s
gammaloop-nextest-feynkit> tests: 15, failures: 1, errors: 0
74.07 s
gammaloop-nextest-feynkit>
74.07 s
gammaloop-nextest-feynkit> 1. feynkit-py::tests::standalone_python_pipeline_covers_generation_graphs_cff_and_kinematics
74.07 s
gammaloop-nextest-feynkit> failure: test failure with exit code 101
74.07 s
gammaloop-nextest-feynkit> thread 'tests::standalone_python_pipeline_covers_generation_graphs_cff_and_kinematics' (907) panicked at crates/feynkit-py/src/lib.rs:453:57:
74.07 s
gammaloop-nextest-feynkit> called `Result::unwrap()` on an `Err` value: PyErr { type: <class 'AssertionError'>, value: AssertionError(), traceback: Some("Traceback (most recent call last):\n File \"<string>\", line 39, in <module>\n") }
74.07 s
gammaloop-nextest-feynkit> stack backtrace:
74.07 s
gammaloop-nextest-feynkit> 0: __rustc::rust_begin_unwind
74.07 s
gammaloop-nextest-feynkit> 1: core::panicking::panic_fmt
74.07 s
gammaloop-nextest-feynkit> 2: core::result::unwrap_failed
74.07 s
gammaloop-nextest-feynkit> 3: feynkit_py::tests::standalone_python_pipeline_covers_generation_graphs_cff_and_kinematics
74.07 s
gammaloop-nextest-feynkit> 4: <feynkit_py::tests::standalone_python_pipeline_covers_generation_graphs_cff_and_kinematics::{closure#0} as core::ops::function::FnOnce<()>>::call_once
74.07 s
gammaloop-nextest-feynkit> note: Some details are omitted, run with `RUST_BACKTRACE=full` for a verbose backtrace.
74.07 s
gammaloop-nextest-feynkit> system-out
74.07 s
gammaloop-nextest-feynkit> running 1 test
74.07 s
gammaloop-nextest-feynkit> test tests::standalone_python_pipeline_covers_generation_graphs_cff_and_kinematics ... FAILED
74.07 s
gammaloop-nextest-feynkit>
74.07 s
gammaloop-nextest-feynkit> failures:
74.07 s
gammaloop-nextest-feynkit>
74.07 s
gammaloop-nextest-feynkit> failures:
74.07 s
gammaloop-nextest-feynkit> tests::standalone_python_pipeline_covers_generation_graphs_cff_and_kinematics
74.07 s
gammaloop-nextest-feynkit>
74.07 s
gammaloop-nextest-feynkit> test result: FAILED. 0 passed; 1 failed; 0 ignored; 0 measured; 13 filtered out; finished in 0.07s
74.07 s
gammaloop-nextest-feynkit> system-err
74.07 s
gammaloop-nextest-feynkit> thread 'tests::standalone_python_pipeline_covers_generation_graphs_cff_and_kinematics' (907) panicked at crates/feynkit-py/src/lib.rs:453:57:
74.07 s
gammaloop-nextest-feynkit> called `Result::unwrap()` on an `Err` value: PyErr { type: <class 'AssertionError'>, value: AssertionError(), traceback: Some("Traceback (most recent call last):\n File \"<string>\", line 39, in <module>\n") }
74.07 s
gammaloop-nextest-feynkit> stack backtrace:
74.07 s
gammaloop-nextest-feynkit> 0: __rustc::rust_begin_unwind
74.07 s
gammaloop-nextest-feynkit> 1: core::panicking::panic_fmt
74.07 s
gammaloop-nextest-feynkit> 2: core::result::unwrap_failed
74.07 s
gammaloop-nextest-feynkit> 3: feynkit_py::tests::standalone_python_pipeline_covers_generation_graphs_cff_and_kinematics
74.07 s
gammaloop-nextest-feynkit> 4: <feynkit_py::tests::standalone_python_pipeline_covers_generation_graphs_cff_and_kinematics::{closure#0} as core::ops::function::FnOnce<()>>::call_once
74.07 s
gammaloop-nextest-feynkit> note: Some details are omitted, run with `RUST_BACKTRACE=full` for a verbose backtrace.
74.07 s
gammaloop-nextest-feynkit> =========================================
74.09 s
gammaloop-nextest-feynkit> Extracting 1 binary and 2 linked paths to /build/source
74.23 s
gammaloop-nextest-feynkit> Extracted 15 files to /build/source in 0.15s
74.24 s
gammaloop-nextest-feynkit> ------------
74.24 s
gammaloop-nextest-feynkit> Nextest run ID f735f7db-ef02-4c0e-b381-f6a09c06b7c8 with nextest profile: ci_gammaloop
74.24 s
gammaloop-nextest-feynkit> Starting 45 tests across 1 binary (1 test skipped )
74.41 s
gammaloop-nextest-feynkit> ------------
74.41 s
gammaloop-nextest-feynkit> Summary [ 0.162s] 45 tests run: 45 passed , 1 skipped
74.46 s
gammaloop-nextest-feynkit>
74.46 s
gammaloop-nextest-feynkit> ========== nextest test summary ==========
74.46 s
gammaloop-nextest-feynkit> report: target/nextest/ci_gammaloop/junit.xml
74.46 s
gammaloop-nextest-feynkit> tests: 45, failures: 0, errors: 0
74.46 s
gammaloop-nextest-feynkit> No failing testcases found.
74.46 s
gammaloop-nextest-feynkit> =========================================
74.48 s
gammaloop-nextest-feynkit> Extracting 1 binary and 2 linked paths to /build/source
74.61 s
gammaloop-nextest-feynkit> Extracted 15 files to /build/source in 0.13s
74.62 s
gammaloop-nextest-feynkit> ------------
74.62 s
gammaloop-nextest-feynkit> Nextest run ID 59f81ec5-bb97-45f8-b45b-ddefd2b88c88 with nextest profile: ci_gammaloop
74.62 s
gammaloop-nextest-feynkit> Starting 2 tests across 1 binary
74.65 s
gammaloop-nextest-feynkit> ------------
74.65 s
gammaloop-nextest-feynkit> Summary [ 0.026s] 2 tests run: 2 passed , 0 skipped
74.70 s
gammaloop-nextest-feynkit>
74.70 s
gammaloop-nextest-feynkit> ========== nextest test summary ==========
74.70 s
gammaloop-nextest-feynkit> report: target/nextest/ci_gammaloop/junit.xml
74.70 s
gammaloop-nextest-feynkit> tests: 2, failures: 0, errors: 0
74.70 s
gammaloop-nextest-feynkit> No failing testcases found.
74.70 s
gammaloop-nextest-feynkit> =========================================
74.93 s
error: Cannot build '/nix/store/acmsl3435cimydvkpsrj08bxpi3x96x8-gammaloop-nextest-feynkit.drv '.
74.93 s
Reason: builder failed with exit code 100 .
74.93 s
Output paths:
74.93 s
/nix/store/9asrzfa1rdhbcl808xwycrqj0kbiiqr1-gammaloop-nextest-feynkit
74.93 s
Last 199 log lines:
74.93 s
> Extracting 1 binary and 2 linked paths to /build/source
74.93 s
> Extracted 15 files to /build/source in 0.12s
74.93 s
> ------------
74.93 s
> Nextest run ID 8441c8c3-a6f3-4ff9-81e6-40fc3b9a7333 with nextest profile: ci_gammaloop
74.93 s
> Starting 1 test across 1 binary
74.93 s
> ------------
74.93 s
> Summary [ 0.008s] 1 test run: 1 passed , 0 skipped
74.93 s
>
74.93 s
> ========== nextest test summary ==========
74.93 s
> report: target/nextest/ci_gammaloop/junit.xml
74.93 s
> tests: 1, failures: 0, errors: 0
74.93 s
> No failing testcases found.
74.93 s
> =========================================
74.93 s
> Extracting 1 binary and 2 linked paths to /build/source
74.93 s
> Extracted 15 files to /build/source in 0.14s
74.93 s
> ------------
74.93 s
> Nextest run ID 6c579f66-d6bd-493f-845c-18e991544f13 with nextest profile: ci_gammaloop
74.93 s
> Starting 33 tests across 1 binary
74.93 s
> ------------
74.93 s
> Summary [ 0.030s] 33 tests run: 33 passed , 0 skipped
74.93 s
>
74.93 s
> ========== nextest test summary ==========
74.93 s
> report: target/nextest/ci_gammaloop/junit.xml
74.93 s
> tests: 33, failures: 0, errors: 0
74.93 s
> No failing testcases found.
74.93 s
> =========================================
74.93 s
> Extracting 2 binaries and 2 linked paths to /build/source
74.93 s
> Extracted 16 files to /build/source in 0.21s
74.93 s
> ------------
74.93 s
> Nextest run ID 628f1e64-9d85-4835-af0a-1a4c90848eb4 with nextest profile: ci_gammaloop
74.93 s
> Starting 60 tests across 2 binaries
74.93 s
> ------------
74.93 s
> Summary [ 0.058s] 60 tests run: 60 passed , 0 skipped
74.93 s
>
74.93 s
> ========== nextest test summary ==========
74.93 s
> report: target/nextest/ci_gammaloop/junit.xml
74.93 s
> tests: 60, failures: 0, errors: 0
74.93 s
> No failing testcases found.
74.93 s
> =========================================
74.93 s
> Extracting 1 binary and 2 linked paths to /build/source
74.93 s
> Extracted 15 files to /build/source in 0.14s
74.93 s
> ------------
74.93 s
> Nextest run ID aa7d4a02-1017-4eda-b230-b794a47632ec with nextest profile: ci_gammaloop
74.93 s
> Starting 28 tests across 1 binary
74.93 s
> ------------
74.93 s
> Summary [ 0.030s] 28 tests run: 28 passed , 0 skipped
74.93 s
>
74.93 s
> ========== nextest test summary ==========
74.93 s
> report: target/nextest/ci_gammaloop/junit.xml
74.93 s
> tests: 28, failures: 0, errors: 0
74.93 s
> No failing testcases found.
74.93 s
> =========================================
74.93 s
> Extracting 1 binary and 1 linked path to /build/source
74.93 s
> Extracted 7 files to /build/source in 0.11s
74.93 s
> ------------
74.93 s
> Nextest run ID 4c9286c6-f286-4af4-974b-89778c1d6615 with nextest profile: ci_gammaloop
74.93 s
> Starting 21 tests across 1 binary
74.93 s
> ------------
74.93 s
> Summary [ 0.015s] 21 tests run: 21 passed , 0 skipped
74.93 s
>
74.93 s
> ========== nextest test summary ==========
74.93 s
> report: target/nextest/ci_gammaloop/junit.xml
74.93 s
> tests: 21, failures: 0, errors: 0
74.93 s
> No failing testcases found.
74.93 s
> =========================================
74.93 s
> Extracting 2 binaries and 2 linked paths to /build/source
74.93 s
> Extracted 16 files to /build/source in 0.20s
74.93 s
> ------------
74.93 s
> Nextest run ID df53fee9-9658-4c89-917b-d3b5fd1f1cd7 with nextest profile: ci_gammaloop
74.93 s
> Starting 14 tests across 2 binaries
74.93 s
> ------------
74.93 s
> Summary [ 0.015s] 14 tests run: 14 passed , 0 skipped
74.93 s
>
74.93 s
> ========== nextest test summary ==========
74.93 s
> report: target/nextest/ci_gammaloop/junit.xml
74.93 s
> tests: 14, failures: 0, errors: 0
74.93 s
> No failing testcases found.
74.93 s
> =========================================
74.93 s
> Extracting 5 binaries (including 3 non-test binaries) and 2 linked paths to /build/source
74.93 s
> Extracted 22 files to /build/source in 0.97s
74.93 s
> ------------
74.93 s
> Nextest run ID 85083179-f7bc-41e8-b1ab-1dce20aa000d with nextest profile: ci_gammaloop
74.93 s
> Starting 15 tests across 2 binaries
74.93 s
> FAIL [ 0.084s] (10/15) feynkit-py tests :: standalone_python_pipeline_covers_generation_graphs_cff_and_kinematics
74.93 s
> stdout ---
74.93 s
>
74.93 s
> running 1 test
74.93 s
> test tests::standalone_python_pipeline_covers_generation_graphs_cff_and_kinematics ... FAILED
74.93 s
>
74.93 s
> failures:
74.93 s
>
74.93 s
> failures:
74.93 s
> tests::standalone_python_pipeline_covers_generation_graphs_cff_and_kinematics
74.93 s
>
74.93 s
> test result: FAILED. 0 passed; 1 failed; 0 ignored; 0 measured; 13 filtered out; finished in 0.07s
74.93 s
>
74.93 s
> stderr ---
74.93 s
>
74.93 s
> thread 'tests::standalone_python_pipeline_covers_generation_graphs_cff_and_kinematics' (907) panicked at crates/feynkit-py/src/lib.rs:453:57:
74.93 s
> called `Result::unwrap()` on an `Err` value: PyErr { type: <class 'AssertionError'>, value: AssertionError(), traceback: Some("Traceback (most recent call last):\n File \"<string>\", line 39, in <module>\n") }
74.93 s
> stack backtrace:
74.93 s
> 0: __rustc::rust_begin_unwind
74.93 s
> 1: core::panicking::panic_fmt
74.93 s
> 2: core::result::unwrap_failed
74.93 s
> 3: feynkit_py::tests::standalone_python_pipeline_covers_generation_graphs_cff_and_kinematics
74.93 s
> 4: <feynkit_py::tests::standalone_python_pipeline_covers_generation_graphs_cff_and_kinematics::{closure#0} as core::ops::function::FnOnce<()>>::call_once
74.93 s
> note: Some details are omitted, run with `RUST_BACKTRACE=full` for a verbose backtrace.
74.93 s
>
74.93 s
> ------------
74.93 s
> Summary [ 0.680s] 15 tests run: 14 passed , 1 failed , 0 skipped
74.93 s
> FAIL [ 0.084s] (10/15) feynkit-py tests :: standalone_python_pipeline_covers_generation_graphs_cff_and_kinematics
74.93 s
> stdout ---
74.93 s
>
74.93 s
> running 1 test
74.93 s
> test tests::standalone_python_pipeline_covers_generation_graphs_cff_and_kinematics ... FAILED
74.93 s
>
74.93 s
> failures:
74.93 s
>
74.93 s
> failures:
74.93 s
> tests::standalone_python_pipeline_covers_generation_graphs_cff_and_kinematics
74.93 s
>
74.93 s
> test result: FAILED. 0 passed; 1 failed; 0 ignored; 0 measured; 13 filtered out; finished in 0.07s
74.93 s
>
74.93 s
> stderr ---
74.93 s
>
74.93 s
> thread 'tests::standalone_python_pipeline_covers_generation_graphs_cff_and_kinematics' (907) panicked at crates/feynkit-py/src/lib.rs:453:57:
74.93 s
> called `Result::unwrap()` on an `Err` value: PyErr { type: <class 'AssertionError'>, value: AssertionError(), traceback: Some("Traceback (most recent call last):\n File \"<string>\", line 39, in <module>\n") }
74.93 s
> stack backtrace:
74.93 s
> 0: __rustc::rust_begin_unwind
74.93 s
> 1: core::panicking::panic_fmt
74.93 s
> 2: core::result::unwrap_failed
74.93 s
> 3: feynkit_py::tests::standalone_python_pipeline_covers_generation_graphs_cff_and_kinematics
74.93 s
> 4: <feynkit_py::tests::standalone_python_pipeline_covers_generation_graphs_cff_and_kinematics::{closure#0} as core::ops::function::FnOnce<()>>::call_once
74.93 s
> note: Some details are omitted, run with `RUST_BACKTRACE=full` for a verbose backtrace.
74.93 s
>
74.93 s
> error : test run failed
74.93 s
>
74.93 s
> ========== nextest test summary ==========
74.93 s
> report: target/nextest/ci_gammaloop/junit.xml
74.93 s
> tests: 15, failures: 1, errors: 0
74.93 s
>
74.93 s
> 1. feynkit-py::tests::standalone_python_pipeline_covers_generation_graphs_cff_and_kinematics
74.93 s
> failure: test failure with exit code 101
74.93 s
> thread 'tests::standalone_python_pipeline_covers_generation_graphs_cff_and_kinematics' (907) panicked at crates/feynkit-py/src/lib.rs:453:57:
74.93 s
> called `Result::unwrap()` on an `Err` value: PyErr { type: <class 'AssertionError'>, value: AssertionError(), traceback: Some("Traceback (most recent call last):\n File \"<string>\", line 39, in <module>\n") }
74.93 s
> stack backtrace:
74.93 s
> 0: __rustc::rust_begin_unwind
74.93 s
> 1: core::panicking::panic_fmt
74.93 s
> 2: core::result::unwrap_failed
74.93 s
> 3: feynkit_py::tests::standalone_python_pipeline_covers_generation_graphs_cff_and_kinematics
74.93 s
> 4: <feynkit_py::tests::standalone_python_pipeline_covers_generation_graphs_cff_and_kinematics::{closure#0} as core::ops::function::FnOnce<()>>::call_once
74.93 s
> note: Some details are omitted, run with `RUST_BACKTRACE=full` for a verbose backtrace.
74.93 s
> system-out
74.93 s
> running 1 test
74.93 s
> test tests::standalone_python_pipeline_covers_generation_graphs_cff_and_kinematics ... FAILED
74.93 s
>
74.93 s
> failures:
74.93 s
>
74.93 s
> failures:
74.93 s
> tests::standalone_python_pipeline_covers_generation_graphs_cff_and_kinematics
74.93 s
>
74.93 s
> test result: FAILED. 0 passed; 1 failed; 0 ignored; 0 measured; 13 filtered out; finished in 0.07s
74.93 s
> system-err
74.93 s
> thread 'tests::standalone_python_pipeline_covers_generation_graphs_cff_and_kinematics' (907) panicked at crates/feynkit-py/src/lib.rs:453:57:
74.93 s
> called `Result::unwrap()` on an `Err` value: PyErr { type: <class 'AssertionError'>, value: AssertionError(), traceback: Some("Traceback (most recent call last):\n File \"<string>\", line 39, in <module>\n") }
74.93 s
> stack backtrace:
74.93 s
> 0: __rustc::rust_begin_unwind
74.93 s
> 1: core::panicking::panic_fmt
74.93 s
> 2: core::result::unwrap_failed
74.93 s
> 3: feynkit_py::tests::standalone_python_pipeline_covers_generation_graphs_cff_and_kinematics
74.93 s
> 4: <feynkit_py::tests::standalone_python_pipeline_covers_generation_graphs_cff_and_kinematics::{closure#0} as core::ops::function::FnOnce<()>>::call_once
74.93 s
> note: Some details are omitted, run with `RUST_BACKTRACE=full` for a verbose backtrace.
74.93 s
> =========================================
74.93 s
> Extracting 1 binary and 2 linked paths to /build/source
74.93 s
> Extracted 15 files to /build/source in 0.15s
74.93 s
> ------------
74.93 s
> Nextest run ID f735f7db-ef02-4c0e-b381-f6a09c06b7c8 with nextest profile: ci_gammaloop
74.93 s
> Starting 45 tests across 1 binary (1 test skipped )
74.93 s
> ------------
74.93 s
> Summary [ 0.162s] 45 tests run: 45 passed , 1 skipped
74.93 s
>
74.93 s
> ========== nextest test summary ==========
74.93 s
> report: target/nextest/ci_gammaloop/junit.xml
74.93 s
> tests: 45, failures: 0, errors: 0
74.93 s
> No failing testcases found.
74.93 s
> =========================================
74.93 s
> Extracting 1 binary and 2 linked paths to /build/source
74.93 s
> Extracted 15 files to /build/source in 0.13s
74.93 s
> ------------
74.93 s
> Nextest run ID 59f81ec5-bb97-45f8-b45b-ddefd2b88c88 with nextest profile: ci_gammaloop
74.93 s
> Starting 2 tests across 1 binary
74.93 s
> ------------
74.93 s
> Summary [ 0.026s] 2 tests run: 2 passed , 0 skipped
74.93 s
>
74.93 s
> ========== nextest test summary ==========
74.93 s
> report: target/nextest/ci_gammaloop/junit.xml
74.93 s
> tests: 2, failures: 0, errors: 0
74.93 s
> No failing testcases found.
74.93 s
> =========================================
74.93 s
For full logs, run:
74.93 s
nix log /nix/store/acmsl3435cimydvkpsrj08bxpi3x96x8-gammaloop-nextest-feynkit.drv
75.18 s
[6 built (1 failed ), 73 Run failed.