test packages.x86_64-linux.nix-ci-check-gammaloop-nextest-core
0.01 s
$ /nix/store/61685rbaxmpigwi3z23i33sv3jyfl70q-coreutils-9.11/bin/timeout --kill-after=15s 7200s /nix/store/wknkybkzrc16r11vk5vrykh4wmw7a353-nix-2.34.8/bin/nix --extra-experimental-features nix-command --extra-experimental-features flakes flake clone git+https://github.com/alphal00p/gammaloop --dest /tmp/nix-ci-worker/stable-pwd/repo/
0.14 s
Cloning into '/tmp/nix-ci-worker/stable-pwd/repo'...
0.95 s
remote: Enumerating objects: 103784, done.
1.06 s
remote: Counting objects: 0% (1/9421)
remote: Counting objects: 1% (95/9421)
remote: Counting objects: 2% (189/9421)
remote: Counting objects: 3% (283/9421)
remote: Counting objects: 4% (377/9421)
remote: Counting objects: 5% (472/9421)
remote: Counting objects: 6% (566/9421)
remote: Counting objects: 7% (660/9421)
remote: Counting objects: 8% (754/9421)
remote: Counting objects: 9% (848/9421)
remote: Counting objects: 10% (943/9421)
remote: Counting objects: 11% (1037/9421)
remote: Counting objects: 12% (1131/9421)
remote: Counting objects: 13% (1225/9421)
remote: Counting objects: 14% (1319/9421)
remote: Counting objects: 15% (1414/9421)
remote: Counting objects: 16% (1508/9421)
remote: Counting objects: 17% (1602/9421)
remote: Counting objects: 18% (1696/9421)
remote: Counting objects: 19% (1790/9421)
remote: Counting objects: 20% (1885/9421)
remote: Counting objects: 21% (1979/9421)
remote: Counting objects: 22% (2073/9421)
remote: Counting objects: 23% (2167/9421)
remote: Counting objects: 24% (2262/9421)
remote: Counting objects: 25% (2356/9421)
remote: Counting objects: 26% (2450/9421)
remote: Counting objects: 27% (2544/9421)
remote: Counting objects: 28% (2638/9421)
remote: Counting objects: 29% (2733/9421)
remote: Counting objects: 30% (2827/9421)
remote: Counting objects: 31% (2921/9421)
remote: Counting objects: 32% (3015/9421)
remote: Counting objects: 33% (3109/9421)
remote: Counting objects: 34% (3204/9421)
remote: Counting objects: 35% (3298/9421)
remote: Counting objects: 36% (3392/9421)
remote: Counting objects: 37% (3486/9421)
remote: Counting objects: 38% (3580/9421)
remote: Counting objects: 39% (3675/9421)
remote: Counting objects: 40% (3769/9421)
remote: Counting objects: 41% (3863/9421)
remote: Counting objects: 42% (3957/9421)
remote: Counting objects: 43% (4052/9421)
remote: Counting objects: 44% (4146/9421)
remote: Counting objects: 45% (4240/9421)
remote: Counting objects: 46% (4334/9421)
remote: Counting objects: 47% (4428/9421)
remote: Counting objects: 48% (4523/9421)
remote: Counting objects: 49% (4617/9421)
remote: Counting objects: 50% (4711/9421)
remote: Counting objects: 51% (4805/9421)
remote: Counting objects: 52% (4899/9421)
remote: Counting objects: 53% (4994/9421)
remote: Counting objects: 54% (5088/9421)
remote: Counting objects: 55% (5182/9421)
remote: Counting objects: 56% (5276/9421)
remote: Counting objects: 57% (5370/9421)
remote: Counting objects: 58% (5465/9421)
remote: Counting objects: 59% (5559/9421)
remote: Counting objects: 60% (5653/9421)
remote: Counting objects: 61% (5747/9421)
remote: Counting objects: 62% (5842/9421)
remote: Counting objects: 63% (5936/9421)
remote: Counting objects: 64% (6030/9421)
remote: Counting objects: 65% (6124/9421)
remote: Counting objects: 66% (6218/9421)
remote: Counting objects: 67% (6313/9421)
remote: Counting objects: 68% (6407/9421)
remote: Counting objects: 69% (6501/9421)
remote: Counting objects: 70% (6595/9421)
remote: Counting objects: 71% (6689/9421)
remote: Counting objects: 72% (6784/9421)
remote: Counting objects: 73% (6878/9421)
remote: Counting objects: 74% (6972/9421)
remote: Counting objects: 75% (7066/9421)
remote: Counting objects: 76% (7160/9421)
remote: Counting objects: 77% (7255/9421)
remote: Counting objects: 78% (7349/9421)
remote: Counting objects: 79% (7443/9421)
remote: Counting objects: 80% (7537/9421)
remote: Counting objects: 81% (7632/9421)
remote: Counting objects: 82% (7726/9421)
remote: Counting objects: 83% (7820/9421)
remote: Counting objects: 84% (7914/9421)
remote: Counting objects: 85% (8008/9421)
remote: Counting objects: 86% (8103/9421)
remote: Counting objects: 87% (8197/9421)
remote: Counting objects: 88% (8291/9421)
remote: Counting objects: 89% (8385/9421)
remote: Counting objects: 90% (8479/9421)
remote: Counting objects: 91% (8574/9421)
remote: Counting objects: 92% (8668/9421)
remote: Counting objects: 93% (8762/9421)
remote: Counting objects: 94% (8856/9421)
remote: Counting objects: 95% (8950/9421)
remote: Counting objects: 96% (9045/9421)
remote: Counting objects: 97% (9139/9421)
remote: Counting objects: 98% (9233/9421)
remote: Counting objects: 99% (9327/9421)
remote: Counting objects: 100% (9421/9421)
remote: Counting objects: 100% (9421/9421), done.
3.07 s
remote: Compressing objects: 0% (1/2027)
remote: Compressing objects: 1% (21/2027)
remote: Compressing objects: 2% (41/2027)
remote: Compressing objects: 3% (61/2027)
remote: Compressing objects: 4% (82/2027)
remote: Compressing objects: 5% (102/2027)
remote: Compressing objects: 6% (122/2027)
remote: Compressing objects: 7% (142/2027)
remote: Compressing objects: 8% (163/2027)
remote: Compressing objects: 9% (183/2027)
remote: Compressing objects: 10% (203/2027)
remote: Compressing objects: 10% (213/2027)
remote: Compressing objects: 11% (223/2027)
remote: Compressing objects: 12% (244/2027)
remote: Compressing objects: 13% (264/2027)
remote: Compressing objects: 14% (284/2027)
remote: Compressing objects: 15% (305/2027)
remote: Compressing objects: 16% (325/2027)
remote: Compressing objects: 17% (345/2027)
remote: Compressing objects: 18% (365/2027)
remote: Compressing objects: 19% (386/2027)
remote: Compressing objects: 20% (406/2027)
remote: Compressing objects: 21% (426/2027)
remote: Compressing objects: 22% (446/2027)
remote: Compressing objects: 23% (467/2027)
remote: Compressing objects: 24% (487/2027)
remote: Compressing objects: 25% (507/2027)
remote: Compressing objects: 26% (528/2027)
remote: Compressing objects: 27% (548/2027)
remote: Compressing objects: 28% (568/2027)
remote: Compressing objects: 29% (588/2027)
remote: Compressing objects: 30% (609/2027)
remote: Compressing objects: 30% (625/2027)
remote: Compressing objects: 31% (629/2027)
remote: Compressing objects: 32% (649/2027)
remote: Compressing objects: 33% (669/2027)
remote: Compressing objects: 34% (690/2027)
remote: Compressing objects: 35% (710/2027)
remote: Compressing objects: 36% (730/2027)
remote: Compressing objects: 37% (750/2027)
remote: Compressing objects: 38% (771/2027)
remote: Compressing objects: 39% (791/2027)
remote: Compressing objects: 40% (811/2027)
remote: Compressing objects: 41% (832/2027)
remote: Compressing objects: 42% (852/2027)
remote: Compressing objects: 43% (872/2027)
remote: Compressing objects: 44% (892/2027)
remote: Compressing objects: 45% (913/2027)
remote: Compressing objects: 46% (933/2027)
remote: Compressing objects: 47% (953/2027)
remote: Compressing objects: 48% (973/2027)
remote: Compressing objects: 49% (994/2027)
remote: Compressing objects: 50% (1014/2027)
remote: Compressing objects: 51% (1034/2027)
remote: Compressing objects: 52% (1055/2027)
remote: Compressing objects: 53% (1075/2027)
remote: Compressing objects: 54% (1095/2027)
remote: Compressing objects: 55% (1115/2027)
remote: Compressing objects: 56% (1136/2027)
remote: Compressing objects: 57% (1156/2027)
remote: Compressing objects: 58% (1176/2027)
remote: Compressing objects: 59% (1196/2027)
remote: Compressing objects: 60% (1217/2027)
remote: Compressing objects: 61% (1237/2027)
remote: Compressing objects: 62% (1257/2027)
remote: Compressing objects: 63% (1278/2027)
remote: Compressing objects: 64% (1298/2027)
remote: Compressing objects: 65% (1318/2027)
remote: Compressing objects: 66% (1338/2027)
remote: Compressing objects: 67% (1359/2027)
remote: Compressing objects: 68% (1379/2027)
remote: Compressing objects: 69% (1399/2027)
remote: Compressing objects: 70% (1419/2027)
remote: Compressing objects: 71% (1440/2027)
remote: Compressing objects: 72% (1460/2027)
remote: Compressing objects: 73% (1480/2027)
remote: Compressing objects: 74% (1500/2027)
remote: Compressing objects: 75% (1521/2027)
remote: Compressing objects: 76% (1541/2027)
remote: Compressing objects: 77% (1561/2027)
remote: Compressing objects: 78% (1582/2027)
remote: Compressing objects: 79% (1602/2027)
remote: Compressing objects: 80% (1622/2027)
remote: Compressing objects: 81% (1642/2027)
remote: Compressing objects: 82% (1663/2027)
remote: Compressing objects: 83% (1683/2027)
remote: Compressing objects: 84% (1703/2027)
remote: Compressing objects: 85% (1723/2027)
remote: Compressing objects: 86% (1744/2027)
remote: Compressing objects: 87% (1764/2027)
remote: Compressing objects: 88% (1784/2027)
remote: Compressing objects: 89% (1805/2027)
remote: Compressing objects: 90% (1825/2027)
remote: Compressing objects: 91% (1845/2027)
remote: Compressing objects: 92% (1865/2027)
remote: Compressing objects: 93% (1886/2027)
remote: Compressing objects: 94% (1906/2027)
remote: Compressing objects: 95% (1926/2027)
remote: Compressing objects: 96% (1946/2027)
remote: Compressing objects: 97% (1967/2027)
remote: Compressing objects: 98% (1987/2027)
remote: Compressing objects: 99% (2007/2027)
remote: Compressing objects: 100% (2027/2027)
remote: Compressing objects: 100% (2027/2027), done.
15.61 s
Receiving objects: 0% (1/103784)
Receiving objects: 1% (1038/103784)
Receiving objects: 2% (2076/103784)
Receiving objects: 3% (3114/103784)
Receiving objects: 4% (4152/103784)
Receiving objects: 5% (5190/103784)
Receiving objects: 6% (6228/103784)
Receiving objects: 7% (7265/103784), 12.90 MiB | 25.79 MiB/s
Receiving objects: 8% (8303/103784), 12.90 MiB | 25.79 MiB/s
Receiving objects: 9% (9341/103784), 12.90 MiB | 25.79 MiB/s
Receiving objects: 10% (10379/103784), 12.90 MiB | 25.79 MiB/s
Receiving objects: 11% (11417/103784), 12.90 MiB | 25.79 MiB/s
Receiving objects: 12% (12455/103784), 12.90 MiB | 25.79 MiB/s
Receiving objects: 13% (13492/103784), 12.90 MiB | 25.79 MiB/s
Receiving objects: 14% (14530/103784), 12.90 MiB | 25.79 MiB/s
Receiving objects: 15% (15568/103784), 12.90 MiB | 25.79 MiB/s
Receiving objects: 16% (16606/103784), 12.90 MiB | 25.79 MiB/s
Receiving objects: 17% (17644/103784), 12.90 MiB | 25.79 MiB/s
Receiving objects: 18% (18682/103784), 12.90 MiB | 25.79 MiB/s
Receiving objects: 19% (19719/103784), 12.90 MiB | 25.79 MiB/s
Receiving objects: 20% (20757/103784), 12.90 MiB | 25.79 MiB/s
Receiving objects: 21% (21795/103784), 12.90 MiB | 25.79 MiB/s
Receiving objects: 22% (22833/103784), 12.90 MiB | 25.79 MiB/s
Receiving objects: 23% (23871/103784), 12.90 MiB | 25.79 MiB/s
Receiving objects: 24% (24909/103784), 12.90 MiB | 25.79 MiB/s
Receiving objects: 25% (25946/103784), 12.90 MiB | 25.79 MiB/s
Receiving objects: 26% (26984/103784), 12.90 MiB | 25.79 MiB/s
Receiving objects: 27% (28022/103784), 12.90 MiB | 25.79 MiB/s
Receiving objects: 28% (29060/103784), 12.90 MiB | 25.79 MiB/s
Receiving objects: 29% (30098/103784), 12.90 MiB | 25.79 MiB/s
Receiving objects: 30% (31136/103784), 12.90 MiB | 25.79 MiB/s
Receiving objects: 31% (32174/103784), 12.90 MiB | 25.79 MiB/s
Receiving objects: 32% (33211/103784), 12.90 MiB | 25.79 MiB/s
Receiving objects: 32% (33471/103784), 12.90 MiB | 25.79 MiB/s
Receiving objects: 33% (34249/103784), 31.36 MiB | 31.36 MiB/s
Receiving objects: 34% (35287/103784), 31.36 MiB | 31.36 MiB/s
Receiving objects: 35% (36325/103784), 31.36 MiB | 31.36 MiB/s
Receiving objects: 36% (37363/103784), 31.36 MiB | 31.36 MiB/s
Receiving objects: 37% (38401/103784), 31.36 MiB | 31.36 MiB/s
Receiving objects: 38% (39438/103784), 31.36 MiB | 31.36 MiB/s
Receiving objects: 39% (40476/103784), 31.36 MiB | 31.36 MiB/s
Receiving objects: 40% (41514/103784), 49.19 MiB | 32.64 MiB/s
Receiving objects: 41% (42552/103784), 49.19 MiB | 32.64 MiB/s
Receiving objects: 42% (43590/103784), 49.19 MiB | 32.64 MiB/s
Receiving objects: 43% (44628/103784), 49.19 MiB | 32.64 MiB/s
Receiving objects: 44% (45665/103784), 49.19 MiB | 32.64 MiB/s
Receiving objects: 45% (46703/103784), 49.19 MiB | 32.64 MiB/s
Receiving objects: 46% (47741/103784), 49.19 MiB | 32.64 MiB/s
Receiving objects: 46% (48737/103784), 49.19 MiB | 32.64 MiB/s
Receiving objects: 47% (48779/103784), 66.36 MiB | 33.00 MiB/s
Receiving objects: 48% (49817/103784), 66.36 MiB | 33.00 MiB/s
Receiving objects: 49% (50855/103784), 66.36 MiB | 33.00 MiB/s
Receiving objects: 50% (51892/103784), 66.36 MiB | 33.00 MiB/s
Receiving objects: 51% (52930/103784), 66.36 MiB | 33.00 MiB/s
Receiving objects: 52% (53968/103784), 66.36 MiB | 33.00 MiB/s
Receiving objects: 53% (55006/103784), 66.36 MiB | 33.00 MiB/s
Receiving objects: 54% (56044/103784), 66.36 MiB | 33.00 MiB/s
Receiving objects: 54% (57017/103784), 100.58 MiB | 33.38 MiB/s
Receiving objects: 55% (57082/103784), 118.62 MiB | 33.72 MiB/s
Receiving objects: 55% (58045/103784), 118.62 MiB | 33.72 MiB/s
Receiving objects: 56% (58120/103784), 153.55 MiB | 33.97 MiB/s
Receiving objects: 56% (58120/103784), 171.96 MiB | 35.15 MiB/s
Receiving objects: 56% (58214/103784), 207.18 MiB | 34.95 MiB/s
Receiving objects: 57% (59157/103784), 224.59 MiB | 34.99 MiB/s
Receiving objects: 58% (60195/103784), 224.59 MiB | 34.99 MiB/s
Receiving objects: 59% (61233/103784), 224.59 MiB | 34.99 MiB/s
Receiving objects: 60% (62271/103784), 224.59 MiB | 34.99 MiB/s
Receiving objects: 61% (63309/103784), 224.59 MiB | 34.99 MiB/s
Receiving objects: 61% (64128/103784), 224.59 MiB | 34.99 MiB/s
Receiving objects: 62% (64347/103784), 224.59 MiB | 34.99 MiB/s
Receiving objects: 63% (65384/103784), 243.46 MiB | 35.18 MiB/s
Receiving objects: 64% (66422/103784), 243.46 MiB | 35.18 MiB/s
Receiving objects: 65% (67460/103784), 243.46 MiB | 35.18 MiB/s
Receiving objects: 66% (68498/103784), 243.46 MiB | 35.18 MiB/s
Receiving objects: 67% (69536/103784), 243.46 MiB | 35.18 MiB/s
Receiving objects: 68% (70574/103784), 260.27 MiB | 35.32 MiB/s
Receiving objects: 69% (71611/103784), 260.27 MiB | 35.32 MiB/s
Receiving objects: 70% (72649/103784), 260.27 MiB | 35.32 MiB/s
Receiving objects: 71% (73687/103784), 260.27 MiB | 35.32 MiB/s
Receiving objects: 72% (74725/103784), 260.27 MiB | 35.32 MiB/s
Receiving objects: 73% (75763/103784), 260.27 MiB | 35.32 MiB/s
Receiving objects: 73% (76760/103784), 260.27 MiB | 35.32 MiB/s
Receiving objects: 74% (76801/103784), 260.27 MiB | 35.32 MiB/s
Receiving objects: 75% (77838/103784), 278.75 MiB | 35.42 MiB/s
Receiving objects: 76% (78876/103784), 296.51 MiB | 35.26 MiB/s
Receiving objects: 77% (79914/103784), 296.51 MiB | 35.26 MiB/s
Receiving objects: 78% (80952/103784), 296.51 MiB | 35.26 MiB/s
Receiving objects: 79% (81990/103784), 296.51 MiB | 35.26 MiB/s
Receiving objects: 80% (83028/103784), 296.51 MiB | 35.26 MiB/s
Receiving objects: 80% (83610/103784), 296.51 MiB | 35.26 MiB/s
Receiving objects: 81% (84066/103784), 296.51 MiB | 35.26 MiB/s
Receiving objects: 82% (85103/103784), 313.75 MiB | 35.43 MiB/s
Receiving objects: 82% (85496/103784), 332.14 MiB | 35.43 MiB/s
Receiving objects: 83% (86141/103784), 350.90 MiB | 35.55 MiB/s
Receiving objects: 84% (87179/103784), 367.83 MiB | 35.50 MiB/s
Receiving objects: 85% (88217/103784), 367.83 MiB | 35.50 MiB/s
Receiving objects: 85% (88984/103784), 367.83 MiB | 35.50 MiB/s
Receiving objects: 86% (89255/103784), 367.83 MiB | 35.50 MiB/s
Receiving objects: 87% (90293/103784), 367.83 MiB | 35.50 MiB/s
Receiving objects: 88% (91330/103784), 386.59 MiB | 35.82 MiB/s
Receiving objects: 89% (92368/103784), 386.59 MiB | 35.82 MiB/s
Receiving objects: 89% (92590/103784), 404.61 MiB | 35.63 MiB/s
Receiving objects: 90% (93406/103784), 422.29 MiB | 35.82 MiB/s
Receiving objects: 91% (94444/103784), 422.29 MiB | 35.82 MiB/s
Receiving objects: 92% (95482/103784), 422.29 MiB | 35.82 MiB/s
Receiving objects: 93% (96520/103784), 422.29 MiB | 35.82 MiB/s
Receiving objects: 94% (97557/103784), 422.29 MiB | 35.82 MiB/s
Receiving objects: 95% (98595/103784), 422.29 MiB | 35.82 MiB/s
Receiving objects: 96% (99633/103784), 422.29 MiB | 35.82 MiB/s
Receiving objects: 97% (100671/103784), 422.29 MiB | 35.82 MiB/s
Receiving objects: 98% (101709/103784), 422.29 MiB | 35.82 MiB/s
Receiving objects: 99% (102747/103784), 422.29 MiB | 35.82 MiB/s
remote: Total 103784 (delta 8150), reused 7457 (delta 7388), pack-reused 94363 (from 4)
15.61 s
Receiving objects: 100% (103784/103784), 422.29 MiB | 35.82 MiB/s
Receiving objects: 100% (103784/103784), 439.18 MiB | 35.02 MiB/s, done.
17.50 s
Resolving deltas: 0% (0/67929)
Resolving deltas: 1% (680/67929)
Resolving deltas: 2% (1360/67929)
Resolving deltas: 3% (2038/67929)
Resolving deltas: 4% (2718/67929)
Resolving deltas: 5% (3397/67929)
Resolving deltas: 6% (4076/67929)
Resolving deltas: 7% (4756/67929)
Resolving deltas: 8% (5435/67929)
Resolving deltas: 9% (6114/67929)
Resolving deltas: 10% (6793/67929)
Resolving deltas: 11% (7474/67929)
Resolving deltas: 12% (8152/67929)
Resolving deltas: 13% (8831/67929)
Resolving deltas: 14% (9511/67929)
Resolving deltas: 15% (10190/67929)
Resolving deltas: 16% (10869/67929)
Resolving deltas: 17% (11548/67929)
Resolving deltas: 18% (12228/67929)
Resolving deltas: 19% (12907/67929)
Resolving deltas: 20% (13586/67929)
Resolving deltas: 21% (14266/67929)
Resolving deltas: 22% (14945/67929)
Resolving deltas: 23% (15624/67929)
Resolving deltas: 24% (16303/67929)
Resolving deltas: 25% (16983/67929)
Resolving deltas: 26% (17662/67929)
Resolving deltas: 27% (18341/67929)
Resolving deltas: 28% (19021/67929)
Resolving deltas: 29% (19700/67929)
Resolving deltas: 30% (20379/67929)
Resolving deltas: 31% (21058/67929)
Resolving deltas: 32% (21738/67929)
Resolving deltas: 33% (22418/67929)
Resolving deltas: 34% (23096/67929)
Resolving deltas: 35% (23776/67929)
Resolving deltas: 36% (24455/67929)
Resolving deltas: 37% (25135/67929)
Resolving deltas: 38% (25814/67929)
Resolving deltas: 39% (26493/67929)
Resolving deltas: 40% (27172/67929)
Resolving deltas: 41% (27852/67929)
Resolving deltas: 42% (28531/67929)
Resolving deltas: 43% (29210/67929)
Resolving deltas: 44% (29889/67929)
Resolving deltas: 45% (30569/67929)
Resolving deltas: 46% (31248/67929)
Resolving deltas: 47% (31927/67929)
Resolving deltas: 48% (32606/67929)
Resolving deltas: 49% (33286/67929)
Resolving deltas: 50% (33966/67929)
Resolving deltas: 51% (34644/67929)
Resolving deltas: 52% (35324/67929)
Resolving deltas: 53% (36003/67929)
Resolving deltas: 54% (36682/67929)
Resolving deltas: 55% (37361/67929)
Resolving deltas: 56% (38041/67929)
Resolving deltas: 57% (38720/67929)
Resolving deltas: 58% (39399/67929)
Resolving deltas: 59% (40079/67929)
Resolving deltas: 60% (40759/67929)
Resolving deltas: 60% (41229/67929)
Resolving deltas: 61% (41437/67929)
Resolving deltas: 62% (42116/67929)
Resolving deltas: 63% (42796/67929)
Resolving deltas: 64% (43475/67929)
Resolving deltas: 65% (44154/67929)
Resolving deltas: 66% (44834/67929)
Resolving deltas: 67% (45513/67929)
Resolving deltas: 68% (46192/67929)
Resolving deltas: 69% (46872/67929)
Resolving deltas: 70% (47553/67929)
Resolving deltas: 71% (48230/67929)
Resolving deltas: 72% (48909/67929)
Resolving deltas: 73% (49589/67929)
Resolving deltas: 74% (50269/67929)
Resolving deltas: 75% (50947/67929)
Resolving deltas: 76% (51627/67929)
Resolving deltas: 77% (52306/67929)
Resolving deltas: 78% (52985/67929)
Resolving deltas: 79% (53664/67929)
Resolving deltas: 80% (54344/67929)
Resolving deltas: 81% (55023/67929)
Resolving deltas: 82% (55702/67929)
Resolving deltas: 83% (56382/67929)
Resolving deltas: 84% (57061/67929)
Resolving deltas: 85% (57740/67929)
Resolving deltas: 86% (58419/67929)
Resolving deltas: 87% (59099/67929)
Resolving deltas: 88% (59778/67929)
Resolving deltas: 89% (60457/67929)
Resolving deltas: 90% (61137/67929)
Resolving deltas: 91% (61816/67929)
Resolving deltas: 92% (62495/67929)
Resolving deltas: 93% (63174/67929)
Resolving deltas: 94% (63854/67929)
Resolving deltas: 95% (64533/67929)
Resolving deltas: 96% (65212/67929)
Resolving deltas: 97% (65892/67929)
Resolving deltas: 98% (66571/67929)
Resolving deltas: 99% (67250/67929)
Resolving deltas: 100% (67929/67929)
Resolving deltas: 100% (67929/67929), done.
18.19 s
Fetching commit 58aaf5380023d118a91aa4083c01395586246f14 for feynkit ...
18.19 s
$ /nix/store/5vpcfsdx1lcnlb2y4k7xyc74shp5qwbh-git-2.54.0/bin/git fetch origin 58aaf5380023d118a91aa4083c01395586246f14
18.66 s
From https://github.com/alphal00p/gammaloop
18.66 s
* branch 58aaf5380023d118a91aa4083c01395586246f14 -> FETCH_HEAD
18.70 s
$ /nix/store/61685rbaxmpigwi3z23i33sv3jyfl70q-coreutils-9.11/bin/timeout --kill-after=15s 7200s /nix/store/5vpcfsdx1lcnlb2y4k7xyc74shp5qwbh-git-2.54.0/bin/git -c advice.detachedHead=false checkout 58aaf5380023d118a91aa4083c01395586246f14
18.83 s
HEAD is now at 58aaf5380 share physics layout across graph renderers
18.83 s
$ /nix/store/61685rbaxmpigwi3z23i33sv3jyfl70q-coreutils-9.11/bin/timeout --kill-after=15s 7200s /nix/store/wknkybkzrc16r11vk5vrykh4wmw7a353-nix-2.34.8/bin/nix --extra-experimental-features nix-command --extra-experimental-features flakes --log-format internal-json run .#packages.x86_64-linux.nix-ci-check-gammaloop-nextest-core --print-build-logs
19.11 s
warning: ignoring untrusted flake configuration setting 'extra-substituters'.
19.11 s
Pass '--accept-flake-config' to trust it
19.11 s
warning: ignoring untrusted flake configuration setting 'extra-trusted-public-keys'.
19.11 s
Pass '--accept-flake-config' to trust it
24.40 s
24.73 s
evaluating derivation 'gdo you want to allow configuration setting 'extra-substituters' to be set to 'https://cache.nix-ci.com ' (y/N)? do you want to permanently mark this value as untrusted (y/N)? warning: ignoring untrusted flake configuration setting 'extra-substituters'.
24.73 s
Pass '--accept-flake-config' to trust it
24.73 s
do you want to allow configuration setting 'extra-trusted-public-keys' to be set to 'nix-ci:g3xV5BDTLtIBZr/A00IU1x0EtKKlb7YLgBN2SgYgM6A= ' (y/N)? do you want to permanently mark this value as untrusted (y/N)? warning: ignoring untrusted flake configuration setting 'extra-trusted-public-keys'.
24.73 s
Pass '--accept-flake-config' to trust it
31.65 s
copying '/nix/store/566x
evaluating derivation 'g
copying '/nix/store/566x
evaluating derivation 'g
copying '/nix/store/566x
evaluating derivation 'g
copying '/nix/store/566x
evaluating derivation 'g
copying '/nix/store/566x
evaluating derivation 'g
copying '/nix/store/566x
evaluating derivation 'g
copying '/nix/store/566x
evaluating derivation 'g
copying '/nix/store/566x
evaluating derivation 'g
copying '/nix/store/566x
evaluating derivation 'g
copying '/nix/store/566x
evaluating derivation 'g
querying gammaloop-nexte
[0.0 KiB DL] querying in
[0 /6 built, 4 /0 /4 copied
[0 /5 built, 3 /1 /4 copied
[0 /4 built, 2 /2 /4 copied
[0 /3 built, 1 /3 /4 copied
[0 /2 built, 4 copied (18
[1 /0 /2 built, 4 copied (gammaloop-nextest-binaries-core (post)> Uploading to the NixCI cache: /nix/store/r5zggh77whylr7qml2j4vmzjk52n4v04-gammaloop-nextest-binaries-core
31.70 s
gammaloop-nextest-binaries-core (post)> warning: 'warn-short-path-literals' is deprecated, use 'lint-short-path-literals = ignore' instead
31.72 s
gammaloop-nextest-binaries-core (post)> copying 0 paths...
31.77 s
gammaloop-nextest-binaries-core (post)> warning: 'warn-short-path-literals' is deprecated, use 'lint-short-path-literals = ignore' instead
31.90 s
gammaloop-nextest-binaries-core (post)> copying 0 paths...
32.24 s
[1 /3 built, 4 copied (18
[1 /1 /2 built, 4 copied (gammaloop-nextest-core> Extracting 4 binaries (including 2 non-test binaries), 1 build script output directory, and 2 linked paths to /build/source
32.72 s
gammaloop-nextest-core> Extracted 20 files to /build/source in 0.48s
32.73 s
gammaloop-nextest-core> ------------
32.73 s
gammaloop-nextest-core> Nextest run ID 8aacd4b8-405b-462a-90e3-fcd12f616d1b with nextest profile: ci_gammaloop
32.73 s
gammaloop-nextest-core> Starting 341 tests across 2 binaries (1 test skipped )
33.10 s
gammaloop-nextest-core> ------------
33.10 s
gammaloop-nextest-core> Summary [ 0.370s] 341 tests run: 341 passed , 1 skipped
33.13 s
gammaloop-nextest-core>
33.13 s
gammaloop-nextest-core> ========== nextest test summary ==========
33.13 s
gammaloop-nextest-core> report: target/nextest/ci_gammaloop/junit.xml
33.13 s
gammaloop-nextest-core> tests: 341, failures: 0, errors: 0
33.13 s
gammaloop-nextest-core> No failing testcases found.
33.13 s
gammaloop-nextest-core> =========================================
33.14 s
gammaloop-nextest-core> Extracting 1 binary and 1 linked path to /build/source
33.22 s
gammaloop-nextest-core> Extracted 7 files to /build/source in 0.08s
33.23 s
gammaloop-nextest-core> ------------
33.23 s
gammaloop-nextest-core> Nextest run ID 1c96ec9e-4db7-4a59-af20-9a208c3fb6b9 with nextest profile: ci_gammaloop
33.23 s
gammaloop-nextest-core> Starting 19 tests across 1 binary
33.24 s
gammaloop-nextest-core> ------------
33.24 s
gammaloop-nextest-core> Summary [ 0.011s] 19 tests run: 19 passed , 0 skipped
33.27 s
gammaloop-nextest-core>
33.27 s
gammaloop-nextest-core> ========== nextest test summary ==========
33.27 s
gammaloop-nextest-core> report: target/nextest/ci_gammaloop/junit.xml
33.27 s
gammaloop-nextest-core> tests: 19, failures: 0, errors: 0
33.27 s
gammaloop-nextest-core> No failing testcases found.
33.27 s
gammaloop-nextest-core> =========================================
33.29 s
gammaloop-nextest-core> Extracting 1 binary to /build/source
33.32 s
gammaloop-nextest-core> Extracted 4 files to /build/source in 0.03s
33.32 s
gammaloop-nextest-core> ------------
33.32 s
gammaloop-nextest-core> Nextest run ID 6f707324-2f46-40d3-bd1a-afa3eff65399 with nextest profile: ci_gammaloop
33.32 s
gammaloop-nextest-core> Starting 0 tests across 1 binary
33.32 s
gammaloop-nextest-core> ------------
33.32 s
gammaloop-nextest-core> Summary [ 0.000s] 0 tests run: 0 passed , 0 skipped
33.35 s
gammaloop-nextest-core>
33.35 s
gammaloop-nextest-core> ========== nextest test summary ==========
33.35 s
gammaloop-nextest-core> report: target/nextest/ci_gammaloop/junit.xml
33.35 s
gammaloop-nextest-core> tests: 0, failures: 0, errors: 0
33.35 s
gammaloop-nextest-core> No failing testcases found.
33.35 s
gammaloop-nextest-core> =========================================
33.36 s
gammaloop-nextest-core> Extracting 4 binaries (including 1 non-test binary), 1 build script output directory, and 2 linked paths to /build/source
33.87 s
gammaloop-nextest-core> Extracted 19 files to /build/source in 0.51s
33.88 s
gammaloop-nextest-core> ------------
33.88 s
gammaloop-nextest-core> Nextest run ID 579b4c3d-e478-449d-8e84-d1a1c8e966b9 with nextest profile: ci_gammaloop
33.88 s
gammaloop-nextest-core> Starting 421 tests across 3 binaries (31 tests skipped , including 30 tests via profile.ci_gammaloop.default-filter )
34.43 s
gammaloop-nextest-core> FAIL [ 0.046s] (363/421) gammalooprs utils::test_utils :: normalization
34.43 s
gammaloop-nextest-core> stdout ---
34.43 s
gammaloop-nextest-core>
34.43 s
gammaloop-nextest-core> running 1 test
34.43 s
gammaloop-nextest-core> ━━━━━━━━━━━━━━━━━━━━━━━━━━━━━━━ Snapshot Summary ━━━━━━━━━━━━━━━━━━━━━━━━━━━━━━━
34.43 s
gammaloop-nextest-core> Snapshot: normalization-2
34.43 s
gammaloop-nextest-core> Source: crates/gammalooprs/src/utils/test_utils.rs:44
34.43 s
gammaloop-nextest-core> ────────────────────────────────────────────────────────────────────────────────
34.43 s
gammaloop-nextest-core> Expression: b.to_canonical_string()
34.43 s
gammaloop-nextest-core> ────────────────────────────────────────────────────────────────────────────────
34.43 s
gammaloop-nextest-core> -old snapshot
34.43 s
gammaloop-nextest-core> +new results
34.43 s
gammaloop-nextest-core> ────────────┬───────────────────────────────────────────────────────────────────
34.43 s
gammaloop-nextest-core> 1 │-gammalooprs::{spenso::rank1,spenso::tensor}::Q(1,spenso::{}::cind(1))
34.43 s
gammaloop-nextest-core> 1 │+gammalooprs::{spenso::rank1,spenso::tensor,spenso::tensor-label:q}::Q(1,spenso::{}::cind(1))
34.43 s
gammaloop-nextest-core> ────────────┴───────────────────────────────────────────────────────────────────
34.43 s
gammaloop-nextest-core> To update snapshots run `cargo insta review`
34.43 s
gammaloop-nextest-core> Stopped on the first failure. Run `cargo insta test` to run all snapshots.
34.43 s
gammaloop-nextest-core> test utils::test_utils::normalization ... FAILED
34.43 s
gammaloop-nextest-core>
34.43 s
gammaloop-nextest-core> failures:
34.43 s
gammaloop-nextest-core>
34.43 s
gammaloop-nextest-core> failures:
34.43 s
gammaloop-nextest-core> utils::test_utils::normalization
34.43 s
gammaloop-nextest-core>
34.43 s
gammaloop-nextest-core> test result: FAILED. 0 passed; 1 failed; 0 ignored; 0 measured; 445 filtered out; finished in 0.04s
34.43 s
gammaloop-nextest-core>
34.43 s
gammaloop-nextest-core> stderr ---
34.43 s
gammaloop-nextest-core>
34.43 s
gammaloop-nextest-core> thread 'utils::test_utils::normalization' (2241) panicked at /nix/store/c7lwckzlfrfsdw1ay0aqz4dpc2j7ry8d-vendor-cargo-deps/c19b7c6f923b580ac259164a89f2577984ad5ab09ee9d583b888f934adbbe8d0/insta-1.47.2/src/runtime.rs:719:13:
34.43 s
gammaloop-nextest-core> snapshot assertion for 'normalization-2' failed in line 44
34.43 s
gammaloop-nextest-core> stack backtrace:
34.43 s
gammaloop-nextest-core> 0: __rustc::rust_begin_unwind
34.43 s
gammaloop-nextest-core> 1: core::panicking::panic_fmt
34.43 s
gammaloop-nextest-core> 2: insta::runtime::assert_snapshot
34.43 s
gammaloop-nextest-core> 3: gammalooprs::utils::test_utils::normalization
34.43 s
gammaloop-nextest-core> 4: <gammalooprs::utils::test_utils::normalization::{closure#0} as core::ops::function::FnOnce<()>>::call_once
34.43 s
gammaloop-nextest-core> note: Some details are omitted, run with `RUST_BACKTRACE=full` for a verbose backtrace.
34.43 s
gammaloop-nextest-core>
40.38 s
gammaloop-nextest-core> ------------
40.38 s
gammaloop-nextest-core> Summary [ 6.497s] 421 tests run: 420 passed , 1 failed , 31 skipped
40.38 s
gammaloop-nextest-core> FAIL [ 0.046s] (363/421) gammalooprs utils::test_utils :: normalization
40.38 s
gammaloop-nextest-core> stdout ---
40.38 s
gammaloop-nextest-core>
40.38 s
gammaloop-nextest-core> running 1 test
40.38 s
gammaloop-nextest-core> ━━━━━━━━━━━━━━━━━━━━━━━━━━━━━━━ Snapshot Summary ━━━━━━━━━━━━━━━━━━━━━━━━━━━━━━━
40.38 s
gammaloop-nextest-core> Snapshot: normalization-2
40.38 s
gammaloop-nextest-core> Source: crates/gammalooprs/src/utils/test_utils.rs:44
40.38 s
gammaloop-nextest-core> ────────────────────────────────────────────────────────────────────────────────
40.38 s
gammaloop-nextest-core> Expression: b.to_canonical_string()
40.38 s
gammaloop-nextest-core> ────────────────────────────────────────────────────────────────────────────────
40.38 s
gammaloop-nextest-core> -old snapshot
40.38 s
gammaloop-nextest-core> +new results
40.38 s
gammaloop-nextest-core> ────────────┬───────────────────────────────────────────────────────────────────
40.38 s
gammaloop-nextest-core> 1 │-gammalooprs::{spenso::rank1,spenso::tensor}::Q(1,spenso::{}::cind(1))
40.38 s
gammaloop-nextest-core> 1 │+gammalooprs::{spenso::rank1,spenso::tensor,spenso::tensor-label:q}::Q(1,spenso::{}::cind(1))
40.38 s
gammaloop-nextest-core> ────────────┴───────────────────────────────────────────────────────────────────
40.38 s
gammaloop-nextest-core> To update snapshots run `cargo insta review`
40.38 s
gammaloop-nextest-core> Stopped on the first failure. Run `cargo insta test` to run all snapshots.
40.38 s
gammaloop-nextest-core> test utils::test_utils::normalization ... FAILED
40.38 s
gammaloop-nextest-core>
40.38 s
gammaloop-nextest-core> failures:
40.38 s
gammaloop-nextest-core>
40.38 s
gammaloop-nextest-core> failures:
40.38 s
gammaloop-nextest-core> utils::test_utils::normalization
40.38 s
gammaloop-nextest-core>
40.38 s
gammaloop-nextest-core> test result: FAILED. 0 passed; 1 failed; 0 ignored; 0 measured; 445 filtered out; finished in 0.04s
40.38 s
gammaloop-nextest-core>
40.38 s
gammaloop-nextest-core> stderr ---
40.38 s
gammaloop-nextest-core>
40.38 s
gammaloop-nextest-core> thread 'utils::test_utils::normalization' (2241) panicked at /nix/store/c7lwckzlfrfsdw1ay0aqz4dpc2j7ry8d-vendor-cargo-deps/c19b7c6f923b580ac259164a89f2577984ad5ab09ee9d583b888f934adbbe8d0/insta-1.47.2/src/runtime.rs:719:13:
40.38 s
gammaloop-nextest-core> snapshot assertion for 'normalization-2' failed in line 44
40.38 s
gammaloop-nextest-core> stack backtrace:
40.38 s
gammaloop-nextest-core> 0: __rustc::rust_begin_unwind
40.38 s
gammaloop-nextest-core> 1: core::panicking::panic_fmt
40.38 s
gammaloop-nextest-core> 2: insta::runtime::assert_snapshot
40.38 s
gammaloop-nextest-core> 3: gammalooprs::utils::test_utils::normalization
40.38 s
gammaloop-nextest-core> 4: <gammalooprs::utils::test_utils::normalization::{closure#0} as core::ops::function::FnOnce<()>>::call_once
40.38 s
gammaloop-nextest-core> note: Some details are omitted, run with `RUST_BACKTRACE=full` for a verbose backtrace.
40.38 s
gammaloop-nextest-core>
40.39 s
gammaloop-nextest-core> error : test run failed
40.42 s
gammaloop-nextest-core>
40.42 s
gammaloop-nextest-core> ========== nextest test summary ==========
40.42 s
gammaloop-nextest-core> report: target/nextest/ci_gammaloop/junit.xml
40.42 s
gammaloop-nextest-core> tests: 421, failures: 1, errors: 0
40.42 s
gammaloop-nextest-core>
40.42 s
gammaloop-nextest-core> 1. gammalooprs::utils::test_utils::normalization
40.42 s
gammaloop-nextest-core> failure: test failure with exit code 101
40.42 s
gammaloop-nextest-core> thread 'utils::test_utils::normalization' (2241) panicked at /nix/store/c7lwckzlfrfsdw1ay0aqz4dpc2j7ry8d-vendor-cargo-deps/c19b7c6f923b580ac259164a89f2577984ad5ab09ee9d583b888f934adbbe8d0/insta-1.47.2/src/runtime.rs:719:13:
40.42 s
gammaloop-nextest-core> snapshot assertion for 'normalization-2' failed in line 44
40.42 s
gammaloop-nextest-core> stack backtrace:
40.42 s
gammaloop-nextest-core> 0: __rustc::rust_begin_unwind
40.42 s
gammaloop-nextest-core> 1: core::panicking::panic_fmt
40.42 s
gammaloop-nextest-core> 2: insta::runtime::assert_snapshot
40.42 s
gammaloop-nextest-core> 3: gammalooprs::utils::test_utils::normalization
40.42 s
gammaloop-nextest-core> 4: <gammalooprs::utils::test_utils::normalization::{closure#0} as core::ops::function::FnOnce<()>>::call_once
40.42 s
gammaloop-nextest-core> note: Some details are omitted, run with `RUST_BACKTRACE=full` for a verbose backtrace.
40.42 s
gammaloop-nextest-core> system-out
40.42 s
gammaloop-nextest-core> running 1 test
40.42 s
gammaloop-nextest-core> ━━━━━━━━━━━━━━━━━━━━━━━━━━━━━━━ Snapshot Summary ━━━━━━━━━━━━━━━━━━━━━━━━━━━━━━━
40.42 s
gammaloop-nextest-core> Snapshot: normalization-2
40.42 s
gammaloop-nextest-core> Source: crates/gammalooprs/src/utils/test_utils.rs:44
40.42 s
gammaloop-nextest-core> ────────────────────────────────────────────────────────────────────────────────
40.42 s
gammaloop-nextest-core> Expression: b.to_canonical_string()
40.42 s
gammaloop-nextest-core> ────────────────────────────────────────────────────────────────────────────────
40.42 s
gammaloop-nextest-core> -old snapshot
40.42 s
gammaloop-nextest-core> +new results
40.42 s
gammaloop-nextest-core> ────────────┬───────────────────────────────────────────────────────────────────
40.42 s
gammaloop-nextest-core> 1 │-gammalooprs::{spenso::rank1,spenso::tensor}::Q(1,spenso::{}::cind(1))
40.42 s
gammaloop-nextest-core> 1 │+gammalooprs::{spenso::rank1,spenso::tensor,spenso::tensor-label:q}::Q(1,spenso::{}::cind(1))
40.42 s
gammaloop-nextest-core> ────────────┴───────────────────────────────────────────────────────────────────
40.42 s
gammaloop-nextest-core> To update snapshots run `cargo insta review`
40.42 s
gammaloop-nextest-core> Stopped on the first failure. Run `cargo insta test` to run all snapshots.
40.42 s
gammaloop-nextest-core> test utils::test_utils::normalization ... FAILED
40.42 s
gammaloop-nextest-core>
40.42 s
gammaloop-nextest-core> failures:
40.42 s
gammaloop-nextest-core>
40.42 s
gammaloop-nextest-core> failures:
40.42 s
gammaloop-nextest-core> utils::test_utils::normalization
40.42 s
gammaloop-nextest-core>
40.42 s
gammaloop-nextest-core> test result: FAILED. 0 passed; 1 failed; 0 ignored; 0 measured; 445 filtered out; finished in 0.04s
40.42 s
gammaloop-nextest-core> system-err
40.42 s
gammaloop-nextest-core> thread 'utils::test_utils::normalization' (2241) panicked at /nix/store/c7lwckzlfrfsdw1ay0aqz4dpc2j7ry8d-vendor-cargo-deps/c19b7c6f923b580ac259164a89f2577984ad5ab09ee9d583b888f934adbbe8d0/insta-1.47.2/src/runtime.rs:719:13:
40.42 s
gammaloop-nextest-core> snapshot assertion for 'normalization-2' failed in line 44
40.42 s
gammaloop-nextest-core> stack backtrace:
40.42 s
gammaloop-nextest-core> 0: __rustc::rust_begin_unwind
40.42 s
gammaloop-nextest-core> 1: core::panicking::panic_fmt
40.42 s
gammaloop-nextest-core> 2: insta::runtime::assert_snapshot
40.42 s
gammaloop-nextest-core> 3: gammalooprs::utils::test_utils::normalization
40.42 s
gammaloop-nextest-core> 4: <gammalooprs::utils::test_utils::normalization::{closure#0} as core::ops::function::FnOnce<()>>::call_once
40.42 s
gammaloop-nextest-core> note: Some details are omitted, run with `RUST_BACKTRACE=full` for a verbose backtrace.
40.42 s
gammaloop-nextest-core> =========================================
40.58 s
error: Cannot build '/nix/store/ckg96rv0lgqlnyry3xsk00acwpalk4w6-gammaloop-nextest-core.drv '.
40.58 s
Reason: builder failed with exit code 100 .
40.58 s
Output paths:
40.58 s
/nix/store/m5zprznfnxr4a6ajrvihg6dqgfmv2ncg-gammaloop-nextest-core
40.58 s
Last 176 log lines:
40.58 s
> Extracting 4 binaries (including 2 non-test binaries), 1 build script output directory, and 2 linked paths to /build/source
40.58 s
> Extracted 20 files to /build/source in 0.48s
40.58 s
> ------------
40.58 s
> Nextest run ID 8aacd4b8-405b-462a-90e3-fcd12f616d1b with nextest profile: ci_gammaloop
40.58 s
> Starting 341 tests across 2 binaries (1 test skipped )
40.58 s
> ------------
40.58 s
> Summary [ 0.370s] 341 tests run: 341 passed , 1 skipped
40.58 s
>
40.58 s
> ========== nextest test summary ==========
40.58 s
> report: target/nextest/ci_gammaloop/junit.xml
40.58 s
> tests: 341, failures: 0, errors: 0
40.58 s
> No failing testcases found.
40.58 s
> =========================================
40.58 s
> Extracting 1 binary and 1 linked path to /build/source
40.58 s
> Extracted 7 files to /build/source in 0.08s
40.58 s
> ------------
40.58 s
> Nextest run ID 1c96ec9e-4db7-4a59-af20-9a208c3fb6b9 with nextest profile: ci_gammaloop
40.58 s
> Starting 19 tests across 1 binary
40.58 s
> ------------
40.58 s
> Summary [ 0.011s] 19 tests run: 19 passed , 0 skipped
40.58 s
>
40.58 s
> ========== nextest test summary ==========
40.58 s
> report: target/nextest/ci_gammaloop/junit.xml
40.58 s
> tests: 19, failures: 0, errors: 0
40.58 s
> No failing testcases found.
40.58 s
> =========================================
40.58 s
> Extracting 1 binary to /build/source
40.58 s
> Extracted 4 files to /build/source in 0.03s
40.58 s
> ------------
40.58 s
> Nextest run ID 6f707324-2f46-40d3-bd1a-afa3eff65399 with nextest profile: ci_gammaloop
40.58 s
> Starting 0 tests across 1 binary
40.58 s
> ------------
40.58 s
> Summary [ 0.000s] 0 tests run: 0 passed , 0 skipped
40.58 s
>
40.58 s
> ========== nextest test summary ==========
40.58 s
> report: target/nextest/ci_gammaloop/junit.xml
40.58 s
> tests: 0, failures: 0, errors: 0
40.58 s
> No failing testcases found.
40.58 s
> =========================================
40.58 s
> Extracting 4 binaries (including 1 non-test binary), 1 build script output directory, and 2 linked paths to /build/source
40.58 s
> Extracted 19 files to /build/source in 0.51s
40.58 s
> ------------
40.58 s
> Nextest run ID 579b4c3d-e478-449d-8e84-d1a1c8e966b9 with nextest profile: ci_gammaloop
40.58 s
> Starting 421 tests across 3 binaries (31 tests skipped , including 30 tests via profile.ci_gammaloop.default-filter )
40.58 s
> FAIL [ 0.046s] (363/421) gammalooprs utils::test_utils :: normalization
40.58 s
> stdout ---
40.58 s
>
40.58 s
> running 1 test
40.58 s
> ━━━━━━━━━━━━━━━━━━━━━━━━━━━━━━━ Snapshot Summary ━━━━━━━━━━━━━━━━━━━━━━━━━━━━━━━
40.58 s
> Snapshot: normalization-2
40.58 s
> Source: crates/gammalooprs/src/utils/test_utils.rs:44
40.58 s
> ────────────────────────────────────────────────────────────────────────────────
40.58 s
> Expression: b.to_canonical_string()
40.58 s
> ────────────────────────────────────────────────────────────────────────────────
40.58 s
> -old snapshot
40.58 s
> +new results
40.58 s
> ────────────┬───────────────────────────────────────────────────────────────────
40.58 s
> 1 │-gammalooprs::{spenso::rank1,spenso::tensor}::Q(1,spenso::{}::cind(1))
40.58 s
> 1 │+gammalooprs::{spenso::rank1,spenso::tensor,spenso::tensor-label:q}::Q(1,spenso::{}::cind(1))
40.58 s
> ────────────┴───────────────────────────────────────────────────────────────────
40.58 s
> To update snapshots run `cargo insta review`
40.58 s
> Stopped on the first failure. Run `cargo insta test` to run all snapshots.
40.58 s
> test utils::test_utils::normalization ... FAILED
40.58 s
>
40.58 s
> failures:
40.58 s
>
40.58 s
> failures:
40.58 s
> utils::test_utils::normalization
40.58 s
>
40.58 s
> test result: FAILED. 0 passed; 1 failed; 0 ignored; 0 measured; 445 filtered out; finished in 0.04s
40.58 s
>
40.58 s
> stderr ---
40.58 s
>
40.58 s
> thread 'utils::test_utils::normalization' (2241) panicked at /nix/store/c7lwckzlfrfsdw1ay0aqz4dpc2j7ry8d-vendor-cargo-deps/c19b7c6f923b580ac259164a89f2577984ad5ab09ee9d583b888f934adbbe8d0/insta-1.47.2/src/runtime.rs:719:13:
40.58 s
> snapshot assertion for 'normalization-2' failed in line 44
40.58 s
> stack backtrace:
40.58 s
> 0: __rustc::rust_begin_unwind
40.58 s
> 1: core::panicking::panic_fmt
40.58 s
> 2: insta::runtime::assert_snapshot
40.58 s
> 3: gammalooprs::utils::test_utils::normalization
40.58 s
> 4: <gammalooprs::utils::test_utils::normalization::{closure#0} as core::ops::function::FnOnce<()>>::call_once
40.58 s
> note: Some details are omitted, run with `RUST_BACKTRACE=full` for a verbose backtrace.
40.58 s
>
40.58 s
> ------------
40.58 s
> Summary [ 6.497s] 421 tests run: 420 passed , 1 failed , 31 skipped
40.58 s
> FAIL [ 0.046s] (363/421) gammalooprs utils::test_utils :: normalization
40.58 s
> stdout ---
40.58 s
>
40.58 s
> running 1 test
40.58 s
> ━━━━━━━━━━━━━━━━━━━━━━━━━━━━━━━ Snapshot Summary ━━━━━━━━━━━━━━━━━━━━━━━━━━━━━━━
40.58 s
> Snapshot: normalization-2
40.58 s
> Source: crates/gammalooprs/src/utils/test_utils.rs:44
40.58 s
> ────────────────────────────────────────────────────────────────────────────────
40.58 s
> Expression: b.to_canonical_string()
40.58 s
> ────────────────────────────────────────────────────────────────────────────────
40.58 s
> -old snapshot
40.58 s
> +new results
40.58 s
> ────────────┬───────────────────────────────────────────────────────────────────
40.58 s
> 1 │-gammalooprs::{spenso::rank1,spenso::tensor}::Q(1,spenso::{}::cind(1))
40.58 s
> 1 │+gammalooprs::{spenso::rank1,spenso::tensor,spenso::tensor-label:q}::Q(1,spenso::{}::cind(1))
40.58 s
> ────────────┴───────────────────────────────────────────────────────────────────
40.58 s
> To update snapshots run `cargo insta review`
40.58 s
> Stopped on the first failure. Run `cargo insta test` to run all snapshots.
40.58 s
> test utils::test_utils::normalization ... FAILED
40.58 s
>
40.58 s
> failures:
40.58 s
>
40.58 s
> failures:
40.58 s
> utils::test_utils::normalization
40.58 s
>
40.58 s
> test result: FAILED. 0 passed; 1 failed; 0 ignored; 0 measured; 445 filtered out; finished in 0.04s
40.58 s
>
40.58 s
> stderr ---
40.58 s
>
40.58 s
> thread 'utils::test_utils::normalization' (2241) panicked at /nix/store/c7lwckzlfrfsdw1ay0aqz4dpc2j7ry8d-vendor-cargo-deps/c19b7c6f923b580ac259164a89f2577984ad5ab09ee9d583b888f934adbbe8d0/insta-1.47.2/src/runtime.rs:719:13:
40.58 s
> snapshot assertion for 'normalization-2' failed in line 44
40.58 s
> stack backtrace:
40.58 s
> 0: __rustc::rust_begin_unwind
40.58 s
> 1: core::panicking::panic_fmt
40.58 s
> 2: insta::runtime::assert_snapshot
40.58 s
> 3: gammalooprs::utils::test_utils::normalization
40.58 s
> 4: <gammalooprs::utils::test_utils::normalization::{closure#0} as core::ops::function::FnOnce<()>>::call_once
40.58 s
> note: Some details are omitted, run with `RUST_BACKTRACE=full` for a verbose backtrace.
40.58 s
>
40.58 s
> error : test run failed
40.58 s
>
40.58 s
> ========== nextest test summary ==========
40.58 s
> report: target/nextest/ci_gammaloop/junit.xml
40.58 s
> tests: 421, failures: 1, errors: 0
40.58 s
>
40.58 s
> 1. gammalooprs::utils::test_utils::normalization
40.58 s
> failure: test failure with exit code 101
40.58 s
> thread 'utils::test_utils::normalization' (2241) panicked at /nix/store/c7lwckzlfrfsdw1ay0aqz4dpc2j7ry8d-vendor-cargo-deps/c19b7c6f923b580ac259164a89f2577984ad5ab09ee9d583b888f934adbbe8d0/insta-1.47.2/src/runtime.rs:719:13:
40.58 s
> snapshot assertion for 'normalization-2' failed in line 44
40.58 s
> stack backtrace:
40.58 s
> 0: __rustc::rust_begin_unwind
40.58 s
> 1: core::panicking::panic_fmt
40.58 s
> 2: insta::runtime::assert_snapshot
40.58 s
> 3: gammalooprs::utils::test_utils::normalization
40.58 s
> 4: <gammalooprs::utils::test_utils::normalization::{closure#0} as core::ops::function::FnOnce<()>>::call_once
40.58 s
> note: Some details are omitted, run with `RUST_BACKTRACE=full` for a verbose backtrace.
40.58 s
> system-out
40.58 s
> running 1 test
40.58 s
> ━━━━━━━━━━━━━━━━━━━━━━━━━━━━━━━ Snapshot Summary ━━━━━━━━━━━━━━━━━━━━━━━━━━━━━━━
40.58 s
> Snapshot: normalization-2
40.58 s
> Source: crates/gammalooprs/src/utils/test_utils.rs:44
40.58 s
> ────────────────────────────────────────────────────────────────────────────────
40.58 s
> Expression: b.to_canonical_string()
40.58 s
> ────────────────────────────────────────────────────────────────────────────────
40.58 s
> -old snapshot
40.58 s
> +new results
40.58 s
> ────────────┬───────────────────────────────────────────────────────────────────
40.58 s
> 1 │-gammalooprs::{spenso::rank1,spenso::tensor}::Q(1,spenso::{}::cind(1))
40.58 s
> 1 │+gammalooprs::{spenso::rank1,spenso::tensor,spenso::tensor-label:q}::Q(1,spenso::{}::cind(1))
40.58 s
> ────────────┴───────────────────────────────────────────────────────────────────
40.58 s
> To update snapshots run `cargo insta review`
40.58 s
> Stopped on the first failure. Run `cargo insta test` to run all snapshots.
40.58 s
> test utils::test_utils::normalization ... FAILED
40.58 s
>
40.58 s
> failures:
40.58 s
>
40.58 s
> failures:
40.58 s
> utils::test_utils::normalization
40.58 s
>
40.58 s
> test result: FAILED. 0 passed; 1 failed; 0 ignored; 0 measured; 445 filtered out; finished in 0.04s
40.58 s
> system-err
40.58 s
> thread 'utils::test_utils::normalization' (2241) panicked at /nix/store/c7lwckzlfrfsdw1ay0aqz4dpc2j7ry8d-vendor-cargo-deps/c19b7c6f923b580ac259164a89f2577984ad5ab09ee9d583b888f934adbbe8d0/insta-1.47.2/src/runtime.rs:719:13:
40.58 s
> snapshot assertion for 'normalization-2' failed in line 44
40.58 s
> stack backtrace:
40.58 s
> 0: __rustc::rust_begin_unwind
40.58 s
> 1: core::panicking::panic_fmt
40.58 s
> 2: insta::runtime::assert_snapshot
40.58 s
> 3: gammalooprs::utils::test_utils::normalization
40.58 s
> 4: <gammalooprs::utils::test_utils::normalization::{closure#0} as core::ops::function::FnOnce<()>>::call_once
40.58 s
> note: Some details are omitted, run with `RUST_BACKTRACE=full` for a verbose backtrace.
40.58 s
> =========================================
40.58 s
For full logs, run:
40.58 s
nix log /nix/store/ckg96rv0lgqlnyry3xsk00acwpalk4w6-gammaloop-nextest-core.drv
40.73 s
[1 built (1 failed ), 4 cRun failed.