test packages.x86_64-linux.nix-ci-check-gammaloop-nextest-feynkit
0.00 s
$ /nix/store/61685rbaxmpigwi3z23i33sv3jyfl70q-coreutils-9.11/bin/timeout --kill-after=15s 7200s /nix/store/wknkybkzrc16r11vk5vrykh4wmw7a353-nix-2.34.8/bin/nix --extra-experimental-features nix-command --extra-experimental-features flakes flake clone git+https://github.com/alphal00p/gammaloop --dest /tmp/nix-ci-worker/stable-pwd/repo/
0.19 s
Cloning into '/tmp/nix-ci-worker/stable-pwd/repo'...
0.95 s
remote: Enumerating objects: 103784, done.
1.08 s
remote: Counting objects: 0% (1/9451)
remote: Counting objects: 1% (95/9451)
remote: Counting objects: 2% (190/9451)
remote: Counting objects: 3% (284/9451)
remote: Counting objects: 4% (379/9451)
remote: Counting objects: 5% (473/9451)
remote: Counting objects: 6% (568/9451)
remote: Counting objects: 7% (662/9451)
remote: Counting objects: 8% (757/9451)
remote: Counting objects: 9% (851/9451)
remote: Counting objects: 10% (946/9451)
remote: Counting objects: 11% (1040/9451)
remote: Counting objects: 12% (1135/9451)
remote: Counting objects: 13% (1229/9451)
remote: Counting objects: 14% (1324/9451)
remote: Counting objects: 15% (1418/9451)
remote: Counting objects: 16% (1513/9451)
remote: Counting objects: 17% (1607/9451)
remote: Counting objects: 18% (1702/9451)
remote: Counting objects: 19% (1796/9451)
remote: Counting objects: 20% (1891/9451)
remote: Counting objects: 21% (1985/9451)
remote: Counting objects: 22% (2080/9451)
remote: Counting objects: 23% (2174/9451)
remote: Counting objects: 24% (2269/9451)
remote: Counting objects: 25% (2363/9451)
remote: Counting objects: 26% (2458/9451)
remote: Counting objects: 27% (2552/9451)
remote: Counting objects: 28% (2647/9451)
remote: Counting objects: 29% (2741/9451)
remote: Counting objects: 30% (2836/9451)
remote: Counting objects: 31% (2930/9451)
remote: Counting objects: 32% (3025/9451)
remote: Counting objects: 33% (3119/9451)
remote: Counting objects: 34% (3214/9451)
remote: Counting objects: 35% (3308/9451)
remote: Counting objects: 36% (3403/9451)
remote: Counting objects: 37% (3497/9451)
remote: Counting objects: 38% (3592/9451)
remote: Counting objects: 39% (3686/9451)
remote: Counting objects: 40% (3781/9451)
remote: Counting objects: 41% (3875/9451)
remote: Counting objects: 42% (3970/9451)
remote: Counting objects: 43% (4064/9451)
remote: Counting objects: 44% (4159/9451)
remote: Counting objects: 45% (4253/9451)
remote: Counting objects: 46% (4348/9451)
remote: Counting objects: 47% (4442/9451)
remote: Counting objects: 48% (4537/9451)
remote: Counting objects: 49% (4631/9451)
remote: Counting objects: 50% (4726/9451)
remote: Counting objects: 51% (4821/9451)
remote: Counting objects: 52% (4915/9451)
remote: Counting objects: 53% (5010/9451)
remote: Counting objects: 54% (5104/9451)
remote: Counting objects: 55% (5199/9451)
remote: Counting objects: 56% (5293/9451)
remote: Counting objects: 57% (5388/9451)
remote: Counting objects: 58% (5482/9451)
remote: Counting objects: 59% (5577/9451)
remote: Counting objects: 60% (5671/9451)
remote: Counting objects: 61% (5766/9451)
remote: Counting objects: 62% (5860/9451)
remote: Counting objects: 63% (5955/9451)
remote: Counting objects: 64% (6049/9451)
remote: Counting objects: 65% (6144/9451)
remote: Counting objects: 66% (6238/9451)
remote: Counting objects: 67% (6333/9451)
remote: Counting objects: 68% (6427/9451)
remote: Counting objects: 69% (6522/9451)
remote: Counting objects: 70% (6616/9451)
remote: Counting objects: 71% (6711/9451)
remote: Counting objects: 72% (6805/9451)
remote: Counting objects: 73% (6900/9451)
remote: Counting objects: 74% (6994/9451)
remote: Counting objects: 75% (7089/9451)
remote: Counting objects: 76% (7183/9451)
remote: Counting objects: 77% (7278/9451)
remote: Counting objects: 78% (7372/9451)
remote: Counting objects: 79% (7467/9451)
remote: Counting objects: 80% (7561/9451)
remote: Counting objects: 81% (7656/9451)
remote: Counting objects: 82% (7750/9451)
remote: Counting objects: 83% (7845/9451)
remote: Counting objects: 84% (7939/9451)
remote: Counting objects: 85% (8034/9451)
remote: Counting objects: 86% (8128/9451)
remote: Counting objects: 87% (8223/9451)
remote: Counting objects: 88% (8317/9451)
remote: Counting objects: 89% (8412/9451)
remote: Counting objects: 90% (8506/9451)
remote: Counting objects: 91% (8601/9451)
remote: Counting objects: 92% (8695/9451)
remote: Counting objects: 93% (8790/9451)
remote: Counting objects: 94% (8884/9451)
remote: Counting objects: 95% (8979/9451)
remote: Counting objects: 96% (9073/9451)
remote: Counting objects: 97% (9168/9451)
remote: Counting objects: 98% (9262/9451)
remote: Counting objects: 99% (9357/9451)
remote: Counting objects: 100% (9451/9451)
remote: Counting objects: 100% (9451/9451), done.
3.04 s
remote: Compressing objects: 0% (1/2031)
remote: Compressing objects: 1% (21/2031)
remote: Compressing objects: 2% (41/2031)
remote: Compressing objects: 3% (61/2031)
remote: Compressing objects: 4% (82/2031)
remote: Compressing objects: 5% (102/2031)
remote: Compressing objects: 6% (122/2031)
remote: Compressing objects: 7% (143/2031)
remote: Compressing objects: 8% (163/2031)
remote: Compressing objects: 9% (183/2031)
remote: Compressing objects: 10% (204/2031)
remote: Compressing objects: 10% (219/2031)
remote: Compressing objects: 11% (224/2031)
remote: Compressing objects: 12% (244/2031)
remote: Compressing objects: 13% (265/2031)
remote: Compressing objects: 14% (285/2031)
remote: Compressing objects: 15% (305/2031)
remote: Compressing objects: 16% (325/2031)
remote: Compressing objects: 17% (346/2031)
remote: Compressing objects: 18% (366/2031)
remote: Compressing objects: 19% (386/2031)
remote: Compressing objects: 20% (407/2031)
remote: Compressing objects: 21% (427/2031)
remote: Compressing objects: 22% (447/2031)
remote: Compressing objects: 23% (468/2031)
remote: Compressing objects: 24% (488/2031)
remote: Compressing objects: 25% (508/2031)
remote: Compressing objects: 26% (529/2031)
remote: Compressing objects: 27% (549/2031)
remote: Compressing objects: 28% (569/2031)
remote: Compressing objects: 29% (589/2031)
remote: Compressing objects: 30% (610/2031)
remote: Compressing objects: 31% (630/2031)
remote: Compressing objects: 32% (650/2031)
remote: Compressing objects: 33% (671/2031)
remote: Compressing objects: 33% (688/2031)
remote: Compressing objects: 34% (691/2031)
remote: Compressing objects: 35% (711/2031)
remote: Compressing objects: 36% (732/2031)
remote: Compressing objects: 37% (752/2031)
remote: Compressing objects: 38% (772/2031)
remote: Compressing objects: 39% (793/2031)
remote: Compressing objects: 40% (813/2031)
remote: Compressing objects: 41% (833/2031)
remote: Compressing objects: 42% (854/2031)
remote: Compressing objects: 43% (874/2031)
remote: Compressing objects: 44% (894/2031)
remote: Compressing objects: 45% (914/2031)
remote: Compressing objects: 46% (935/2031)
remote: Compressing objects: 47% (955/2031)
remote: Compressing objects: 48% (975/2031)
remote: Compressing objects: 49% (996/2031)
remote: Compressing objects: 50% (1016/2031)
remote: Compressing objects: 51% (1036/2031)
remote: Compressing objects: 52% (1057/2031)
remote: Compressing objects: 53% (1077/2031)
remote: Compressing objects: 54% (1097/2031)
remote: Compressing objects: 55% (1118/2031)
remote: Compressing objects: 56% (1138/2031)
remote: Compressing objects: 57% (1158/2031)
remote: Compressing objects: 58% (1178/2031)
remote: Compressing objects: 59% (1199/2031)
remote: Compressing objects: 60% (1219/2031)
remote: Compressing objects: 61% (1239/2031)
remote: Compressing objects: 62% (1260/2031)
remote: Compressing objects: 63% (1280/2031)
remote: Compressing objects: 64% (1300/2031)
remote: Compressing objects: 65% (1321/2031)
remote: Compressing objects: 66% (1341/2031)
remote: Compressing objects: 67% (1361/2031)
remote: Compressing objects: 68% (1382/2031)
remote: Compressing objects: 69% (1402/2031)
remote: Compressing objects: 70% (1422/2031)
remote: Compressing objects: 71% (1443/2031)
remote: Compressing objects: 72% (1463/2031)
remote: Compressing objects: 73% (1483/2031)
remote: Compressing objects: 74% (1503/2031)
remote: Compressing objects: 75% (1524/2031)
remote: Compressing objects: 76% (1544/2031)
remote: Compressing objects: 77% (1564/2031)
remote: Compressing objects: 78% (1585/2031)
remote: Compressing objects: 79% (1605/2031)
remote: Compressing objects: 80% (1625/2031)
remote: Compressing objects: 81% (1646/2031)
remote: Compressing objects: 82% (1666/2031)
remote: Compressing objects: 83% (1686/2031)
remote: Compressing objects: 84% (1707/2031)
remote: Compressing objects: 85% (1727/2031)
remote: Compressing objects: 86% (1747/2031)
remote: Compressing objects: 87% (1767/2031)
remote: Compressing objects: 88% (1788/2031)
remote: Compressing objects: 89% (1808/2031)
remote: Compressing objects: 90% (1828/2031)
remote: Compressing objects: 91% (1849/2031)
remote: Compressing objects: 92% (1869/2031)
remote: Compressing objects: 93% (1889/2031)
remote: Compressing objects: 94% (1910/2031)
remote: Compressing objects: 95% (1930/2031)
remote: Compressing objects: 96% (1950/2031)
remote: Compressing objects: 97% (1971/2031)
remote: Compressing objects: 98% (1991/2031)
remote: Compressing objects: 99% (2011/2031)
remote: Compressing objects: 100% (2031/2031)
remote: Compressing objects: 100% (2031/2031), done.
17.00 s
Receiving objects: 0% (1/103784)
Receiving objects: 1% (1038/103784)
Receiving objects: 2% (2076/103784)
Receiving objects: 3% (3114/103784)
Receiving objects: 4% (4152/103784)
Receiving objects: 5% (5190/103784)
Receiving objects: 6% (6228/103784)
Receiving objects: 7% (7265/103784), 13.57 MiB | 27.12 MiB/s
Receiving objects: 8% (8303/103784), 13.57 MiB | 27.12 MiB/s
Receiving objects: 9% (9341/103784), 13.57 MiB | 27.12 MiB/s
Receiving objects: 10% (10379/103784), 13.57 MiB | 27.12 MiB/s
Receiving objects: 11% (11417/103784), 13.57 MiB | 27.12 MiB/s
Receiving objects: 12% (12455/103784), 13.57 MiB | 27.12 MiB/s
Receiving objects: 13% (13492/103784), 13.57 MiB | 27.12 MiB/s
Receiving objects: 14% (14530/103784), 13.57 MiB | 27.12 MiB/s
Receiving objects: 15% (15568/103784), 13.57 MiB | 27.12 MiB/s
Receiving objects: 16% (16606/103784), 13.57 MiB | 27.12 MiB/s
Receiving objects: 17% (17644/103784), 13.57 MiB | 27.12 MiB/s
Receiving objects: 18% (18682/103784), 13.57 MiB | 27.12 MiB/s
Receiving objects: 19% (19719/103784), 13.57 MiB | 27.12 MiB/s
Receiving objects: 20% (20757/103784), 13.57 MiB | 27.12 MiB/s
Receiving objects: 21% (21795/103784), 13.57 MiB | 27.12 MiB/s
Receiving objects: 22% (22833/103784), 13.57 MiB | 27.12 MiB/s
Receiving objects: 23% (23871/103784), 13.57 MiB | 27.12 MiB/s
Receiving objects: 24% (24909/103784), 13.57 MiB | 27.12 MiB/s
Receiving objects: 25% (25946/103784), 13.57 MiB | 27.12 MiB/s
Receiving objects: 26% (26984/103784), 13.57 MiB | 27.12 MiB/s
Receiving objects: 27% (28022/103784), 13.57 MiB | 27.12 MiB/s
Receiving objects: 28% (29060/103784), 13.57 MiB | 27.12 MiB/s
Receiving objects: 29% (30098/103784), 13.57 MiB | 27.12 MiB/s
Receiving objects: 30% (31136/103784), 13.57 MiB | 27.12 MiB/s
Receiving objects: 31% (32174/103784), 13.57 MiB | 27.12 MiB/s
Receiving objects: 31% (32630/103784), 30.41 MiB | 30.41 MiB/s
Receiving objects: 32% (33211/103784), 30.41 MiB | 30.41 MiB/s
Receiving objects: 33% (34249/103784), 30.41 MiB | 30.41 MiB/s
Receiving objects: 34% (35287/103784), 30.41 MiB | 30.41 MiB/s
Receiving objects: 35% (36325/103784), 30.41 MiB | 30.41 MiB/s
Receiving objects: 36% (37363/103784), 30.41 MiB | 30.41 MiB/s
Receiving objects: 37% (38401/103784), 30.41 MiB | 30.41 MiB/s
Receiving objects: 38% (39438/103784), 30.41 MiB | 30.41 MiB/s
Receiving objects: 39% (40476/103784), 46.45 MiB | 30.96 MiB/s
Receiving objects: 40% (41514/103784), 46.45 MiB | 30.96 MiB/s
Receiving objects: 41% (42552/103784), 46.45 MiB | 30.96 MiB/s
Receiving objects: 42% (43590/103784), 46.45 MiB | 30.96 MiB/s
Receiving objects: 43% (44628/103784), 46.45 MiB | 30.96 MiB/s
Receiving objects: 44% (45665/103784), 46.45 MiB | 30.96 MiB/s
Receiving objects: 45% (46703/103784), 46.45 MiB | 30.96 MiB/s
Receiving objects: 46% (47741/103784), 46.45 MiB | 30.96 MiB/s
Receiving objects: 46% (48707/103784), 61.86 MiB | 30.40 MiB/s
Receiving objects: 47% (48779/103784), 61.86 MiB | 30.40 MiB/s
Receiving objects: 48% (49817/103784), 61.86 MiB | 30.40 MiB/s
Receiving objects: 49% (50855/103784), 61.86 MiB | 30.40 MiB/s
Receiving objects: 50% (51892/103784), 61.86 MiB | 30.40 MiB/s
Receiving objects: 51% (52930/103784), 61.86 MiB | 30.40 MiB/s
Receiving objects: 52% (53968/103784), 78.31 MiB | 30.86 MiB/s
Receiving objects: 53% (55006/103784), 78.31 MiB | 30.86 MiB/s
Receiving objects: 54% (56044/103784), 78.31 MiB | 30.86 MiB/s
Receiving objects: 55% (57082/103784), 78.31 MiB | 30.86 MiB/s
Receiving objects: 55% (57255/103784), 93.94 MiB | 30.82 MiB/s
Receiving objects: 55% (57609/103784), 109.50 MiB | 30.86 MiB/s
Receiving objects: 56% (58120/103784), 126.03 MiB | 31.13 MiB/s
Receiving objects: 57% (59157/103784), 126.03 MiB | 31.13 MiB/s
Receiving objects: 58% (60195/103784), 126.03 MiB | 31.13 MiB/s
Receiving objects: 59% (61233/103784), 141.85 MiB | 31.19 MiB/s
Receiving objects: 60% (62271/103784), 141.85 MiB | 31.19 MiB/s
Receiving objects: 61% (63309/103784), 141.85 MiB | 31.19 MiB/s
Receiving objects: 61% (64133/103784), 141.85 MiB | 31.19 MiB/s
Receiving objects: 62% (64347/103784), 173.86 MiB | 31.26 MiB/s
Receiving objects: 62% (64435/103784), 173.86 MiB | 31.26 MiB/s
Receiving objects: 63% (65384/103784), 189.89 MiB | 31.19 MiB/s
Receiving objects: 63% (66190/103784), 222.04 MiB | 31.50 MiB/s
Receiving objects: 64% (66422/103784), 237.99 MiB | 31.65 MiB/s
Receiving objects: 64% (67189/103784), 237.99 MiB | 31.65 MiB/s
Receiving objects: 64% (67258/103784), 269.69 MiB | 31.37 MiB/s
Receiving objects: 64% (67351/103784), 317.35 MiB | 31.62 MiB/s
Receiving objects: 65% (67460/103784), 317.35 MiB | 31.62 MiB/s
Receiving objects: 66% (68498/103784), 333.33 MiB | 31.68 MiB/s
Receiving objects: 67% (69536/103784), 333.33 MiB | 31.68 MiB/s
Receiving objects: 67% (69795/103784), 333.33 MiB | 31.68 MiB/s
Receiving objects: 68% (70574/103784), 333.33 MiB | 31.68 MiB/s
Receiving objects: 69% (71611/103784), 333.33 MiB | 31.68 MiB/s
Receiving objects: 70% (72649/103784), 349.26 MiB | 31.65 MiB/s
Receiving objects: 71% (73687/103784), 349.26 MiB | 31.65 MiB/s
Receiving objects: 72% (74725/103784), 349.26 MiB | 31.65 MiB/s
Receiving objects: 73% (75763/103784), 365.25 MiB | 31.63 MiB/s
Receiving objects: 74% (76801/103784), 365.25 MiB | 31.63 MiB/s
Receiving objects: 75% (77838/103784), 365.25 MiB | 31.63 MiB/s
Receiving objects: 76% (78876/103784), 365.25 MiB | 31.63 MiB/s
Receiving objects: 77% (79914/103784), 365.25 MiB | 31.63 MiB/s
Receiving objects: 78% (80952/103784), 365.25 MiB | 31.63 MiB/s
Receiving objects: 79% (81990/103784), 365.25 MiB | 31.63 MiB/s
Receiving objects: 80% (83028/103784), 365.25 MiB | 31.63 MiB/s
Receiving objects: 81% (84066/103784), 365.25 MiB | 31.63 MiB/s
Receiving objects: 81% (84276/103784), 365.25 MiB | 31.63 MiB/s
Receiving objects: 82% (85103/103784), 365.25 MiB | 31.63 MiB/s
Receiving objects: 83% (86141/103784), 382.02 MiB | 31.81 MiB/s
Receiving objects: 84% (87179/103784), 397.89 MiB | 31.55 MiB/s
Receiving objects: 84% (87357/103784), 397.89 MiB | 31.55 MiB/s
Receiving objects: 85% (88217/103784), 397.89 MiB | 31.55 MiB/s
Receiving objects: 86% (89255/103784), 397.89 MiB | 31.55 MiB/s
Receiving objects: 87% (90293/103784), 414.00 MiB | 31.86 MiB/s
Receiving objects: 88% (91330/103784), 414.00 MiB | 31.86 MiB/s
Receiving objects: 89% (92368/103784), 414.00 MiB | 31.86 MiB/s
Receiving objects: 90% (93406/103784), 414.00 MiB | 31.86 MiB/s
Receiving objects: 91% (94444/103784), 429.96 MiB | 31.80 MiB/s
Receiving objects: 92% (95482/103784), 429.96 MiB | 31.80 MiB/s
Receiving objects: 93% (96520/103784), 429.96 MiB | 31.80 MiB/s
Receiving objects: 94% (97557/103784), 429.96 MiB | 31.80 MiB/s
Receiving objects: 95% (98595/103784), 429.96 MiB | 31.80 MiB/s
Receiving objects: 96% (99633/103784), 429.96 MiB | 31.80 MiB/s
Receiving objects: 97% (100671/103784), 429.96 MiB | 31.80 MiB/s
Receiving objects: 98% (101709/103784), 429.96 MiB | 31.80 MiB/s
Receiving objects: 99% (102747/103784), 429.96 MiB | 31.80 MiB/s
remote: Total 103784 (delta 8180), reused 7483 (delta 7414), pack-reused 94333 (from 4)
17.00 s
Receiving objects: 100% (103784/103784), 429.96 MiB | 31.80 MiB/s
Receiving objects: 100% (103784/103784), 439.18 MiB | 31.47 MiB/s, done.
19.25 s
Resolving deltas: 0% (0/67929)
Resolving deltas: 1% (681/67929)
Resolving deltas: 2% (1359/67929)
Resolving deltas: 3% (2041/67929)
Resolving deltas: 4% (2718/67929)
Resolving deltas: 5% (3397/67929)
Resolving deltas: 6% (4076/67929)
Resolving deltas: 7% (4756/67929)
Resolving deltas: 8% (5435/67929)
Resolving deltas: 9% (6114/67929)
Resolving deltas: 10% (6793/67929)
Resolving deltas: 11% (7473/67929)
Resolving deltas: 12% (8152/67929)
Resolving deltas: 13% (8831/67929)
Resolving deltas: 14% (9511/67929)
Resolving deltas: 15% (10190/67929)
Resolving deltas: 16% (10869/67929)
Resolving deltas: 17% (11548/67929)
Resolving deltas: 18% (12228/67929)
Resolving deltas: 19% (12907/67929)
Resolving deltas: 20% (13586/67929)
Resolving deltas: 21% (14266/67929)
Resolving deltas: 22% (14945/67929)
Resolving deltas: 23% (15626/67929)
Resolving deltas: 24% (16303/67929)
Resolving deltas: 25% (16983/67929)
Resolving deltas: 26% (17663/67929)
Resolving deltas: 27% (18341/67929)
Resolving deltas: 28% (19021/67929)
Resolving deltas: 29% (19700/67929)
Resolving deltas: 30% (20379/67929)
Resolving deltas: 31% (21059/67929)
Resolving deltas: 32% (21738/67929)
Resolving deltas: 33% (22417/67929)
Resolving deltas: 34% (23096/67929)
Resolving deltas: 35% (23777/67929)
Resolving deltas: 36% (24455/67929)
Resolving deltas: 37% (25134/67929)
Resolving deltas: 38% (25814/67929)
Resolving deltas: 39% (26493/67929)
Resolving deltas: 40% (27173/67929)
Resolving deltas: 41% (27851/67929)
Resolving deltas: 42% (28533/67929)
Resolving deltas: 43% (29210/67929)
Resolving deltas: 44% (29889/67929)
Resolving deltas: 45% (30569/67929)
Resolving deltas: 46% (31249/67929)
Resolving deltas: 47% (31927/67929)
Resolving deltas: 48% (32606/67929)
Resolving deltas: 49% (33286/67929)
Resolving deltas: 50% (33965/67929)
Resolving deltas: 51% (34644/67929)
Resolving deltas: 52% (35324/67929)
Resolving deltas: 53% (36003/67929)
Resolving deltas: 54% (36682/67929)
Resolving deltas: 55% (37361/67929)
Resolving deltas: 56% (38041/67929)
Resolving deltas: 57% (38720/67929)
Resolving deltas: 57% (38967/67929)
Resolving deltas: 58% (39399/67929)
Resolving deltas: 59% (40079/67929)
Resolving deltas: 60% (40759/67929)
Resolving deltas: 61% (41437/67929)
Resolving deltas: 62% (42116/67929)
Resolving deltas: 63% (42796/67929)
Resolving deltas: 64% (43475/67929)
Resolving deltas: 65% (44154/67929)
Resolving deltas: 66% (44834/67929)
Resolving deltas: 67% (45513/67929)
Resolving deltas: 68% (46192/67929)
Resolving deltas: 69% (46872/67929)
Resolving deltas: 70% (47551/67929)
Resolving deltas: 71% (48230/67929)
Resolving deltas: 72% (48909/67929)
Resolving deltas: 73% (49590/67929)
Resolving deltas: 74% (50269/67929)
Resolving deltas: 75% (50947/67929)
Resolving deltas: 76% (51627/67929)
Resolving deltas: 77% (52306/67929)
Resolving deltas: 78% (52986/67929)
Resolving deltas: 79% (53664/67929)
Resolving deltas: 80% (54344/67929)
Resolving deltas: 81% (55023/67929)
Resolving deltas: 82% (55702/67929)
Resolving deltas: 83% (56382/67929)
Resolving deltas: 84% (57061/67929)
Resolving deltas: 85% (57740/67929)
Resolving deltas: 86% (58419/67929)
Resolving deltas: 86% (58602/67929)
Resolving deltas: 87% (59099/67929)
Resolving deltas: 88% (59778/67929)
Resolving deltas: 89% (60457/67929)
Resolving deltas: 90% (61137/67929)
Resolving deltas: 91% (61816/67929)
Resolving deltas: 92% (62495/67929)
Resolving deltas: 93% (63174/67929)
Resolving deltas: 94% (63854/67929)
Resolving deltas: 95% (64533/67929)
Resolving deltas: 96% (65212/67929)
Resolving deltas: 97% (65892/67929)
Resolving deltas: 98% (66571/67929)
Resolving deltas: 99% (67250/67929)
Resolving deltas: 100% (67929/67929)
Resolving deltas: 100% (67929/67929), done.
20.07 s
Fetching commit 58aaf5380023d118a91aa4083c01395586246f14 for feynkit ...
20.07 s
$ /nix/store/5vpcfsdx1lcnlb2y4k7xyc74shp5qwbh-git-2.54.0/bin/git fetch origin 58aaf5380023d118a91aa4083c01395586246f14
20.58 s
From https://github.com/alphal00p/gammaloop
20.58 s
* branch 58aaf5380023d118a91aa4083c01395586246f14 -> FETCH_HEAD
20.63 s
$ /nix/store/61685rbaxmpigwi3z23i33sv3jyfl70q-coreutils-9.11/bin/timeout --kill-after=15s 7200s /nix/store/5vpcfsdx1lcnlb2y4k7xyc74shp5qwbh-git-2.54.0/bin/git -c advice.detachedHead=false checkout 58aaf5380023d118a91aa4083c01395586246f14
20.94 s
HEAD is now at 58aaf5380 share physics layout across graph renderers
20.95 s
$ /nix/store/61685rbaxmpigwi3z23i33sv3jyfl70q-coreutils-9.11/bin/timeout --kill-after=15s 7200s /nix/store/wknkybkzrc16r11vk5vrykh4wmw7a353-nix-2.34.8/bin/nix --extra-experimental-features nix-command --extra-experimental-features flakes --log-format internal-json run .#packages.x86_64-linux.nix-ci-check-gammaloop-nextest-feynkit --print-build-logs
21.26 s
warning: ignoring untrusted flake configuration setting 'extra-substituters'.
21.26 s
Pass '--accept-flake-config' to trust it
21.26 s
warning: ignoring untrusted flake configuration setting 'extra-trusted-public-keys'.
21.26 s
Pass '--accept-flake-config' to trust it
26.63 s
26.83 s
Building /nix/store/k2131kp925nkn7pljm9zk00mvv88ifcw-nix-ci-check-gammaloop-nextest-feynkit.drv
26.83 s
[nix-ci-check-gammaloop-nextest-feynkit] structuredAttrs is enabled
26.88 s
[nix-ci-check-gammaloop-nextest-feynkit:post-build] Uploading to the NixCI cache: /nix/store/9whvyhaqjmw60f8n9fjl9ygwa3c59ngm-nix-ci-check-gammaloop-nextest-feynkit
26.92 s
[nix-ci-check-gammaloop-nextest-feynkit:post-build] warning: 'warn-short-path-literals' is deprecated, use 'lint-short-path-literals = ignore' instead
26.93 s
[nix-ci-check-gammaloop-nextest-feynkit:post-build] copying 1 paths...
26.93 s
[nix-ci-check-gammaloop-nextest-feynkit:post-build] copying path '/nix/store/9whvyhaqjmw60f8n9fjl9ygwa3c59ngm-nix-ci-check-gammaloop-nextest-feynkit' to 'https://cache.nix-ci.com'...
27.12 s
[nix-ci-check-gammaloop-nextest-feynkit:post-build] warning: 'warn-short-path-literals' is deprecated, use 'lint-short-path-literals = ignore' instead
27.24 s
[nix-ci-check-gammaloop-nextest-feynkit:post-build] copying 0 paths...
27.27 s
Uploaded nix-ci-check-gammaloop-nextest-feynkit in 401ms
27.27 s
Progress: 1 of 2 built
27.27 s
Built nix-ci-check-gammaloop-nextest-feynkit in 442ms
27.27 s
Progress: 2 of 2 built
27.38 s
do you want to allow configuration setting 'extra-substituters' to be set to 'https://cache.nix-ci.com ' (y/N)? do you want to permanently mark this value as untrusted (y/N)? warning: ignoring untrusted flake configuration setting 'extra-substituters'.
27.38 s
Pass '--accept-flake-config' to trust it
27.38 s
evaluating derivation 'gdo you want to allow configuration setting 'extra-trusted-public-keys' to be set to 'nix-ci:g3xV5BDTLtIBZr/A00IU1x0EtKKlb7YLgBN2SgYgM6A= ' (y/N)? do you want to permanently mark this value as untrusted (y/N)? warning: ignoring untrusted flake configuration setting 'extra-trusted-public-keys'.
27.38 s
Pass '--accept-flake-config' to trust it
32.91 s
copying '/nix/store/566x
evaluating derivation 'g
copying '/nix/store/566x
evaluating derivation 'g
copying '/nix/store/566x
evaluating derivation 'g
copying '/nix/store/566x
evaluating derivation 'g
querying gammaloop-nexte
[0 /7 built, 0.0 KiB DL]
[0 /1 built, 0.0 KiB DL]
[1 /0 /1 built, 0.0 KiB DLgammaloop-nextest-feynkit> Extracting 1 binary and 2 linked paths to /build/source
32.98 s
gammaloop-nextest-feynkit> Extracted 15 files to /build/source in 0.07s
32.99 s
gammaloop-nextest-feynkit> ------------
32.99 s
gammaloop-nextest-feynkit> Nextest run ID 0b273f05-35c0-4d60-8d6a-fb765ba19796 with nextest profile: ci_gammaloop
32.99 s
gammaloop-nextest-feynkit> Starting 1 test across 1 binary
32.99 s
gammaloop-nextest-feynkit> ------------
32.99 s
gammaloop-nextest-feynkit> Summary [ 0.005s] 1 test run: 1 passed , 0 skipped
33.03 s
gammaloop-nextest-feynkit>
33.03 s
gammaloop-nextest-feynkit> ========== nextest test summary ==========
33.03 s
gammaloop-nextest-feynkit> report: target/nextest/ci_gammaloop/junit.xml
33.03 s
gammaloop-nextest-feynkit> tests: 1, failures: 0, errors: 0
33.03 s
gammaloop-nextest-feynkit> No failing testcases found.
33.03 s
gammaloop-nextest-feynkit> =========================================
33.04 s
gammaloop-nextest-feynkit> Extracting 1 binary and 2 linked paths to /build/source
33.12 s
gammaloop-nextest-feynkit> Extracted 15 files to /build/source in 0.08s
33.13 s
gammaloop-nextest-feynkit> ------------
33.13 s
gammaloop-nextest-feynkit> Nextest run ID 5a1b519a-a807-4cdd-a381-276069d229f8 with nextest profile: ci_gammaloop
33.13 s
gammaloop-nextest-feynkit> Starting 33 tests across 1 binary
33.15 s
gammaloop-nextest-feynkit> ------------
33.15 s
gammaloop-nextest-feynkit> Summary [ 0.019s] 33 tests run: 33 passed , 0 skipped
33.18 s
gammaloop-nextest-feynkit>
33.18 s
gammaloop-nextest-feynkit> ========== nextest test summary ==========
33.18 s
gammaloop-nextest-feynkit> report: target/nextest/ci_gammaloop/junit.xml
33.18 s
gammaloop-nextest-feynkit> tests: 33, failures: 0, errors: 0
33.18 s
gammaloop-nextest-feynkit> No failing testcases found.
33.18 s
gammaloop-nextest-feynkit> =========================================
33.19 s
gammaloop-nextest-feynkit> Extracting 2 binaries and 2 linked paths to /build/source
33.34 s
gammaloop-nextest-feynkit> Extracted 16 files to /build/source in 0.14s
33.35 s
gammaloop-nextest-feynkit> ------------
33.35 s
gammaloop-nextest-feynkit> Nextest run ID 11be661a-19e4-4d81-8952-364e0fc61faf with nextest profile: ci_gammaloop
33.35 s
gammaloop-nextest-feynkit> Starting 60 tests across 2 binaries
33.40 s
gammaloop-nextest-feynkit> ------------
33.40 s
gammaloop-nextest-feynkit> Summary [ 0.059s] 60 tests run: 60 passed , 0 skipped
33.44 s
gammaloop-nextest-feynkit>
33.44 s
gammaloop-nextest-feynkit> ========== nextest test summary ==========
33.44 s
gammaloop-nextest-feynkit> report: target/nextest/ci_gammaloop/junit.xml
33.44 s
gammaloop-nextest-feynkit> tests: 60, failures: 0, errors: 0
33.44 s
gammaloop-nextest-feynkit> No failing testcases found.
33.44 s
gammaloop-nextest-feynkit> =========================================
33.45 s
gammaloop-nextest-feynkit> Extracting 1 binary and 2 linked paths to /build/source
33.54 s
gammaloop-nextest-feynkit> Extracted 15 files to /build/source in 0.09s
33.55 s
gammaloop-nextest-feynkit> ------------
33.55 s
gammaloop-nextest-feynkit> Nextest run ID 3f635c6c-bfdb-4226-aa08-fa5c0560b390 with nextest profile: ci_gammaloop
33.55 s
gammaloop-nextest-feynkit> Starting 28 tests across 1 binary
33.57 s
gammaloop-nextest-feynkit> ------------
33.57 s
gammaloop-nextest-feynkit> Summary [ 0.021s] 28 tests run: 28 passed , 0 skipped
33.60 s
gammaloop-nextest-feynkit>
33.60 s
gammaloop-nextest-feynkit> ========== nextest test summary ==========
33.60 s
gammaloop-nextest-feynkit> report: target/nextest/ci_gammaloop/junit.xml
33.60 s
gammaloop-nextest-feynkit> tests: 28, failures: 0, errors: 0
33.60 s
gammaloop-nextest-feynkit> No failing testcases found.
33.60 s
gammaloop-nextest-feynkit> =========================================
33.61 s
gammaloop-nextest-feynkit> Extracting 1 binary and 1 linked path to /build/source
33.69 s
gammaloop-nextest-feynkit> Extracted 7 files to /build/source in 0.08s
33.70 s
gammaloop-nextest-feynkit> ------------
33.70 s
gammaloop-nextest-feynkit> Nextest run ID c58f4975-8ed5-4c66-8abd-6a24e4e4da77 with nextest profile: ci_gammaloop
33.70 s
gammaloop-nextest-feynkit> Starting 21 tests across 1 binary
33.71 s
gammaloop-nextest-feynkit> ------------
33.71 s
gammaloop-nextest-feynkit> Summary [ 0.012s] 21 tests run: 21 passed , 0 skipped
33.74 s
gammaloop-nextest-feynkit>
33.74 s
gammaloop-nextest-feynkit> ========== nextest test summary ==========
33.74 s
gammaloop-nextest-feynkit> report: target/nextest/ci_gammaloop/junit.xml
33.74 s
gammaloop-nextest-feynkit> tests: 21, failures: 0, errors: 0
33.74 s
gammaloop-nextest-feynkit> No failing testcases found.
33.74 s
gammaloop-nextest-feynkit> =========================================
33.76 s
gammaloop-nextest-feynkit> Extracting 2 binaries and 2 linked paths to /build/source
33.87 s
gammaloop-nextest-feynkit> Extracted 16 files to /build/source in 0.12s
33.88 s
gammaloop-nextest-feynkit> ------------
33.88 s
gammaloop-nextest-feynkit> Nextest run ID 06951d23-39c9-4356-8059-579fb4ac9063 with nextest profile: ci_gammaloop
33.88 s
gammaloop-nextest-feynkit> Starting 14 tests across 2 binaries
33.89 s
gammaloop-nextest-feynkit> ------------
33.89 s
gammaloop-nextest-feynkit> Summary [ 0.010s] 14 tests run: 14 passed , 0 skipped
33.93 s
gammaloop-nextest-feynkit>
33.93 s
gammaloop-nextest-feynkit> ========== nextest test summary ==========
33.93 s
gammaloop-nextest-feynkit> report: target/nextest/ci_gammaloop/junit.xml
33.93 s
gammaloop-nextest-feynkit> tests: 14, failures: 0, errors: 0
33.93 s
gammaloop-nextest-feynkit> No failing testcases found.
33.93 s
gammaloop-nextest-feynkit> =========================================
33.94 s
gammaloop-nextest-feynkit> Extracting 5 binaries (including 3 non-test binaries) and 2 linked paths to /build/source
34.53 s
gammaloop-nextest-feynkit> Extracted 22 files to /build/source in 0.59s
34.54 s
gammaloop-nextest-feynkit> ------------
34.54 s
gammaloop-nextest-feynkit> Nextest run ID 354d3050-bbd8-4cd2-9228-ef8e32782625 with nextest profile: ci_gammaloop
34.54 s
gammaloop-nextest-feynkit> Starting 15 tests across 2 binaries
34.61 s
gammaloop-nextest-feynkit> FAIL [ 0.070s] (10/15) feynkit-py tests :: standalone_python_pipeline_covers_generation_graphs_cff_and_kinematics
34.61 s
gammaloop-nextest-feynkit> stdout ---
34.61 s
gammaloop-nextest-feynkit>
34.61 s
gammaloop-nextest-feynkit> running 1 test
34.61 s
gammaloop-nextest-feynkit> test tests::standalone_python_pipeline_covers_generation_graphs_cff_and_kinematics ... FAILED
34.61 s
gammaloop-nextest-feynkit>
34.61 s
gammaloop-nextest-feynkit> failures:
34.61 s
gammaloop-nextest-feynkit>
34.61 s
gammaloop-nextest-feynkit> failures:
34.61 s
gammaloop-nextest-feynkit> tests::standalone_python_pipeline_covers_generation_graphs_cff_and_kinematics
34.61 s
gammaloop-nextest-feynkit>
34.61 s
gammaloop-nextest-feynkit> test result: FAILED. 0 passed; 1 failed; 0 ignored; 0 measured; 13 filtered out; finished in 0.06s
34.61 s
gammaloop-nextest-feynkit>
34.61 s
gammaloop-nextest-feynkit> stderr ---
34.61 s
gammaloop-nextest-feynkit>
34.61 s
gammaloop-nextest-feynkit> thread 'tests::standalone_python_pipeline_covers_generation_graphs_cff_and_kinematics' (914) panicked at crates/feynkit-py/src/lib.rs:453:57:
34.61 s
gammaloop-nextest-feynkit> called `Result::unwrap()` on an `Err` value: PyErr { type: <class 'AssertionError'>, value: AssertionError(), traceback: Some("Traceback (most recent call last):\n File \"<string>\", line 39, in <module>\n") }
34.61 s
gammaloop-nextest-feynkit> stack backtrace:
34.61 s
gammaloop-nextest-feynkit> 0: __rustc::rust_begin_unwind
34.61 s
gammaloop-nextest-feynkit> 1: core::panicking::panic_fmt
34.61 s
gammaloop-nextest-feynkit> 2: core::result::unwrap_failed
34.61 s
gammaloop-nextest-feynkit> 3: feynkit_py::tests::standalone_python_pipeline_covers_generation_graphs_cff_and_kinematics
34.61 s
gammaloop-nextest-feynkit> 4: <feynkit_py::tests::standalone_python_pipeline_covers_generation_graphs_cff_and_kinematics::{closure#0} as core::ops::function::FnOnce<()>>::call_once
34.61 s
gammaloop-nextest-feynkit> note: Some details are omitted, run with `RUST_BACKTRACE=full` for a verbose backtrace.
34.61 s
gammaloop-nextest-feynkit>
35.19 s
gammaloop-nextest-feynkit> ------------
35.19 s
gammaloop-nextest-feynkit> Summary [ 0.656s] 15 tests run: 14 passed , 1 failed , 0 skipped
35.19 s
gammaloop-nextest-feynkit> FAIL [ 0.070s] (10/15) feynkit-py tests :: standalone_python_pipeline_covers_generation_graphs_cff_and_kinematics
35.19 s
gammaloop-nextest-feynkit> stdout ---
35.19 s
gammaloop-nextest-feynkit>
35.19 s
gammaloop-nextest-feynkit> running 1 test
35.19 s
gammaloop-nextest-feynkit> test tests::standalone_python_pipeline_covers_generation_graphs_cff_and_kinematics ... FAILED
35.19 s
gammaloop-nextest-feynkit>
35.19 s
gammaloop-nextest-feynkit> failures:
35.19 s
gammaloop-nextest-feynkit>
35.19 s
gammaloop-nextest-feynkit> failures:
35.19 s
gammaloop-nextest-feynkit> tests::standalone_python_pipeline_covers_generation_graphs_cff_and_kinematics
35.19 s
gammaloop-nextest-feynkit>
35.19 s
gammaloop-nextest-feynkit> test result: FAILED. 0 passed; 1 failed; 0 ignored; 0 measured; 13 filtered out; finished in 0.06s
35.19 s
gammaloop-nextest-feynkit>
35.19 s
gammaloop-nextest-feynkit> stderr ---
35.19 s
gammaloop-nextest-feynkit>
35.19 s
gammaloop-nextest-feynkit> thread 'tests::standalone_python_pipeline_covers_generation_graphs_cff_and_kinematics' (914) panicked at crates/feynkit-py/src/lib.rs:453:57:
35.19 s
gammaloop-nextest-feynkit> called `Result::unwrap()` on an `Err` value: PyErr { type: <class 'AssertionError'>, value: AssertionError(), traceback: Some("Traceback (most recent call last):\n File \"<string>\", line 39, in <module>\n") }
35.19 s
gammaloop-nextest-feynkit> stack backtrace:
35.19 s
gammaloop-nextest-feynkit> 0: __rustc::rust_begin_unwind
35.19 s
gammaloop-nextest-feynkit> 1: core::panicking::panic_fmt
35.19 s
gammaloop-nextest-feynkit> 2: core::result::unwrap_failed
35.19 s
gammaloop-nextest-feynkit> 3: feynkit_py::tests::standalone_python_pipeline_covers_generation_graphs_cff_and_kinematics
35.19 s
gammaloop-nextest-feynkit> 4: <feynkit_py::tests::standalone_python_pipeline_covers_generation_graphs_cff_and_kinematics::{closure#0} as core::ops::function::FnOnce<()>>::call_once
35.19 s
gammaloop-nextest-feynkit> note: Some details are omitted, run with `RUST_BACKTRACE=full` for a verbose backtrace.
35.19 s
gammaloop-nextest-feynkit>
35.20 s
gammaloop-nextest-feynkit> error : test run failed
35.22 s
gammaloop-nextest-feynkit>
35.22 s
gammaloop-nextest-feynkit> ========== nextest test summary ==========
35.22 s
gammaloop-nextest-feynkit> report: target/nextest/ci_gammaloop/junit.xml
35.22 s
gammaloop-nextest-feynkit> tests: 15, failures: 1, errors: 0
35.22 s
gammaloop-nextest-feynkit>
35.22 s
gammaloop-nextest-feynkit> 1. feynkit-py::tests::standalone_python_pipeline_covers_generation_graphs_cff_and_kinematics
35.22 s
gammaloop-nextest-feynkit> failure: test failure with exit code 101
35.22 s
gammaloop-nextest-feynkit> thread 'tests::standalone_python_pipeline_covers_generation_graphs_cff_and_kinematics' (914) panicked at crates/feynkit-py/src/lib.rs:453:57:
35.22 s
gammaloop-nextest-feynkit> called `Result::unwrap()` on an `Err` value: PyErr { type: <class 'AssertionError'>, value: AssertionError(), traceback: Some("Traceback (most recent call last):\n File \"<string>\", line 39, in <module>\n") }
35.22 s
gammaloop-nextest-feynkit> stack backtrace:
35.22 s
gammaloop-nextest-feynkit> 0: __rustc::rust_begin_unwind
35.22 s
gammaloop-nextest-feynkit> 1: core::panicking::panic_fmt
35.22 s
gammaloop-nextest-feynkit> 2: core::result::unwrap_failed
35.22 s
gammaloop-nextest-feynkit> 3: feynkit_py::tests::standalone_python_pipeline_covers_generation_graphs_cff_and_kinematics
35.22 s
gammaloop-nextest-feynkit> 4: <feynkit_py::tests::standalone_python_pipeline_covers_generation_graphs_cff_and_kinematics::{closure#0} as core::ops::function::FnOnce<()>>::call_once
35.22 s
gammaloop-nextest-feynkit> note: Some details are omitted, run with `RUST_BACKTRACE=full` for a verbose backtrace.
35.22 s
gammaloop-nextest-feynkit> system-out
35.22 s
gammaloop-nextest-feynkit> running 1 test
35.22 s
gammaloop-nextest-feynkit> test tests::standalone_python_pipeline_covers_generation_graphs_cff_and_kinematics ... FAILED
35.22 s
gammaloop-nextest-feynkit>
35.22 s
gammaloop-nextest-feynkit> failures:
35.22 s
gammaloop-nextest-feynkit>
35.22 s
gammaloop-nextest-feynkit> failures:
35.22 s
gammaloop-nextest-feynkit> tests::standalone_python_pipeline_covers_generation_graphs_cff_and_kinematics
35.22 s
gammaloop-nextest-feynkit>
35.22 s
gammaloop-nextest-feynkit> test result: FAILED. 0 passed; 1 failed; 0 ignored; 0 measured; 13 filtered out; finished in 0.06s
35.22 s
gammaloop-nextest-feynkit> system-err
35.22 s
gammaloop-nextest-feynkit> thread 'tests::standalone_python_pipeline_covers_generation_graphs_cff_and_kinematics' (914) panicked at crates/feynkit-py/src/lib.rs:453:57:
35.22 s
gammaloop-nextest-feynkit> called `Result::unwrap()` on an `Err` value: PyErr { type: <class 'AssertionError'>, value: AssertionError(), traceback: Some("Traceback (most recent call last):\n File \"<string>\", line 39, in <module>\n") }
35.22 s
gammaloop-nextest-feynkit> stack backtrace:
35.22 s
gammaloop-nextest-feynkit> 0: __rustc::rust_begin_unwind
35.22 s
gammaloop-nextest-feynkit> 1: core::panicking::panic_fmt
35.22 s
gammaloop-nextest-feynkit> 2: core::result::unwrap_failed
35.22 s
gammaloop-nextest-feynkit> 3: feynkit_py::tests::standalone_python_pipeline_covers_generation_graphs_cff_and_kinematics
35.22 s
gammaloop-nextest-feynkit> 4: <feynkit_py::tests::standalone_python_pipeline_covers_generation_graphs_cff_and_kinematics::{closure#0} as core::ops::function::FnOnce<()>>::call_once
35.22 s
gammaloop-nextest-feynkit> note: Some details are omitted, run with `RUST_BACKTRACE=full` for a verbose backtrace.
35.22 s
gammaloop-nextest-feynkit> =========================================
35.24 s
gammaloop-nextest-feynkit> Extracting 1 binary and 2 linked paths to /build/source
35.33 s
gammaloop-nextest-feynkit> Extracted 15 files to /build/source in 0.10s
35.34 s
gammaloop-nextest-feynkit> ------------
35.34 s
gammaloop-nextest-feynkit> Nextest run ID 31fdb88e-b587-4ccb-8e98-e8a211262f5f with nextest profile: ci_gammaloop
35.34 s
gammaloop-nextest-feynkit> Starting 45 tests across 1 binary (1 test skipped )
35.46 s
gammaloop-nextest-feynkit> ------------
35.46 s
gammaloop-nextest-feynkit> Summary [ 0.115s] 45 tests run: 45 passed , 1 skipped
35.49 s
gammaloop-nextest-feynkit>
35.49 s
gammaloop-nextest-feynkit> ========== nextest test summary ==========
35.49 s
gammaloop-nextest-feynkit> report: target/nextest/ci_gammaloop/junit.xml
35.49 s
gammaloop-nextest-feynkit> tests: 45, failures: 0, errors: 0
35.49 s
gammaloop-nextest-feynkit> No failing testcases found.
35.49 s
gammaloop-nextest-feynkit> =========================================
35.51 s
gammaloop-nextest-feynkit> Extracting 1 binary and 2 linked paths to /build/source
35.58 s
gammaloop-nextest-feynkit> Extracted 15 files to /build/source in 0.08s
35.59 s
gammaloop-nextest-feynkit> ------------
35.59 s
gammaloop-nextest-feynkit> Nextest run ID e6404ed3-5330-4ab2-92d0-ac3313ae36d0 with nextest profile: ci_gammaloop
35.59 s
gammaloop-nextest-feynkit> Starting 2 tests across 1 binary
35.61 s
gammaloop-nextest-feynkit> ------------
35.61 s
gammaloop-nextest-feynkit> Summary [ 0.017s] 2 tests run: 2 passed , 0 skipped
35.64 s
gammaloop-nextest-feynkit>
35.64 s
gammaloop-nextest-feynkit> ========== nextest test summary ==========
35.64 s
gammaloop-nextest-feynkit> report: target/nextest/ci_gammaloop/junit.xml
35.64 s
gammaloop-nextest-feynkit> tests: 2, failures: 0, errors: 0
35.64 s
gammaloop-nextest-feynkit> No failing testcases found.
35.64 s
gammaloop-nextest-feynkit> =========================================
35.80 s
error: Cannot build '/nix/store/acmsl3435cimydvkpsrj08bxpi3x96x8-gammaloop-nextest-feynkit.drv '.
35.80 s
Reason: builder failed with exit code 100 .
35.80 s
Output paths:
35.80 s
/nix/store/9asrzfa1rdhbcl808xwycrqj0kbiiqr1-gammaloop-nextest-feynkit
35.80 s
Last 199 log lines:
35.80 s
> Extracting 1 binary and 2 linked paths to /build/source
35.80 s
> Extracted 15 files to /build/source in 0.07s
35.80 s
> ------------
35.80 s
> Nextest run ID 0b273f05-35c0-4d60-8d6a-fb765ba19796 with nextest profile: ci_gammaloop
35.80 s
> Starting 1 test across 1 binary
35.80 s
> ------------
35.80 s
> Summary [ 0.005s] 1 test run: 1 passed , 0 skipped
35.80 s
>
35.80 s
> ========== nextest test summary ==========
35.80 s
> report: target/nextest/ci_gammaloop/junit.xml
35.80 s
> tests: 1, failures: 0, errors: 0
35.80 s
> No failing testcases found.
35.80 s
> =========================================
35.80 s
> Extracting 1 binary and 2 linked paths to /build/source
35.80 s
> Extracted 15 files to /build/source in 0.08s
35.80 s
> ------------
35.80 s
> Nextest run ID 5a1b519a-a807-4cdd-a381-276069d229f8 with nextest profile: ci_gammaloop
35.80 s
> Starting 33 tests across 1 binary
35.80 s
> ------------
35.80 s
> Summary [ 0.019s] 33 tests run: 33 passed , 0 skipped
35.80 s
>
35.80 s
> ========== nextest test summary ==========
35.80 s
> report: target/nextest/ci_gammaloop/junit.xml
35.80 s
> tests: 33, failures: 0, errors: 0
35.80 s
> No failing testcases found.
35.80 s
> =========================================
35.80 s
> Extracting 2 binaries and 2 linked paths to /build/source
35.80 s
> Extracted 16 files to /build/source in 0.14s
35.80 s
> ------------
35.80 s
> Nextest run ID 11be661a-19e4-4d81-8952-364e0fc61faf with nextest profile: ci_gammaloop
35.80 s
> Starting 60 tests across 2 binaries
35.80 s
> ------------
35.80 s
> Summary [ 0.059s] 60 tests run: 60 passed , 0 skipped
35.80 s
>
35.80 s
> ========== nextest test summary ==========
35.80 s
> report: target/nextest/ci_gammaloop/junit.xml
35.80 s
> tests: 60, failures: 0, errors: 0
35.80 s
> No failing testcases found.
35.80 s
> =========================================
35.80 s
> Extracting 1 binary and 2 linked paths to /build/source
35.80 s
> Extracted 15 files to /build/source in 0.09s
35.80 s
> ------------
35.80 s
> Nextest run ID 3f635c6c-bfdb-4226-aa08-fa5c0560b390 with nextest profile: ci_gammaloop
35.80 s
> Starting 28 tests across 1 binary
35.80 s
> ------------
35.80 s
> Summary [ 0.021s] 28 tests run: 28 passed , 0 skipped
35.80 s
>
35.80 s
> ========== nextest test summary ==========
35.80 s
> report: target/nextest/ci_gammaloop/junit.xml
35.80 s
> tests: 28, failures: 0, errors: 0
35.80 s
> No failing testcases found.
35.80 s
> =========================================
35.80 s
> Extracting 1 binary and 1 linked path to /build/source
35.80 s
> Extracted 7 files to /build/source in 0.08s
35.80 s
> ------------
35.80 s
> Nextest run ID c58f4975-8ed5-4c66-8abd-6a24e4e4da77 with nextest profile: ci_gammaloop
35.80 s
> Starting 21 tests across 1 binary
35.80 s
> ------------
35.80 s
> Summary [ 0.012s] 21 tests run: 21 passed , 0 skipped
35.80 s
>
35.80 s
> ========== nextest test summary ==========
35.80 s
> report: target/nextest/ci_gammaloop/junit.xml
35.80 s
> tests: 21, failures: 0, errors: 0
35.80 s
> No failing testcases found.
35.80 s
> =========================================
35.80 s
> Extracting 2 binaries and 2 linked paths to /build/source
35.80 s
> Extracted 16 files to /build/source in 0.12s
35.80 s
> ------------
35.80 s
> Nextest run ID 06951d23-39c9-4356-8059-579fb4ac9063 with nextest profile: ci_gammaloop
35.80 s
> Starting 14 tests across 2 binaries
35.80 s
> ------------
35.80 s
> Summary [ 0.010s] 14 tests run: 14 passed , 0 skipped
35.80 s
>
35.80 s
> ========== nextest test summary ==========
35.80 s
> report: target/nextest/ci_gammaloop/junit.xml
35.80 s
> tests: 14, failures: 0, errors: 0
35.80 s
> No failing testcases found.
35.80 s
> =========================================
35.80 s
> Extracting 5 binaries (including 3 non-test binaries) and 2 linked paths to /build/source
35.80 s
> Extracted 22 files to /build/source in 0.59s
35.80 s
> ------------
35.80 s
> Nextest run ID 354d3050-bbd8-4cd2-9228-ef8e32782625 with nextest profile: ci_gammaloop
35.80 s
> Starting 15 tests across 2 binaries
35.80 s
> FAIL [ 0.070s] (10/15) feynkit-py tests :: standalone_python_pipeline_covers_generation_graphs_cff_and_kinematics
35.80 s
> stdout ---
35.80 s
>
35.80 s
> running 1 test
35.80 s
> test tests::standalone_python_pipeline_covers_generation_graphs_cff_and_kinematics ... FAILED
35.80 s
>
35.80 s
> failures:
35.80 s
>
35.80 s
> failures:
35.80 s
> tests::standalone_python_pipeline_covers_generation_graphs_cff_and_kinematics
35.80 s
>
35.80 s
> test result: FAILED. 0 passed; 1 failed; 0 ignored; 0 measured; 13 filtered out; finished in 0.06s
35.80 s
>
35.80 s
> stderr ---
35.80 s
>
35.80 s
> thread 'tests::standalone_python_pipeline_covers_generation_graphs_cff_and_kinematics' (914) panicked at crates/feynkit-py/src/lib.rs:453:57:
35.80 s
> called `Result::unwrap()` on an `Err` value: PyErr { type: <class 'AssertionError'>, value: AssertionError(), traceback: Some("Traceback (most recent call last):\n File \"<string>\", line 39, in <module>\n") }
35.80 s
> stack backtrace:
35.80 s
> 0: __rustc::rust_begin_unwind
35.80 s
> 1: core::panicking::panic_fmt
35.80 s
> 2: core::result::unwrap_failed
35.80 s
> 3: feynkit_py::tests::standalone_python_pipeline_covers_generation_graphs_cff_and_kinematics
35.80 s
> 4: <feynkit_py::tests::standalone_python_pipeline_covers_generation_graphs_cff_and_kinematics::{closure#0} as core::ops::function::FnOnce<()>>::call_once
35.80 s
> note: Some details are omitted, run with `RUST_BACKTRACE=full` for a verbose backtrace.
35.80 s
>
35.80 s
> ------------
35.80 s
> Summary [ 0.656s] 15 tests run: 14 passed , 1 failed , 0 skipped
35.80 s
> FAIL [ 0.070s] (10/15) feynkit-py tests :: standalone_python_pipeline_covers_generation_graphs_cff_and_kinematics
35.80 s
> stdout ---
35.80 s
>
35.80 s
> running 1 test
35.80 s
> test tests::standalone_python_pipeline_covers_generation_graphs_cff_and_kinematics ... FAILED
35.80 s
>
35.80 s
> failures:
35.80 s
>
35.80 s
> failures:
35.80 s
> tests::standalone_python_pipeline_covers_generation_graphs_cff_and_kinematics
35.80 s
>
35.80 s
> test result: FAILED. 0 passed; 1 failed; 0 ignored; 0 measured; 13 filtered out; finished in 0.06s
35.80 s
>
35.80 s
> stderr ---
35.80 s
>
35.80 s
> thread 'tests::standalone_python_pipeline_covers_generation_graphs_cff_and_kinematics' (914) panicked at crates/feynkit-py/src/lib.rs:453:57:
35.80 s
> called `Result::unwrap()` on an `Err` value: PyErr { type: <class 'AssertionError'>, value: AssertionError(), traceback: Some("Traceback (most recent call last):\n File \"<string>\", line 39, in <module>\n") }
35.80 s
> stack backtrace:
35.80 s
> 0: __rustc::rust_begin_unwind
35.80 s
> 1: core::panicking::panic_fmt
35.80 s
> 2: core::result::unwrap_failed
35.80 s
> 3: feynkit_py::tests::standalone_python_pipeline_covers_generation_graphs_cff_and_kinematics
35.80 s
> 4: <feynkit_py::tests::standalone_python_pipeline_covers_generation_graphs_cff_and_kinematics::{closure#0} as core::ops::function::FnOnce<()>>::call_once
35.80 s
> note: Some details are omitted, run with `RUST_BACKTRACE=full` for a verbose backtrace.
35.80 s
>
35.80 s
> error : test run failed
35.80 s
>
35.80 s
> ========== nextest test summary ==========
35.80 s
> report: target/nextest/ci_gammaloop/junit.xml
35.80 s
> tests: 15, failures: 1, errors: 0
35.80 s
>
35.80 s
> 1. feynkit-py::tests::standalone_python_pipeline_covers_generation_graphs_cff_and_kinematics
35.80 s
> failure: test failure with exit code 101
35.80 s
> thread 'tests::standalone_python_pipeline_covers_generation_graphs_cff_and_kinematics' (914) panicked at crates/feynkit-py/src/lib.rs:453:57:
35.80 s
> called `Result::unwrap()` on an `Err` value: PyErr { type: <class 'AssertionError'>, value: AssertionError(), traceback: Some("Traceback (most recent call last):\n File \"<string>\", line 39, in <module>\n") }
35.80 s
> stack backtrace:
35.80 s
> 0: __rustc::rust_begin_unwind
35.80 s
> 1: core::panicking::panic_fmt
35.80 s
> 2: core::result::unwrap_failed
35.80 s
> 3: feynkit_py::tests::standalone_python_pipeline_covers_generation_graphs_cff_and_kinematics
35.80 s
> 4: <feynkit_py::tests::standalone_python_pipeline_covers_generation_graphs_cff_and_kinematics::{closure#0} as core::ops::function::FnOnce<()>>::call_once
35.80 s
> note: Some details are omitted, run with `RUST_BACKTRACE=full` for a verbose backtrace.
35.80 s
> system-out
35.80 s
> running 1 test
35.80 s
> test tests::standalone_python_pipeline_covers_generation_graphs_cff_and_kinematics ... FAILED
35.80 s
>
35.80 s
> failures:
35.80 s
>
35.80 s
> failures:
35.80 s
> tests::standalone_python_pipeline_covers_generation_graphs_cff_and_kinematics
35.80 s
>
35.80 s
> test result: FAILED. 0 passed; 1 failed; 0 ignored; 0 measured; 13 filtered out; finished in 0.06s
35.80 s
> system-err
35.80 s
> thread 'tests::standalone_python_pipeline_covers_generation_graphs_cff_and_kinematics' (914) panicked at crates/feynkit-py/src/lib.rs:453:57:
35.80 s
> called `Result::unwrap()` on an `Err` value: PyErr { type: <class 'AssertionError'>, value: AssertionError(), traceback: Some("Traceback (most recent call last):\n File \"<string>\", line 39, in <module>\n") }
35.80 s
> stack backtrace:
35.80 s
> 0: __rustc::rust_begin_unwind
35.80 s
> 1: core::panicking::panic_fmt
35.80 s
> 2: core::result::unwrap_failed
35.80 s
> 3: feynkit_py::tests::standalone_python_pipeline_covers_generation_graphs_cff_and_kinematics
35.80 s
> 4: <feynkit_py::tests::standalone_python_pipeline_covers_generation_graphs_cff_and_kinematics::{closure#0} as core::ops::function::FnOnce<()>>::call_once
35.80 s
> note: Some details are omitted, run with `RUST_BACKTRACE=full` for a verbose backtrace.
35.80 s
> =========================================
35.80 s
> Extracting 1 binary and 2 linked paths to /build/source
35.80 s
> Extracted 15 files to /build/source in 0.10s
35.80 s
> ------------
35.80 s
> Nextest run ID 31fdb88e-b587-4ccb-8e98-e8a211262f5f with nextest profile: ci_gammaloop
35.80 s
> Starting 45 tests across 1 binary (1 test skipped )
35.80 s
> ------------
35.80 s
> Summary [ 0.115s] 45 tests run: 45 passed , 1 skipped
35.80 s
>
35.80 s
> ========== nextest test summary ==========
35.80 s
> report: target/nextest/ci_gammaloop/junit.xml
35.80 s
> tests: 45, failures: 0, errors: 0
35.80 s
> No failing testcases found.
35.80 s
> =========================================
35.80 s
> Extracting 1 binary and 2 linked paths to /build/source
35.80 s
> Extracted 15 files to /build/source in 0.08s
35.80 s
> ------------
35.80 s
> Nextest run ID e6404ed3-5330-4ab2-92d0-ac3313ae36d0 with nextest profile: ci_gammaloop
35.80 s
> Starting 2 tests across 1 binary
35.80 s
> ------------
35.80 s
> Summary [ 0.017s] 2 tests run: 2 passed , 0 skipped
35.80 s
>
35.80 s
> ========== nextest test summary ==========
35.80 s
> report: target/nextest/ci_gammaloop/junit.xml
35.80 s
> tests: 2, failures: 0, errors: 0
35.80 s
> No failing testcases found.
35.80 s
> =========================================
35.80 s
For full logs, run:
35.80 s
nix log /nix/store/acmsl3435cimydvkpsrj08bxpi3x96x8-gammaloop-nextest-feynkit.drv
35.97 s
[0 built (1 failed ), 0.0 Run failed.