test packages.x86_64-linux.nix-ci-check-gammaloop-nextest-python-api

Reproduce this run
Original Run
  1. 0.82 s $ /nix/store/9ypz3flqsrl5xl495mm8h645gadjsxi1-coreutils-9.11/bin/timeout --kill-after=15s 7200s /nix/store/23zk8sgzamrbmj1fday15szf7f2279s8-nix-2.34.7/bin/nix --extra-experimental-features nix-command --extra-experimental-features flakes flake clone git+https://github.com/alphal00p/gammaloop --dest /tmp/nix-ci-worker/stable-pwd/repo/
  2. 0.84 s Cloning into '/tmp/nix-ci-worker/stable-pwd/repo'...
  3. 0.84 s remote: Enumerating objects: 65234, done.
  4. 0.84 s remote: Counting objects: 0% (1/7906) remote: Counting objects: 1% (80/7906) remote: Counting objects: 2% (159/7906) remote: Counting objects: 3% (238/7906) remote: Counting objects: 4% (317/7906) remote: Counting objects: 5% (396/7906) remote: Counting objects: 6% (475/7906) remote: Counting objects: 7% (554/7906) remote: Counting objects: 8% (633/7906) remote: Counting objects: 9% (712/7906) remote: Counting objects: 10% (791/7906) remote: Counting objects: 11% (870/7906) remote: Counting objects: 12% (949/7906) remote: Counting objects: 13% (1028/7906) remote: Counting objects: 14% (1107/7906) remote: Counting objects: 15% (1186/7906) remote: Counting objects: 16% (1265/7906) remote: Counting objects: 17% (1345/7906) remote: Counting objects: 18% (1424/7906) remote: Counting objects: 19% (1503/7906) remote: Counting objects: 20% (1582/7906) remote: Counting objects: 21% (1661/7906) remote: Counting objects: 22% (1740/7906) remote: Counting objects: 23% (1819/7906) remote: Counting objects: 24% (1898/7906) remote: Counting objects: 25% (1977/7906) remote: Counting objects: 26% (2056/7906) remote: Counting objects: 27% (2135/7906) remote: Counting objects: 28% (2214/7906) remote: Counting objects: 29% (2293/7906) remote: Counting objects: 30% (2372/7906) remote: Counting objects: 31% (2451/7906) remote: Counting objects: 32% (2530/7906) remote: Counting objects: 33% (2609/7906) remote: Counting objects: 34% (2689/7906) remote: Counting objects: 35% (2768/7906) remote: Counting objects: 36% (2847/7906) remote: Counting objects: 37% (2926/7906) remote: Counting objects: 38% (3005/7906) remote: Counting objects: 39% (3084/7906) remote: Counting objects: 40% (3163/7906) remote: Counting objects: 41% (3242/7906) remote: Counting objects: 42% (3321/7906) remote: Counting objects: 43% (3400/7906) remote: Counting objects: 44% (3479/7906) remote: Counting objects: 45% (3558/7906) remote: Counting objects: 46% (3637/7906) remote: Counting objects: 47% (3716/7906) remote: Counting objects: 48% (3795/7906) remote: Counting objects: 49% (3874/7906) remote: Counting objects: 50% (3953/7906) remote: Counting objects: 51% (4033/7906) remote: Counting objects: 52% (4112/7906) remote: Counting objects: 53% (4191/7906) remote: Counting objects: 54% (4270/7906) remote: Counting objects: 55% (4349/7906) remote: Counting objects: 56% (4428/7906) remote: Counting objects: 57% (4507/7906) remote: Counting objects: 58% (4586/7906) remote: Counting objects: 59% (4665/7906) remote: Counting objects: 60% (4744/7906) remote: Counting objects: 61% (4823/7906) remote: Counting objects: 62% (4902/7906) remote: Counting objects: 63% (4981/7906) remote: Counting objects: 64% (5060/7906) remote: Counting objects: 65% (5139/7906) remote: Counting objects: 66% (5218/7906) remote: Counting objects: 67% (5298/7906) remote: Counting objects: 68% (5377/7906) remote: Counting objects: 69% (5456/7906) remote: Counting objects: 70% (5535/7906) remote: Counting objects: 71% (5614/7906) remote: Counting objects: 72% (5693/7906) remote: Counting objects: 73% (5772/7906) remote: Counting objects: 74% (5851/7906) remote: Counting objects: 75% (5930/7906) remote: Counting objects: 76% (6009/7906) remote: Counting objects: 77% (6088/7906) remote: Counting objects: 78% (6167/7906) remote: Counting objects: 79% (6246/7906) remote: Counting objects: 80% (6325/7906) remote: Counting objects: 81% (6404/7906) remote: Counting objects: 82% (6483/7906) remote: Counting objects: 83% (6562/7906) remote: Counting objects: 84% (6642/7906) remote: Counting objects: 85% (6721/7906) remote: Counting objects: 86% (6800/7906) remote: Counting objects: 87% (6879/7906) remote: Counting objects: 88% (6958/7906) remote: Counting objects: 89% (7037/7906) remote: Counting objects: 90% (7116/7906) remote: Counting objects: 91% (7195/7906) remote: Counting objects: 92% (7274/7906) remote: Counting objects: 93% (7353/7906) remote: Counting objects: 94% (7432/7906) remote: Counting objects: 95% (7511/7906) remote: Counting objects: 96% (7590/7906) remote: Counting objects: 97% (7669/7906) remote: Counting objects: 98% (7748/7906) remote: Counting objects: 99% (7827/7906) remote: Counting objects: 100% (7906/7906) remote: Counting objects: 100% (7906/7906), done.
  5. 2.28 s remote: Compressing objects: 0% (1/1562) remote: Compressing objects: 1% (16/1562) remote: Compressing objects: 2% (32/1562) remote: Compressing objects: 3% (47/1562) remote: Compressing objects: 4% (63/1562) remote: Compressing objects: 5% (79/1562) remote: Compressing objects: 6% (94/1562) remote: Compressing objects: 7% (110/1562) remote: Compressing objects: 8% (125/1562) remote: Compressing objects: 9% (141/1562) remote: Compressing objects: 10% (157/1562) remote: Compressing objects: 11% (172/1562) remote: Compressing objects: 12% (188/1562) remote: Compressing objects: 13% (204/1562) remote: Compressing objects: 14% (219/1562) remote: Compressing objects: 15% (235/1562) remote: Compressing objects: 15% (240/1562) remote: Compressing objects: 16% (250/1562) remote: Compressing objects: 17% (266/1562) remote: Compressing objects: 18% (282/1562) remote: Compressing objects: 19% (297/1562) remote: Compressing objects: 20% (313/1562) remote: Compressing objects: 21% (329/1562) remote: Compressing objects: 22% (344/1562) remote: Compressing objects: 23% (360/1562) remote: Compressing objects: 24% (375/1562) remote: Compressing objects: 25% (391/1562) remote: Compressing objects: 26% (407/1562) remote: Compressing objects: 27% (422/1562) remote: Compressing objects: 28% (438/1562) remote: Compressing objects: 29% (453/1562) remote: Compressing objects: 30% (469/1562) remote: Compressing objects: 31% (485/1562) remote: Compressing objects: 32% (500/1562) remote: Compressing objects: 33% (516/1562) remote: Compressing objects: 34% (532/1562) remote: Compressing objects: 35% (547/1562) remote: Compressing objects: 36% (563/1562) remote: Compressing objects: 37% (578/1562) remote: Compressing objects: 38% (594/1562) remote: Compressing objects: 39% (610/1562) remote: Compressing objects: 40% (625/1562) remote: Compressing objects: 41% (641/1562) remote: Compressing objects: 42% (657/1562) remote: Compressing objects: 43% (672/1562) remote: Compressing objects: 44% (688/1562) remote: Compressing objects: 45% (703/1562) remote: Compressing objects: 46% (719/1562) remote: Compressing objects: 47% (735/1562) remote: Compressing objects: 48% (750/1562) remote: Compressing objects: 49% (766/1562) remote: Compressing objects: 50% (781/1562) remote: Compressing objects: 51% (797/1562) remote: Compressing objects: 52% (813/1562) remote: Compressing objects: 53% (828/1562) remote: Compressing objects: 54% (844/1562) remote: Compressing objects: 55% (860/1562) remote: Compressing objects: 56% (875/1562) remote: Compressing objects: 57% (891/1562) remote: Compressing objects: 58% (906/1562) remote: Compressing objects: 59% (922/1562) remote: Compressing objects: 60% (938/1562) remote: Compressing objects: 61% (953/1562) remote: Compressing objects: 62% (969/1562) remote: Compressing objects: 63% (985/1562) remote: Compressing objects: 64% (1000/1562) remote: Compressing objects: 65% (1016/1562) remote: Compressing objects: 66% (1031/1562) remote: Compressing objects: 67% (1047/1562) remote: Compressing objects: 68% (1063/1562) remote: Compressing objects: 69% (1078/1562) remote: Compressing objects: 70% (1094/1562) remote: Compressing objects: 71% (1110/1562) remote: Compressing objects: 72% (1125/1562) remote: Compressing objects: 73% (1141/1562) remote: Compressing objects: 74% (1156/1562) remote: Compressing objects: 75% (1172/1562) remote: Compressing objects: 76% (1188/1562) remote: Compressing objects: 77% (1203/1562) remote: Compressing objects: 78% (1219/1562) remote: Compressing objects: 79% (1234/1562) remote: Compressing objects: 80% (1250/1562) remote: Compressing objects: 81% (1266/1562) remote: Compressing objects: 82% (1281/1562) remote: Compressing objects: 83% (1297/1562) remote: Compressing objects: 84% (1313/1562) remote: Compressing objects: 85% (1328/1562) remote: Compressing objects: 86% (1344/1562) remote: Compressing objects: 87% (1359/1562) remote: Compressing objects: 88% (1375/1562) remote: Compressing objects: 89% (1391/1562) remote: Compressing objects: 90% (1406/1562) remote: Compressing objects: 91% (1422/1562) remote: Compressing objects: 92% (1438/1562) remote: Compressing objects: 93% (1453/1562) remote: Compressing objects: 94% (1469/1562) remote: Compressing objects: 95% (1484/1562) remote: Compressing objects: 96% (1500/1562) remote: Compressing objects: 97% (1516/1562) remote: Compressing objects: 98% (1531/1562) remote: Compressing objects: 99% (1547/1562) remote: Compressing objects: 100% (1562/1562) remote: Compressing objects: 100% (1562/1562), done.
  6. 4.72 s Receiving objects: 0% (1/65234) Receiving objects: 1% (653/65234) Receiving objects: 2% (1305/65234) Receiving objects: 3% (1958/65234) Receiving objects: 4% (2610/65234) Receiving objects: 5% (3262/65234) Receiving objects: 6% (3915/65234) Receiving objects: 7% (4567/65234) Receiving objects: 8% (5219/65234) Receiving objects: 9% (5872/65234) Receiving objects: 10% (6524/65234) Receiving objects: 11% (7176/65234) Receiving objects: 12% (7829/65234), 17.36 MiB | 34.71 MiB/s Receiving objects: 13% (8481/65234), 17.36 MiB | 34.71 MiB/s Receiving objects: 14% (9133/65234), 17.36 MiB | 34.71 MiB/s Receiving objects: 15% (9786/65234), 17.36 MiB | 34.71 MiB/s Receiving objects: 16% (10438/65234), 17.36 MiB | 34.71 MiB/s Receiving objects: 17% (11090/65234), 17.36 MiB | 34.71 MiB/s Receiving objects: 18% (11743/65234), 17.36 MiB | 34.71 MiB/s Receiving objects: 19% (12395/65234), 17.36 MiB | 34.71 MiB/s Receiving objects: 20% (13047/65234), 17.36 MiB | 34.71 MiB/s Receiving objects: 21% (13700/65234), 17.36 MiB | 34.71 MiB/s Receiving objects: 22% (14352/65234), 17.36 MiB | 34.71 MiB/s Receiving objects: 23% (15004/65234), 17.36 MiB | 34.71 MiB/s Receiving objects: 24% (15657/65234), 17.36 MiB | 34.71 MiB/s Receiving objects: 25% (16309/65234), 17.36 MiB | 34.71 MiB/s Receiving objects: 26% (16961/65234), 17.36 MiB | 34.71 MiB/s Receiving objects: 27% (17614/65234), 17.36 MiB | 34.71 MiB/s Receiving objects: 28% (18266/65234), 17.36 MiB | 34.71 MiB/s Receiving objects: 29% (18918/65234), 17.36 MiB | 34.71 MiB/s Receiving objects: 30% (19571/65234), 17.36 MiB | 34.71 MiB/s Receiving objects: 31% (20223/65234), 17.36 MiB | 34.71 MiB/s Receiving objects: 32% (20875/65234), 17.36 MiB | 34.71 MiB/s Receiving objects: 33% (21528/65234), 17.36 MiB | 34.71 MiB/s Receiving objects: 34% (22180/65234), 17.36 MiB | 34.71 MiB/s Receiving objects: 35% (22832/65234), 17.36 MiB | 34.71 MiB/s Receiving objects: 36% (23485/65234), 17.36 MiB | 34.71 MiB/s Receiving objects: 37% (24137/65234), 17.36 MiB | 34.71 MiB/s Receiving objects: 38% (24789/65234), 17.36 MiB | 34.71 MiB/s Receiving objects: 39% (25442/65234), 17.36 MiB | 34.71 MiB/s Receiving objects: 40% (26094/65234), 17.36 MiB | 34.71 MiB/s Receiving objects: 41% (26746/65234), 17.36 MiB | 34.71 MiB/s Receiving objects: 42% (27399/65234), 17.36 MiB | 34.71 MiB/s Receiving objects: 43% (28051/65234), 17.36 MiB | 34.71 MiB/s Receiving objects: 44% (28703/65234), 17.36 MiB | 34.71 MiB/s Receiving objects: 45% (29356/65234), 17.36 MiB | 34.71 MiB/s Receiving objects: 46% (30008/65234), 17.36 MiB | 34.71 MiB/s Receiving objects: 47% (30660/65234), 17.36 MiB | 34.71 MiB/s Receiving objects: 48% (31313/65234), 17.36 MiB | 34.71 MiB/s Receiving objects: 49% (31965/65234), 17.36 MiB | 34.71 MiB/s Receiving objects: 50% (32617/65234), 17.36 MiB | 34.71 MiB/s Receiving objects: 51% (33270/65234), 17.36 MiB | 34.71 MiB/s Receiving objects: 52% (33922/65234), 17.36 MiB | 34.71 MiB/s Receiving objects: 53% (34575/65234), 17.36 MiB | 34.71 MiB/s Receiving objects: 53% (35105/65234), 17.36 MiB | 34.71 MiB/s Receiving objects: 54% (35227/65234), 36.92 MiB | 36.91 MiB/s Receiving objects: 55% (35879/65234), 36.92 MiB | 36.91 MiB/s Receiving objects: 56% (36532/65234), 36.92 MiB | 36.91 MiB/s Receiving objects: 57% (37184/65234), 36.92 MiB | 36.91 MiB/s Receiving objects: 58% (37836/65234), 36.92 MiB | 36.91 MiB/s Receiving objects: 59% (38489/65234), 36.92 MiB | 36.91 MiB/s Receiving objects: 60% (39141/65234), 36.92 MiB | 36.91 MiB/s Receiving objects: 61% (39793/65234), 36.92 MiB | 36.91 MiB/s Receiving objects: 62% (40446/65234), 36.92 MiB | 36.91 MiB/s Receiving objects: 63% (41098/65234), 36.92 MiB | 36.91 MiB/s Receiving objects: 64% (41750/65234), 36.92 MiB | 36.91 MiB/s Receiving objects: 65% (42403/65234), 36.92 MiB | 36.91 MiB/s Receiving objects: 66% (43055/65234), 36.92 MiB | 36.91 MiB/s Receiving objects: 67% (43707/65234), 36.92 MiB | 36.91 MiB/s Receiving objects: 68% (44360/65234), 36.92 MiB | 36.91 MiB/s Receiving objects: 69% (45012/65234), 36.92 MiB | 36.91 MiB/s Receiving objects: 70% (45664/65234), 54.57 MiB | 36.37 MiB/s Receiving objects: 71% (46317/65234), 54.57 MiB | 36.37 MiB/s Receiving objects: 72% (46969/65234), 54.57 MiB | 36.37 MiB/s Receiving objects: 73% (47621/65234), 54.57 MiB | 36.37 MiB/s Receiving objects: 74% (48274/65234), 54.57 MiB | 36.37 MiB/s Receiving objects: 75% (48926/65234), 54.57 MiB | 36.37 MiB/s Receiving objects: 76% (49578/65234), 54.57 MiB | 36.37 MiB/s Receiving objects: 77% (50231/65234), 54.57 MiB | 36.37 MiB/s Receiving objects: 77% (50751/65234), 54.57 MiB | 36.37 MiB/s Receiving objects: 78% (50883/65234), 71.64 MiB | 35.82 MiB/s Receiving objects: 79% (51535/65234), 71.64 MiB | 35.82 MiB/s Receiving objects: 80% (52188/65234), 71.64 MiB | 35.82 MiB/s Receiving objects: 81% (52840/65234), 71.64 MiB | 35.82 MiB/s Receiving objects: 82% (53492/65234), 71.64 MiB | 35.82 MiB/s Receiving objects: 83% (54145/65234), 71.64 MiB | 35.82 MiB/s Receiving objects: 84% (54797/65234), 71.64 MiB | 35.82 MiB/s Receiving objects: 85% (55449/65234), 71.64 MiB | 35.82 MiB/s Receiving objects: 86% (56102/65234), 71.64 MiB | 35.82 MiB/s Receiving objects: 87% (56754/65234), 71.64 MiB | 35.82 MiB/s Receiving objects: 88% (57406/65234), 71.64 MiB | 35.82 MiB/s Receiving objects: 89% (58059/65234), 71.64 MiB | 35.82 MiB/s Receiving objects: 90% (58711/65234), 71.64 MiB | 35.82 MiB/s Receiving objects: 91% (59363/65234), 71.64 MiB | 35.82 MiB/s Receiving objects: 92% (60016/65234), 71.64 MiB | 35.82 MiB/s Receiving objects: 93% (60668/65234), 71.64 MiB | 35.82 MiB/s Receiving objects: 94% (61320/65234), 71.64 MiB | 35.82 MiB/s Receiving objects: 95% (61973/65234), 71.64 MiB | 35.82 MiB/s Receiving objects: 96% (62625/65234), 71.64 MiB | 35.82 MiB/s Receiving objects: 97% (63277/65234), 71.64 MiB | 35.82 MiB/s Receiving objects: 98% (63930/65234), 71.64 MiB | 35.82 MiB/s Receiving objects: 99% (64582/65234), 71.64 MiB | 35.82 MiB/s remote: Total 65234 (delta 6870), reused 6410 (delta 6337), pack-reused 57328 (from 1)
  7. 4.72 s Receiving objects: 100% (65234/65234), 71.64 MiB | 35.82 MiB/s Receiving objects: 100% (65234/65234), 87.56 MiB | 35.98 MiB/s, done.
  8. 5.42 s Resolving deltas: 0% (0/45967) Resolving deltas: 1% (460/45967) Resolving deltas: 2% (920/45967) Resolving deltas: 3% (1381/45967) Resolving deltas: 4% (1840/45967) Resolving deltas: 5% (2300/45967) Resolving deltas: 6% (2759/45967) Resolving deltas: 7% (3218/45967) Resolving deltas: 8% (3679/45967) Resolving deltas: 9% (4138/45967) Resolving deltas: 10% (4601/45967) Resolving deltas: 11% (5057/45967) Resolving deltas: 12% (5517/45967) Resolving deltas: 13% (5978/45967) Resolving deltas: 14% (6437/45967) Resolving deltas: 15% (6896/45967) Resolving deltas: 16% (7358/45967) Resolving deltas: 17% (7815/45967) Resolving deltas: 18% (8275/45967) Resolving deltas: 19% (8734/45967) Resolving deltas: 20% (9194/45967) Resolving deltas: 21% (9654/45967) Resolving deltas: 22% (10113/45967) Resolving deltas: 23% (10577/45967) Resolving deltas: 24% (11033/45967) Resolving deltas: 25% (11492/45967) Resolving deltas: 26% (11952/45967) Resolving deltas: 27% (12412/45967) Resolving deltas: 28% (12871/45967) Resolving deltas: 29% (13331/45967) Resolving deltas: 30% (13791/45967) Resolving deltas: 31% (14251/45967) Resolving deltas: 32% (14712/45967) Resolving deltas: 33% (15170/45967) Resolving deltas: 34% (15629/45967) Resolving deltas: 35% (16089/45967) Resolving deltas: 36% (16550/45967) Resolving deltas: 37% (17008/45967) Resolving deltas: 38% (17469/45967) Resolving deltas: 39% (17928/45967) Resolving deltas: 40% (18387/45967) Resolving deltas: 41% (18847/45967) Resolving deltas: 42% (19307/45967) Resolving deltas: 43% (19766/45967) Resolving deltas: 44% (20226/45967) Resolving deltas: 45% (20686/45967) Resolving deltas: 46% (21146/45967) Resolving deltas: 47% (21608/45967) Resolving deltas: 48% (22065/45967) Resolving deltas: 49% (22524/45967) Resolving deltas: 50% (22985/45967) Resolving deltas: 51% (23444/45967) Resolving deltas: 52% (23903/45967) Resolving deltas: 53% (24363/45967) Resolving deltas: 54% (24823/45967) Resolving deltas: 55% (25282/45967) Resolving deltas: 56% (25742/45967) Resolving deltas: 57% (26202/45967) Resolving deltas: 58% (26661/45967) Resolving deltas: 59% (27122/45967) Resolving deltas: 60% (27582/45967) Resolving deltas: 61% (28040/45967) Resolving deltas: 62% (28500/45967) Resolving deltas: 63% (28962/45967) Resolving deltas: 64% (29419/45967) Resolving deltas: 65% (29879/45967) Resolving deltas: 66% (30339/45967) Resolving deltas: 67% (30798/45967) Resolving deltas: 68% (31258/45967) Resolving deltas: 69% (31718/45967) Resolving deltas: 70% (32177/45967) Resolving deltas: 71% (32637/45967) Resolving deltas: 72% (33099/45967) Resolving deltas: 73% (33556/45967) Resolving deltas: 74% (34016/45967) Resolving deltas: 75% (34476/45967) Resolving deltas: 76% (34935/45967) Resolving deltas: 77% (35395/45967) Resolving deltas: 78% (35855/45967) Resolving deltas: 79% (36315/45967) Resolving deltas: 80% (36774/45967) Resolving deltas: 81% (37234/45967) Resolving deltas: 82% (37693/45967) Resolving deltas: 83% (38153/45967) Resolving deltas: 84% (38613/45967) Resolving deltas: 85% (39072/45967) Resolving deltas: 86% (39532/45967) Resolving deltas: 87% (39995/45967) Resolving deltas: 88% (40451/45967) Resolving deltas: 89% (40911/45967) Resolving deltas: 90% (41371/45967) Resolving deltas: 91% (41830/45967) Resolving deltas: 92% (42290/45967) Resolving deltas: 93% (42751/45967) Resolving deltas: 94% (43212/45967) Resolving deltas: 95% (43669/45967) Resolving deltas: 96% (44129/45967) Resolving deltas: 97% (44588/45967) Resolving deltas: 98% (45048/45967) Resolving deltas: 99% (45508/45967) Resolving deltas: 100% (45967/45967) Resolving deltas: 100% (45967/45967), done.
  9. 5.72 s Fetching commit 599cf1cef85c91c964b87ed34e44f16ad757ad05 for feynkit ...
  10. 5.72 s $ /nix/store/bcnisk3ydfgv26v2gw3zlky24g00yww2-git-2.54.0/bin/git fetch origin 599cf1cef85c91c964b87ed34e44f16ad757ad05
  11. 6.12 s From https://github.com/alphal00p/gammaloop
  12. 6.12 s * branch 599cf1cef85c91c964b87ed34e44f16ad757ad05 -> FETCH_HEAD
  13. 6.13 s $ /nix/store/9ypz3flqsrl5xl495mm8h645gadjsxi1-coreutils-9.11/bin/timeout --kill-after=15s 7200s /nix/store/bcnisk3ydfgv26v2gw3zlky24g00yww2-git-2.54.0/bin/git -c advice.detachedHead=false checkout 599cf1cef85c91c964b87ed34e44f16ad757ad05
  14. 6.31 s HEAD is now at 599cf1ce include compile-time fixtures in nix test sources
  15. 6.31 s $ /nix/store/9ypz3flqsrl5xl495mm8h645gadjsxi1-coreutils-9.11/bin/timeout --kill-after=15s 7200s /nix/store/23zk8sgzamrbmj1fday15szf7f2279s8-nix-2.34.7/bin/nix --extra-experimental-features nix-command --extra-experimental-features flakes --log-format internal-json run .#packages.x86_64-linux.nix-ci-check-gammaloop-nextest-python-api --print-build-logs
  16. 15.63 s
  17. 25.83 s evaluating derivation 'g copying '/nix/store/pzm7 evaluating derivation 'g copying '/nix/store/pzm7 evaluating derivation 'g copying '/nix/store/pzm7 evaluating derivation 'g copying '/nix/store/pzm7 evaluating derivation 'g copying '/nix/store/pzm7 evaluating derivation 'g copying '/nix/store/pzm7 evaluating derivation 'g copying '/nix/store/pzm7 evaluating derivation 'g copying '/nix/store/pzm7 evaluating derivation 'g copying '/nix/store/pzm7 evaluating derivation 'g copying '/nix/store/pzm7 evaluating derivation 'g copying '/nix/store/pzm7 evaluating derivation 'g copying '/nix/store/pzm7 evaluating derivation 'g copying '/nix/store/pzm7 evaluating derivation 'g querying gammaloop-nexte [0/1 built, 0.0 KiB DL] [1/0/1 built, 0.0 KiB DLgammaloop-nextest-python-api> Extracting 1 binary, 1 build script output directory, and 3 linked paths to /build/nextest-archive-8iAXC6
  18. 25.90 s gammaloop-nextest-python-api> Extracted 18 files to /build/nextest-archive-8iAXC6 in 0.07s
  19. 25.91 s gammaloop-nextest-python-api> ------------
  20. 25.91 s gammaloop-nextest-python-api> Nextest run ID 210fe235-6c4a-4380-a78e-dcb976719247 with nextest profile: ci_gammaloop
  21. 25.91 s gammaloop-nextest-python-api> Starting 5 tests across 1 binary
  22. 26.32 s gammaloop-nextest-python-api> FAIL [ 0.416s] (2/5) gammaloop-integration-tests::test_python_api python_evaluate_sample_preserves_graph_grouping_and_incoming_pdgs
  23. 26.32 s gammaloop-nextest-python-api> stdout ---
  24. 26.32 s gammaloop-nextest-python-api>
  25. 26.32 s gammaloop-nextest-python-api> running 1 test
  26. 26.32 s gammaloop-nextest-python-api> test python_evaluate_sample_preserves_graph_grouping_and_incoming_pdgs ... FAILED
  27. 26.32 s gammaloop-nextest-python-api>
  28. 26.32 s gammaloop-nextest-python-api> failures:
  29. 26.32 s gammaloop-nextest-python-api>
  30. 26.32 s gammaloop-nextest-python-api> failures:
  31. 26.32 s gammaloop-nextest-python-api> python_evaluate_sample_preserves_graph_grouping_and_incoming_pdgs
  32. 26.32 s gammaloop-nextest-python-api>
  33. 26.32 s gammaloop-nextest-python-api> test result: FAILED. 0 passed; 1 failed; 0 ignored; 0 measured; 4 filtered out; finished in 0.41s
  34. 26.32 s gammaloop-nextest-python-api>
  35. 26.32 s gammaloop-nextest-python-api> stderr ---
  36. 26.32 s gammaloop-nextest-python-api>
  37. 26.32 s gammaloop-nextest-python-api> thread 'python_evaluate_sample_preserves_graph_grouping_and_incoming_pdgs' (147) panicked at tests/tests/test_python_api.rs:349:5:
  38. 26.32 s gammaloop-nextest-python-api> assertion `left == right` failed
  39. 26.32 s gammaloop-nextest-python-api> left: [Number(2), Number(1)]
  40. 26.32 s gammaloop-nextest-python-api> right: [Number(1), Number(2)]
  41. 26.32 s gammaloop-nextest-python-api> stack backtrace:
  42. 26.32 s gammaloop-nextest-python-api> 0: __rustc::rust_begin_unwind
  43. 26.32 s gammaloop-nextest-python-api> 1: core::panicking::panic_fmt
  44. 26.32 s gammaloop-nextest-python-api> 2: core::panicking::assert_failed_inner
  45. 26.32 s gammaloop-nextest-python-api> 3: core::panicking::assert_failed::<&alloc::vec::Vec<serde_json::value::Value>, &alloc::vec::Vec<serde_json::value::Value>>
  46. 26.32 s gammaloop-nextest-python-api> 4: <test_python_api::python_evaluate_sample_preserves_graph_grouping_and_incoming_pdgs::{closure#0} as core::ops::function::FnOnce<()>>::call_once
  47. 26.32 s gammaloop-nextest-python-api> 5: serial_test::serial_code_lock::local_serial_core_with_return::<(), eyre::Report>
  48. 26.32 s gammaloop-nextest-python-api> 6: <test_python_api::python_evaluate_sample_preserves_graph_grouping_and_incoming_pdgs::{closure#0} as core::ops::function::FnOnce<()>>::call_once
  49. 26.32 s gammaloop-nextest-python-api> note: Some details are omitted, run with `RUST_BACKTRACE=full` for a verbose backtrace.
  50. 26.32 s gammaloop-nextest-python-api>
  51. 26.47 s gammaloop-nextest-python-api> ------------
  52. 26.47 s gammaloop-nextest-python-api> Summary [ 0.562s] 5 tests run: 4 passed, 1 failed, 0 skipped
  53. 26.47 s gammaloop-nextest-python-api> FAIL [ 0.416s] (2/5) gammaloop-integration-tests::test_python_api python_evaluate_sample_preserves_graph_grouping_and_incoming_pdgs
  54. 26.47 s gammaloop-nextest-python-api> stdout ---
  55. 26.47 s gammaloop-nextest-python-api>
  56. 26.47 s gammaloop-nextest-python-api> running 1 test
  57. 26.47 s gammaloop-nextest-python-api> test python_evaluate_sample_preserves_graph_grouping_and_incoming_pdgs ... FAILED
  58. 26.47 s gammaloop-nextest-python-api>
  59. 26.47 s gammaloop-nextest-python-api> failures:
  60. 26.47 s gammaloop-nextest-python-api>
  61. 26.47 s gammaloop-nextest-python-api> failures:
  62. 26.47 s gammaloop-nextest-python-api> python_evaluate_sample_preserves_graph_grouping_and_incoming_pdgs
  63. 26.47 s gammaloop-nextest-python-api>
  64. 26.47 s gammaloop-nextest-python-api> test result: FAILED. 0 passed; 1 failed; 0 ignored; 0 measured; 4 filtered out; finished in 0.41s
  65. 26.47 s gammaloop-nextest-python-api>
  66. 26.47 s gammaloop-nextest-python-api> stderr ---
  67. 26.47 s gammaloop-nextest-python-api>
  68. 26.47 s gammaloop-nextest-python-api> thread 'python_evaluate_sample_preserves_graph_grouping_and_incoming_pdgs' (147) panicked at tests/tests/test_python_api.rs:349:5:
  69. 26.47 s gammaloop-nextest-python-api> assertion `left == right` failed
  70. 26.47 s gammaloop-nextest-python-api> left: [Number(2), Number(1)]
  71. 26.47 s gammaloop-nextest-python-api> right: [Number(1), Number(2)]
  72. 26.47 s gammaloop-nextest-python-api> stack backtrace:
  73. 26.47 s gammaloop-nextest-python-api> 0: __rustc::rust_begin_unwind
  74. 26.47 s gammaloop-nextest-python-api> 1: core::panicking::panic_fmt
  75. 26.47 s gammaloop-nextest-python-api> 2: core::panicking::assert_failed_inner
  76. 26.47 s gammaloop-nextest-python-api> 3: core::panicking::assert_failed::<&alloc::vec::Vec<serde_json::value::Value>, &alloc::vec::Vec<serde_json::value::Value>>
  77. 26.47 s gammaloop-nextest-python-api> 4: <test_python_api::python_evaluate_sample_preserves_graph_grouping_and_incoming_pdgs::{closure#0} as core::ops::function::FnOnce<()>>::call_once
  78. 26.47 s gammaloop-nextest-python-api> 5: serial_test::serial_code_lock::local_serial_core_with_return::<(), eyre::Report>
  79. 26.47 s gammaloop-nextest-python-api> 6: <test_python_api::python_evaluate_sample_preserves_graph_grouping_and_incoming_pdgs::{closure#0} as core::ops::function::FnOnce<()>>::call_once
  80. 26.47 s gammaloop-nextest-python-api> note: Some details are omitted, run with `RUST_BACKTRACE=full` for a verbose backtrace.
  81. 26.47 s gammaloop-nextest-python-api>
  82. 26.48 s gammaloop-nextest-python-api> error: test run failed
  83. 26.51 s gammaloop-nextest-python-api>
  84. 26.51 s gammaloop-nextest-python-api> ========== nextest test summary ==========
  85. 26.51 s gammaloop-nextest-python-api> report: target/nextest/ci_gammaloop/junit.xml
  86. 26.51 s gammaloop-nextest-python-api> tests: 5, failures: 1, errors: 0
  87. 26.51 s gammaloop-nextest-python-api>
  88. 26.51 s gammaloop-nextest-python-api> 1. gammaloop-integration-tests::test_python_api::python_evaluate_sample_preserves_graph_grouping_and_incoming_pdgs
  89. 26.51 s gammaloop-nextest-python-api> failure: test failure with exit code 101
  90. 26.51 s gammaloop-nextest-python-api> thread 'python_evaluate_sample_preserves_graph_grouping_and_incoming_pdgs' (147) panicked at tests/tests/test_python_api.rs:349:5:
  91. 26.51 s gammaloop-nextest-python-api> assertion `left == right` failed
  92. 26.51 s gammaloop-nextest-python-api> left: [Number(2), Number(1)]
  93. 26.51 s gammaloop-nextest-python-api> right: [Number(1), Number(2)]
  94. 26.51 s gammaloop-nextest-python-api> stack backtrace:
  95. 26.51 s gammaloop-nextest-python-api> 0: __rustc::rust_begin_unwind
  96. 26.51 s gammaloop-nextest-python-api> 1: core::panicking::panic_fmt
  97. 26.51 s gammaloop-nextest-python-api> 2: core::panicking::assert_failed_inner
  98. 26.51 s gammaloop-nextest-python-api> 3: core::panicking::assert_failed::<&alloc::vec::Vec<serde_json::value::Value>, &alloc::vec::Vec<serde_json::value::Value>>
  99. 26.51 s gammaloop-nextest-python-api> 4: <test_python_api::python_evaluate_sample_preserves_graph_grouping_and_incoming_pdgs::{closure#0} as core::ops::function::FnOnce<()>>::call_once
  100. 26.51 s gammaloop-nextest-python-api> 5: serial_test::serial_code_lock::local_serial_core_with_return::<(), eyre::Report>
  101. 26.51 s gammaloop-nextest-python-api> 6: <test_python_api::python_evaluate_sample_preserves_graph_grouping_and_incoming_pdgs::{closure#0} as core::ops::function::FnOnce<()>>::call_once
  102. 26.51 s gammaloop-nextest-python-api> note: Some details are omitted, run with `RUST_BACKTRACE=full` for a verbose backtrace.
  103. 26.51 s gammaloop-nextest-python-api> system-out
  104. 26.51 s gammaloop-nextest-python-api> running 1 test
  105. 26.51 s gammaloop-nextest-python-api> test python_evaluate_sample_preserves_graph_grouping_and_incoming_pdgs ... FAILED
  106. 26.51 s gammaloop-nextest-python-api>
  107. 26.51 s gammaloop-nextest-python-api> failures:
  108. 26.51 s gammaloop-nextest-python-api>
  109. 26.51 s gammaloop-nextest-python-api> failures:
  110. 26.51 s gammaloop-nextest-python-api> python_evaluate_sample_preserves_graph_grouping_and_incoming_pdgs
  111. 26.51 s gammaloop-nextest-python-api>
  112. 26.51 s gammaloop-nextest-python-api> test result: FAILED. 0 passed; 1 failed; 0 ignored; 0 measured; 4 filtered out; finished in 0.41s
  113. 26.51 s gammaloop-nextest-python-api> system-err
  114. 26.51 s gammaloop-nextest-python-api> thread 'python_evaluate_sample_preserves_graph_grouping_and_incoming_pdgs' (147) panicked at tests/tests/test_python_api.rs:349:5:
  115. 26.51 s gammaloop-nextest-python-api> assertion `left == right` failed
  116. 26.51 s gammaloop-nextest-python-api> left: [Number(2), Number(1)]
  117. 26.51 s gammaloop-nextest-python-api> right: [Number(1), Number(2)]
  118. 26.51 s gammaloop-nextest-python-api> stack backtrace:
  119. 26.51 s gammaloop-nextest-python-api> 0: __rustc::rust_begin_unwind
  120. 26.51 s gammaloop-nextest-python-api> 1: core::panicking::panic_fmt
  121. 26.51 s gammaloop-nextest-python-api> 2: core::panicking::assert_failed_inner
  122. 26.51 s gammaloop-nextest-python-api> 3: core::panicking::assert_failed::<&alloc::vec::Vec<serde_json::value::Value>, &alloc::vec::Vec<serde_json::value::Value>>
  123. 26.51 s gammaloop-nextest-python-api> 4: <test_python_api::python_evaluate_sample_preserves_graph_grouping_and_incoming_pdgs::{closure#0} as core::ops::function::FnOnce<()>>::call_once
  124. 26.51 s gammaloop-nextest-python-api> 5: serial_test::serial_code_lock::local_serial_core_with_return::<(), eyre::Report>
  125. 26.51 s gammaloop-nextest-python-api> 6: <test_python_api::python_evaluate_sample_preserves_graph_grouping_and_incoming_pdgs::{closure#0} as core::ops::function::FnOnce<()>>::call_once
  126. 26.51 s gammaloop-nextest-python-api> note: Some details are omitted, run with `RUST_BACKTRACE=full` for a verbose backtrace.
  127. 26.51 s gammaloop-nextest-python-api> =========================================
  128. 26.54 s error: Cannot build '/nix/store/q60kvii0lx498r1ihigxsndcr7l2j1b8-gammaloop-nextest-python-api.drv'.
  129. 26.54 s Reason: builder failed with exit code 100.
  130. 26.54 s Output paths:
  131. 26.54 s /nix/store/a24km2p4yffia07m0rlzyr516fvbf3fb-gammaloop-nextest-python-api
  132. 26.54 s Last 111 log lines:
  133. 26.54 s > Extracting 1 binary, 1 build script output directory, and 3 linked paths to /build/nextest-archive-8iAXC6
  134. 26.54 s > Extracted 18 files to /build/nextest-archive-8iAXC6 in 0.07s
  135. 26.54 s > ------------
  136. 26.54 s > Nextest run ID 210fe235-6c4a-4380-a78e-dcb976719247 with nextest profile: ci_gammaloop
  137. 26.54 s > Starting 5 tests across 1 binary
  138. 26.54 s > FAIL [ 0.416s] (2/5) gammaloop-integration-tests::test_python_api python_evaluate_sample_preserves_graph_grouping_and_incoming_pdgs
  139. 26.54 s > stdout ---
  140. 26.54 s >
  141. 26.54 s > running 1 test
  142. 26.54 s > test python_evaluate_sample_preserves_graph_grouping_and_incoming_pdgs ... FAILED
  143. 26.54 s >
  144. 26.54 s > failures:
  145. 26.54 s >
  146. 26.54 s > failures:
  147. 26.54 s > python_evaluate_sample_preserves_graph_grouping_and_incoming_pdgs
  148. 26.54 s >
  149. 26.54 s > test result: FAILED. 0 passed; 1 failed; 0 ignored; 0 measured; 4 filtered out; finished in 0.41s
  150. 26.54 s >
  151. 26.54 s > stderr ---
  152. 26.54 s >
  153. 26.54 s > thread 'python_evaluate_sample_preserves_graph_grouping_and_incoming_pdgs' (147) panicked at tests/tests/test_python_api.rs:349:5:
  154. 26.54 s > assertion `left == right` failed
  155. 26.54 s > left: [Number(2), Number(1)]
  156. 26.54 s > right: [Number(1), Number(2)]
  157. 26.54 s > stack backtrace:
  158. 26.54 s > 0: __rustc::rust_begin_unwind
  159. 26.54 s > 1: core::panicking::panic_fmt
  160. 26.54 s > 2: core::panicking::assert_failed_inner
  161. 26.54 s > 3: core::panicking::assert_failed::<&alloc::vec::Vec<serde_json::value::Value>, &alloc::vec::Vec<serde_json::value::Value>>
  162. 26.54 s > 4: <test_python_api::python_evaluate_sample_preserves_graph_grouping_and_incoming_pdgs::{closure#0} as core::ops::function::FnOnce<()>>::call_once
  163. 26.54 s > 5: serial_test::serial_code_lock::local_serial_core_with_return::<(), eyre::Report>
  164. 26.54 s > 6: <test_python_api::python_evaluate_sample_preserves_graph_grouping_and_incoming_pdgs::{closure#0} as core::ops::function::FnOnce<()>>::call_once
  165. 26.54 s > note: Some details are omitted, run with `RUST_BACKTRACE=full` for a verbose backtrace.
  166. 26.54 s >
  167. 26.54 s > ------------
  168. 26.54 s > Summary [ 0.562s] 5 tests run: 4 passed, 1 failed, 0 skipped
  169. 26.54 s > FAIL [ 0.416s] (2/5) gammaloop-integration-tests::test_python_api python_evaluate_sample_preserves_graph_grouping_and_incoming_pdgs
  170. 26.54 s > stdout ---
  171. 26.54 s >
  172. 26.54 s > running 1 test
  173. 26.54 s > test python_evaluate_sample_preserves_graph_grouping_and_incoming_pdgs ... FAILED
  174. 26.54 s >
  175. 26.54 s > failures:
  176. 26.54 s >
  177. 26.54 s > failures:
  178. 26.54 s > python_evaluate_sample_preserves_graph_grouping_and_incoming_pdgs
  179. 26.54 s >
  180. 26.54 s > test result: FAILED. 0 passed; 1 failed; 0 ignored; 0 measured; 4 filtered out; finished in 0.41s
  181. 26.54 s >
  182. 26.54 s > stderr ---
  183. 26.54 s >
  184. 26.54 s > thread 'python_evaluate_sample_preserves_graph_grouping_and_incoming_pdgs' (147) panicked at tests/tests/test_python_api.rs:349:5:
  185. 26.54 s > assertion `left == right` failed
  186. 26.54 s > left: [Number(2), Number(1)]
  187. 26.54 s > right: [Number(1), Number(2)]
  188. 26.54 s > stack backtrace:
  189. 26.54 s > 0: __rustc::rust_begin_unwind
  190. 26.54 s > 1: core::panicking::panic_fmt
  191. 26.54 s > 2: core::panicking::assert_failed_inner
  192. 26.54 s > 3: core::panicking::assert_failed::<&alloc::vec::Vec<serde_json::value::Value>, &alloc::vec::Vec<serde_json::value::Value>>
  193. 26.54 s > 4: <test_python_api::python_evaluate_sample_preserves_graph_grouping_and_incoming_pdgs::{closure#0} as core::ops::function::FnOnce<()>>::call_once
  194. 26.54 s > 5: serial_test::serial_code_lock::local_serial_core_with_return::<(), eyre::Report>
  195. 26.54 s > 6: <test_python_api::python_evaluate_sample_preserves_graph_grouping_and_incoming_pdgs::{closure#0} as core::ops::function::FnOnce<()>>::call_once
  196. 26.54 s > note: Some details are omitted, run with `RUST_BACKTRACE=full` for a verbose backtrace.
  197. 26.54 s >
  198. 26.54 s > error: test run failed
  199. 26.54 s >
  200. 26.54 s > ========== nextest test summary ==========
  201. 26.54 s > report: target/nextest/ci_gammaloop/junit.xml
  202. 26.54 s > tests: 5, failures: 1, errors: 0
  203. 26.54 s >
  204. 26.54 s > 1. gammaloop-integration-tests::test_python_api::python_evaluate_sample_preserves_graph_grouping_and_incoming_pdgs
  205. 26.54 s > failure: test failure with exit code 101
  206. 26.54 s > thread 'python_evaluate_sample_preserves_graph_grouping_and_incoming_pdgs' (147) panicked at tests/tests/test_python_api.rs:349:5:
  207. 26.54 s > assertion `left == right` failed
  208. 26.54 s > left: [Number(2), Number(1)]
  209. 26.54 s > right: [Number(1), Number(2)]
  210. 26.54 s > stack backtrace:
  211. 26.54 s > 0: __rustc::rust_begin_unwind
  212. 26.54 s > 1: core::panicking::panic_fmt
  213. 26.54 s > 2: core::panicking::assert_failed_inner
  214. 26.54 s > 3: core::panicking::assert_failed::<&alloc::vec::Vec<serde_json::value::Value>, &alloc::vec::Vec<serde_json::value::Value>>
  215. 26.54 s > 4: <test_python_api::python_evaluate_sample_preserves_graph_grouping_and_incoming_pdgs::{closure#0} as core::ops::function::FnOnce<()>>::call_once
  216. 26.54 s > 5: serial_test::serial_code_lock::local_serial_core_with_return::<(), eyre::Report>
  217. 26.54 s > 6: <test_python_api::python_evaluate_sample_preserves_graph_grouping_and_incoming_pdgs::{closure#0} as core::ops::function::FnOnce<()>>::call_once
  218. 26.54 s > note: Some details are omitted, run with `RUST_BACKTRACE=full` for a verbose backtrace.
  219. 26.54 s > system-out
  220. 26.54 s > running 1 test
  221. 26.54 s > test python_evaluate_sample_preserves_graph_grouping_and_incoming_pdgs ... FAILED
  222. 26.54 s >
  223. 26.54 s > failures:
  224. 26.54 s >
  225. 26.54 s > failures:
  226. 26.54 s > python_evaluate_sample_preserves_graph_grouping_and_incoming_pdgs
  227. 26.54 s >
  228. 26.54 s > test result: FAILED. 0 passed; 1 failed; 0 ignored; 0 measured; 4 filtered out; finished in 0.41s
  229. 26.54 s > system-err
  230. 26.54 s > thread 'python_evaluate_sample_preserves_graph_grouping_and_incoming_pdgs' (147) panicked at tests/tests/test_python_api.rs:349:5:
  231. 26.54 s > assertion `left == right` failed
  232. 26.54 s > left: [Number(2), Number(1)]
  233. 26.54 s > right: [Number(1), Number(2)]
  234. 26.54 s > stack backtrace:
  235. 26.54 s > 0: __rustc::rust_begin_unwind
  236. 26.54 s > 1: core::panicking::panic_fmt
  237. 26.54 s > 2: core::panicking::assert_failed_inner
  238. 26.54 s > 3: core::panicking::assert_failed::<&alloc::vec::Vec<serde_json::value::Value>, &alloc::vec::Vec<serde_json::value::Value>>
  239. 26.54 s > 4: <test_python_api::python_evaluate_sample_preserves_graph_grouping_and_incoming_pdgs::{closure#0} as core::ops::function::FnOnce<()>>::call_once
  240. 26.54 s > 5: serial_test::serial_code_lock::local_serial_core_with_return::<(), eyre::Report>
  241. 26.54 s > 6: <test_python_api::python_evaluate_sample_preserves_graph_grouping_and_incoming_pdgs::{closure#0} as core::ops::function::FnOnce<()>>::call_once
  242. 26.54 s > note: Some details are omitted, run with `RUST_BACKTRACE=full` for a verbose backtrace.
  243. 26.54 s > =========================================
  244. 26.54 s For full logs, run:
  245. 26.54 s nix log /nix/store/q60kvii0lx498r1ihigxsndcr7l2j1b8-gammaloop-nextest-python-api.drv
  246. 26.66 s [0 built (1 failed), 0.0Run failed.