test packages.x86_64-linux.nix-ci-check-gammaloop-nextest-python-api

Reproduce this run
Original Run
  1. 0.80 s $ /nix/store/9ypz3flqsrl5xl495mm8h645gadjsxi1-coreutils-9.11/bin/timeout --kill-after=15s 7200s /nix/store/23zk8sgzamrbmj1fday15szf7f2279s8-nix-2.34.7/bin/nix --extra-experimental-features nix-command --extra-experimental-features flakes flake clone git+https://github.com/alphal00p/gammaloop --dest /tmp/nix-ci-worker/stable-pwd/repo/
  2. 0.81 s Cloning into '/tmp/nix-ci-worker/stable-pwd/repo'...
  3. 1.22 s remote: Enumerating objects: 66372, done.
  4. 1.33 s remote: Counting objects: 0% (1/9044) remote: Counting objects: 1% (91/9044) remote: Counting objects: 2% (181/9044) remote: Counting objects: 3% (272/9044) remote: Counting objects: 4% (362/9044) remote: Counting objects: 5% (453/9044) remote: Counting objects: 6% (543/9044) remote: Counting objects: 7% (634/9044) remote: Counting objects: 8% (724/9044) remote: Counting objects: 9% (814/9044) remote: Counting objects: 10% (905/9044) remote: Counting objects: 11% (995/9044) remote: Counting objects: 12% (1086/9044) remote: Counting objects: 13% (1176/9044) remote: Counting objects: 14% (1267/9044) remote: Counting objects: 15% (1357/9044) remote: Counting objects: 16% (1448/9044) remote: Counting objects: 17% (1538/9044) remote: Counting objects: 18% (1628/9044) remote: Counting objects: 19% (1719/9044) remote: Counting objects: 20% (1809/9044) remote: Counting objects: 21% (1900/9044) remote: Counting objects: 22% (1990/9044) remote: Counting objects: 23% (2081/9044) remote: Counting objects: 24% (2171/9044) remote: Counting objects: 25% (2261/9044) remote: Counting objects: 26% (2352/9044) remote: Counting objects: 27% (2442/9044) remote: Counting objects: 28% (2533/9044) remote: Counting objects: 29% (2623/9044) remote: Counting objects: 30% (2714/9044) remote: Counting objects: 31% (2804/9044) remote: Counting objects: 32% (2895/9044) remote: Counting objects: 33% (2985/9044) remote: Counting objects: 34% (3075/9044) remote: Counting objects: 35% (3166/9044) remote: Counting objects: 36% (3256/9044) remote: Counting objects: 37% (3347/9044) remote: Counting objects: 38% (3437/9044) remote: Counting objects: 39% (3528/9044) remote: Counting objects: 40% (3618/9044) remote: Counting objects: 41% (3709/9044) remote: Counting objects: 42% (3799/9044) remote: Counting objects: 43% (3889/9044) remote: Counting objects: 44% (3980/9044) remote: Counting objects: 45% (4070/9044) remote: Counting objects: 46% (4161/9044) remote: Counting objects: 47% (4251/9044) remote: Counting objects: 48% (4342/9044) remote: Counting objects: 49% (4432/9044) remote: Counting objects: 50% (4522/9044) remote: Counting objects: 51% (4613/9044) remote: Counting objects: 52% (4703/9044) remote: Counting objects: 53% (4794/9044) remote: Counting objects: 54% (4884/9044) remote: Counting objects: 55% (4975/9044) remote: Counting objects: 56% (5065/9044) remote: Counting objects: 57% (5156/9044) remote: Counting objects: 58% (5246/9044) remote: Counting objects: 59% (5336/9044) remote: Counting objects: 60% (5427/9044) remote: Counting objects: 61% (5517/9044) remote: Counting objects: 62% (5608/9044) remote: Counting objects: 63% (5698/9044) remote: Counting objects: 64% (5789/9044) remote: Counting objects: 65% (5879/9044) remote: Counting objects: 66% (5970/9044) remote: Counting objects: 67% (6060/9044) remote: Counting objects: 68% (6150/9044) remote: Counting objects: 69% (6241/9044) remote: Counting objects: 70% (6331/9044) remote: Counting objects: 71% (6422/9044) remote: Counting objects: 72% (6512/9044) remote: Counting objects: 73% (6603/9044) remote: Counting objects: 74% (6693/9044) remote: Counting objects: 75% (6783/9044) remote: Counting objects: 76% (6874/9044) remote: Counting objects: 77% (6964/9044) remote: Counting objects: 78% (7055/9044) remote: Counting objects: 79% (7145/9044) remote: Counting objects: 80% (7236/9044) remote: Counting objects: 81% (7326/9044) remote: Counting objects: 82% (7417/9044) remote: Counting objects: 83% (7507/9044) remote: Counting objects: 84% (7597/9044) remote: Counting objects: 85% (7688/9044) remote: Counting objects: 86% (7778/9044) remote: Counting objects: 87% (7869/9044) remote: Counting objects: 88% (7959/9044) remote: Counting objects: 89% (8050/9044) remote: Counting objects: 90% (8140/9044) remote: Counting objects: 91% (8231/9044) remote: Counting objects: 92% (8321/9044) remote: Counting objects: 93% (8411/9044) remote: Counting objects: 94% (8502/9044) remote: Counting objects: 95% (8592/9044) remote: Counting objects: 96% (8683/9044) remote: Counting objects: 97% (8773/9044) remote: Counting objects: 98% (8864/9044) remote: Counting objects: 99% (8954/9044) remote: Counting objects: 100% (9044/9044) remote: Counting objects: 100% (9044/9044), done.
  5. 3.68 s remote: Compressing objects: 0% (1/2130) remote: Compressing objects: 1% (22/2130) remote: Compressing objects: 2% (43/2130) remote: Compressing objects: 3% (64/2130) remote: Compressing objects: 4% (86/2130) remote: Compressing objects: 5% (107/2130) remote: Compressing objects: 6% (128/2130) remote: Compressing objects: 7% (150/2130) remote: Compressing objects: 8% (171/2130) remote: Compressing objects: 9% (192/2130) remote: Compressing objects: 10% (213/2130) remote: Compressing objects: 11% (235/2130) remote: Compressing objects: 12% (256/2130) remote: Compressing objects: 13% (277/2130) remote: Compressing objects: 14% (299/2130) remote: Compressing objects: 15% (320/2130) remote: Compressing objects: 16% (341/2130) remote: Compressing objects: 17% (363/2130) remote: Compressing objects: 18% (384/2130) remote: Compressing objects: 19% (405/2130) remote: Compressing objects: 20% (426/2130) remote: Compressing objects: 20% (446/2130) remote: Compressing objects: 21% (448/2130) remote: Compressing objects: 22% (469/2130) remote: Compressing objects: 23% (490/2130) remote: Compressing objects: 24% (512/2130) remote: Compressing objects: 25% (533/2130) remote: Compressing objects: 26% (554/2130) remote: Compressing objects: 27% (576/2130) remote: Compressing objects: 28% (597/2130) remote: Compressing objects: 29% (618/2130) remote: Compressing objects: 29% (638/2130) remote: Compressing objects: 30% (639/2130) remote: Compressing objects: 31% (661/2130) remote: Compressing objects: 32% (682/2130) remote: Compressing objects: 33% (703/2130) remote: Compressing objects: 34% (725/2130) remote: Compressing objects: 35% (746/2130) remote: Compressing objects: 36% (767/2130) remote: Compressing objects: 37% (789/2130) remote: Compressing objects: 38% (810/2130) remote: Compressing objects: 39% (831/2130) remote: Compressing objects: 40% (852/2130) remote: Compressing objects: 41% (874/2130) remote: Compressing objects: 42% (895/2130) remote: Compressing objects: 43% (916/2130) remote: Compressing objects: 44% (938/2130) remote: Compressing objects: 45% (959/2130) remote: Compressing objects: 46% (980/2130) remote: Compressing objects: 47% (1002/2130) remote: Compressing objects: 48% (1023/2130) remote: Compressing objects: 49% (1044/2130) remote: Compressing objects: 50% (1065/2130) remote: Compressing objects: 51% (1087/2130) remote: Compressing objects: 52% (1108/2130) remote: Compressing objects: 53% (1129/2130) remote: Compressing objects: 54% (1151/2130) remote: Compressing objects: 55% (1172/2130) remote: Compressing objects: 56% (1193/2130) remote: Compressing objects: 57% (1215/2130) remote: Compressing objects: 58% (1236/2130) remote: Compressing objects: 59% (1257/2130) remote: Compressing objects: 60% (1278/2130) remote: Compressing objects: 61% (1300/2130) remote: Compressing objects: 62% (1321/2130) remote: Compressing objects: 63% (1342/2130) remote: Compressing objects: 64% (1364/2130) remote: Compressing objects: 65% (1385/2130) remote: Compressing objects: 66% (1406/2130) remote: Compressing objects: 67% (1428/2130) remote: Compressing objects: 68% (1449/2130) remote: Compressing objects: 69% (1470/2130) remote: Compressing objects: 70% (1491/2130) remote: Compressing objects: 71% (1513/2130) remote: Compressing objects: 72% (1534/2130) remote: Compressing objects: 73% (1555/2130) remote: Compressing objects: 74% (1577/2130) remote: Compressing objects: 75% (1598/2130) remote: Compressing objects: 76% (1619/2130) remote: Compressing objects: 77% (1641/2130) remote: Compressing objects: 78% (1662/2130) remote: Compressing objects: 79% (1683/2130) remote: Compressing objects: 80% (1704/2130) remote: Compressing objects: 81% (1726/2130) remote: Compressing objects: 82% (1747/2130) remote: Compressing objects: 83% (1768/2130) remote: Compressing objects: 84% (1790/2130) remote: Compressing objects: 85% (1811/2130) remote: Compressing objects: 86% (1832/2130) remote: Compressing objects: 87% (1854/2130) remote: Compressing objects: 88% (1875/2130) remote: Compressing objects: 89% (1896/2130) remote: Compressing objects: 90% (1917/2130) remote: Compressing objects: 91% (1939/2130) remote: Compressing objects: 92% (1960/2130) remote: Compressing objects: 93% (1981/2130) remote: Compressing objects: 94% (2003/2130) remote: Compressing objects: 95% (2024/2130) remote: Compressing objects: 96% (2045/2130) remote: Compressing objects: 97% (2067/2130) remote: Compressing objects: 98% (2088/2130) remote: Compressing objects: 99% (2109/2130) remote: Compressing objects: 100% (2130/2130) remote: Compressing objects: 100% (2130/2130), done.
  6. 6.50 s Receiving objects: 0% (1/66372) Receiving objects: 1% (664/66372) Receiving objects: 2% (1328/66372) Receiving objects: 3% (1992/66372) Receiving objects: 4% (2655/66372) Receiving objects: 5% (3319/66372) Receiving objects: 6% (3983/66372) Receiving objects: 7% (4647/66372) Receiving objects: 8% (5310/66372) Receiving objects: 9% (5974/66372) Receiving objects: 10% (6638/66372) Receiving objects: 11% (7301/66372) Receiving objects: 12% (7965/66372), 16.69 MiB | 33.37 MiB/s Receiving objects: 13% (8629/66372), 16.69 MiB | 33.37 MiB/s Receiving objects: 14% (9293/66372), 16.69 MiB | 33.37 MiB/s Receiving objects: 15% (9956/66372), 16.69 MiB | 33.37 MiB/s Receiving objects: 16% (10620/66372), 16.69 MiB | 33.37 MiB/s Receiving objects: 17% (11284/66372), 16.69 MiB | 33.37 MiB/s Receiving objects: 18% (11947/66372), 16.69 MiB | 33.37 MiB/s Receiving objects: 19% (12611/66372), 16.69 MiB | 33.37 MiB/s Receiving objects: 20% (13275/66372), 16.69 MiB | 33.37 MiB/s Receiving objects: 21% (13939/66372), 16.69 MiB | 33.37 MiB/s Receiving objects: 22% (14602/66372), 16.69 MiB | 33.37 MiB/s Receiving objects: 23% (15266/66372), 16.69 MiB | 33.37 MiB/s Receiving objects: 24% (15930/66372), 16.69 MiB | 33.37 MiB/s Receiving objects: 25% (16593/66372), 16.69 MiB | 33.37 MiB/s Receiving objects: 26% (17257/66372), 16.69 MiB | 33.37 MiB/s Receiving objects: 27% (17921/66372), 16.69 MiB | 33.37 MiB/s Receiving objects: 28% (18585/66372), 16.69 MiB | 33.37 MiB/s Receiving objects: 29% (19248/66372), 16.69 MiB | 33.37 MiB/s Receiving objects: 30% (19912/66372), 16.69 MiB | 33.37 MiB/s Receiving objects: 31% (20576/66372), 16.69 MiB | 33.37 MiB/s Receiving objects: 32% (21240/66372), 16.69 MiB | 33.37 MiB/s Receiving objects: 33% (21903/66372), 16.69 MiB | 33.37 MiB/s Receiving objects: 34% (22567/66372), 16.69 MiB | 33.37 MiB/s Receiving objects: 35% (23231/66372), 16.69 MiB | 33.37 MiB/s Receiving objects: 36% (23894/66372), 16.69 MiB | 33.37 MiB/s Receiving objects: 37% (24558/66372), 16.69 MiB | 33.37 MiB/s Receiving objects: 38% (25222/66372), 16.69 MiB | 33.37 MiB/s Receiving objects: 39% (25886/66372), 16.69 MiB | 33.37 MiB/s Receiving objects: 40% (26549/66372), 16.69 MiB | 33.37 MiB/s Receiving objects: 41% (27213/66372), 16.69 MiB | 33.37 MiB/s Receiving objects: 42% (27877/66372), 16.69 MiB | 33.37 MiB/s Receiving objects: 43% (28540/66372), 16.69 MiB | 33.37 MiB/s Receiving objects: 44% (29204/66372), 16.69 MiB | 33.37 MiB/s Receiving objects: 45% (29868/66372), 16.69 MiB | 33.37 MiB/s Receiving objects: 46% (30532/66372), 16.69 MiB | 33.37 MiB/s Receiving objects: 47% (31195/66372), 16.69 MiB | 33.37 MiB/s Receiving objects: 48% (31859/66372), 16.69 MiB | 33.37 MiB/s Receiving objects: 49% (32523/66372), 16.69 MiB | 33.37 MiB/s Receiving objects: 50% (33186/66372), 16.69 MiB | 33.37 MiB/s Receiving objects: 51% (33850/66372), 16.69 MiB | 33.37 MiB/s Receiving objects: 51% (34229/66372), 34.60 MiB | 34.59 MiB/s Receiving objects: 52% (34514/66372), 34.60 MiB | 34.59 MiB/s Receiving objects: 53% (35178/66372), 34.60 MiB | 34.59 MiB/s Receiving objects: 54% (35841/66372), 34.60 MiB | 34.59 MiB/s Receiving objects: 55% (36505/66372), 34.60 MiB | 34.59 MiB/s Receiving objects: 56% (37169/66372), 34.60 MiB | 34.59 MiB/s Receiving objects: 57% (37833/66372), 34.60 MiB | 34.59 MiB/s Receiving objects: 58% (38496/66372), 34.60 MiB | 34.59 MiB/s Receiving objects: 59% (39160/66372), 34.60 MiB | 34.59 MiB/s Receiving objects: 60% (39824/66372), 34.60 MiB | 34.59 MiB/s Receiving objects: 61% (40487/66372), 34.60 MiB | 34.59 MiB/s Receiving objects: 62% (41151/66372), 34.60 MiB | 34.59 MiB/s Receiving objects: 63% (41815/66372), 34.60 MiB | 34.59 MiB/s Receiving objects: 64% (42479/66372), 34.60 MiB | 34.59 MiB/s Receiving objects: 65% (43142/66372), 34.60 MiB | 34.59 MiB/s Receiving objects: 66% (43806/66372), 34.60 MiB | 34.59 MiB/s Receiving objects: 67% (44470/66372), 52.47 MiB | 34.44 MiB/s Receiving objects: 68% (45133/66372), 52.47 MiB | 34.44 MiB/s Receiving objects: 69% (45797/66372), 52.47 MiB | 34.44 MiB/s Receiving objects: 70% (46461/66372), 52.47 MiB | 34.44 MiB/s Receiving objects: 71% (47125/66372), 52.47 MiB | 34.44 MiB/s Receiving objects: 72% (47788/66372), 52.47 MiB | 34.44 MiB/s Receiving objects: 73% (48452/66372), 52.47 MiB | 34.44 MiB/s Receiving objects: 74% (49116/66372), 52.47 MiB | 34.44 MiB/s Receiving objects: 75% (49779/66372), 52.47 MiB | 34.44 MiB/s Receiving objects: 76% (50443/66372), 52.47 MiB | 34.44 MiB/s Receiving objects: 76% (50491/66372), 52.47 MiB | 34.44 MiB/s Receiving objects: 77% (51107/66372), 71.21 MiB | 34.94 MiB/s Receiving objects: 78% (51771/66372), 71.21 MiB | 34.94 MiB/s Receiving objects: 79% (52434/66372), 71.21 MiB | 34.94 MiB/s Receiving objects: 80% (53098/66372), 71.21 MiB | 34.94 MiB/s Receiving objects: 81% (53762/66372), 71.21 MiB | 34.94 MiB/s Receiving objects: 82% (54426/66372), 71.21 MiB | 34.94 MiB/s Receiving objects: 83% (55089/66372), 71.21 MiB | 34.94 MiB/s Receiving objects: 84% (55753/66372), 71.21 MiB | 34.94 MiB/s Receiving objects: 85% (56417/66372), 71.21 MiB | 34.94 MiB/s Receiving objects: 86% (57080/66372), 71.21 MiB | 34.94 MiB/s Receiving objects: 87% (57744/66372), 71.21 MiB | 34.94 MiB/s Receiving objects: 88% (58408/66372), 71.21 MiB | 34.94 MiB/s Receiving objects: 89% (59072/66372), 71.21 MiB | 34.94 MiB/s Receiving objects: 90% (59735/66372), 71.21 MiB | 34.94 MiB/s Receiving objects: 91% (60399/66372), 71.21 MiB | 34.94 MiB/s Receiving objects: 92% (61063/66372), 71.21 MiB | 34.94 MiB/s Receiving objects: 93% (61726/66372), 71.21 MiB | 34.94 MiB/s Receiving objects: 94% (62390/66372), 71.21 MiB | 34.94 MiB/s Receiving objects: 95% (63054/66372), 71.21 MiB | 34.94 MiB/s Receiving objects: 96% (63718/66372), 71.21 MiB | 34.94 MiB/s Receiving objects: 97% (64381/66372), 71.21 MiB | 34.94 MiB/s Receiving objects: 98% (65045/66372), 71.21 MiB | 34.94 MiB/s Receiving objects: 99% (65709/66372), 89.02 MiB | 35.07 MiB/s remote: Total 66372 (delta 7314), reused 7279 (delta 6627), pack-reused 57328 (from 1)
  7. 6.52 s Receiving objects: 100% (66372/66372), 89.02 MiB | 35.07 MiB/s Receiving objects: 100% (66372/66372), 98.65 MiB | 35.04 MiB/s, done.
  8. 7.17 s Resolving deltas: 0% (0/46411) Resolving deltas: 1% (465/46411) Resolving deltas: 2% (929/46411) Resolving deltas: 3% (1393/46411) Resolving deltas: 4% (1857/46411) Resolving deltas: 5% (2322/46411) Resolving deltas: 6% (2785/46411) Resolving deltas: 7% (3249/46411) Resolving deltas: 8% (3713/46411) Resolving deltas: 9% (4177/46411) Resolving deltas: 10% (4642/46411) Resolving deltas: 11% (5106/46411) Resolving deltas: 12% (5570/46411) Resolving deltas: 13% (6035/46411) Resolving deltas: 14% (6498/46411) Resolving deltas: 15% (6962/46411) Resolving deltas: 16% (7426/46411) Resolving deltas: 17% (7890/46411) Resolving deltas: 18% (8354/46411) Resolving deltas: 19% (8819/46411) Resolving deltas: 20% (9283/46411) Resolving deltas: 21% (9748/46411) Resolving deltas: 22% (10211/46411) Resolving deltas: 23% (10675/46411) Resolving deltas: 24% (11139/46411) Resolving deltas: 25% (11603/46411) Resolving deltas: 26% (12068/46411) Resolving deltas: 27% (12532/46411) Resolving deltas: 28% (12996/46411) Resolving deltas: 29% (13460/46411) Resolving deltas: 30% (13924/46411) Resolving deltas: 31% (14388/46411) Resolving deltas: 32% (14852/46411) Resolving deltas: 33% (15316/46411) Resolving deltas: 34% (15780/46411) Resolving deltas: 35% (16244/46411) Resolving deltas: 36% (16708/46411) Resolving deltas: 37% (17173/46411) Resolving deltas: 38% (17637/46411) Resolving deltas: 39% (18101/46411) Resolving deltas: 40% (18565/46411) Resolving deltas: 41% (19029/46411) Resolving deltas: 42% (19493/46411) Resolving deltas: 43% (19957/46411) Resolving deltas: 44% (20421/46411) Resolving deltas: 45% (20885/46411) Resolving deltas: 46% (21352/46411) Resolving deltas: 47% (21814/46411) Resolving deltas: 48% (22278/46411) Resolving deltas: 49% (22742/46411) Resolving deltas: 50% (23207/46411) Resolving deltas: 51% (23670/46411) Resolving deltas: 52% (24134/46411) Resolving deltas: 53% (24600/46411) Resolving deltas: 54% (25062/46411) Resolving deltas: 55% (25527/46411) Resolving deltas: 56% (25991/46411) Resolving deltas: 57% (26456/46411) Resolving deltas: 58% (26919/46411) Resolving deltas: 59% (27383/46411) Resolving deltas: 60% (27849/46411) Resolving deltas: 61% (28315/46411) Resolving deltas: 62% (28777/46411) Resolving deltas: 63% (29239/46411) Resolving deltas: 64% (29704/46411) Resolving deltas: 65% (30168/46411) Resolving deltas: 66% (30634/46411) Resolving deltas: 67% (31096/46411) Resolving deltas: 68% (31560/46411) Resolving deltas: 69% (32024/46411) Resolving deltas: 70% (32488/46411) Resolving deltas: 71% (32952/46411) Resolving deltas: 72% (33416/46411) Resolving deltas: 73% (33881/46411) Resolving deltas: 74% (34345/46411) Resolving deltas: 75% (34809/46411) Resolving deltas: 76% (35273/46411) Resolving deltas: 77% (35738/46411) Resolving deltas: 78% (36203/46411) Resolving deltas: 79% (36665/46411) Resolving deltas: 80% (37129/46411) Resolving deltas: 81% (37593/46411) Resolving deltas: 82% (38058/46411) Resolving deltas: 83% (38522/46411) Resolving deltas: 84% (38988/46411) Resolving deltas: 85% (39450/46411) Resolving deltas: 86% (39914/46411) Resolving deltas: 87% (40378/46411) Resolving deltas: 88% (40842/46411) Resolving deltas: 89% (41306/46411) Resolving deltas: 90% (41770/46411) Resolving deltas: 91% (42235/46411) Resolving deltas: 92% (42699/46411) Resolving deltas: 93% (43163/46411) Resolving deltas: 94% (43628/46411) Resolving deltas: 95% (44091/46411) Resolving deltas: 96% (44556/46411) Resolving deltas: 97% (45020/46411) Resolving deltas: 98% (45483/46411) Resolving deltas: 99% (45947/46411) Resolving deltas: 100% (46411/46411) Resolving deltas: 100% (46411/46411), done.
  9. 7.47 s Fetching commit 63073375d37e632f4b7021a2cf030b3a85d47360 for feynkit ...
  10. 7.47 s $ /nix/store/bcnisk3ydfgv26v2gw3zlky24g00yww2-git-2.54.0/bin/git fetch origin 63073375d37e632f4b7021a2cf030b3a85d47360
  11. 7.88 s From https://github.com/alphal00p/gammaloop
  12. 7.88 s * branch 63073375d37e632f4b7021a2cf030b3a85d47360 -> FETCH_HEAD
  13. 7.89 s $ /nix/store/9ypz3flqsrl5xl495mm8h645gadjsxi1-coreutils-9.11/bin/timeout --kill-after=15s 7200s /nix/store/bcnisk3ydfgv26v2gw3zlky24g00yww2-git-2.54.0/bin/git -c advice.detachedHead=false checkout 63073375d37e632f4b7021a2cf030b3a85d47360
  14. 7.98 s HEAD is now at 63073375d make feynkit tensor reduction default
  15. 7.98 s $ /nix/store/9ypz3flqsrl5xl495mm8h645gadjsxi1-coreutils-9.11/bin/timeout --kill-after=15s 7200s /nix/store/23zk8sgzamrbmj1fday15szf7f2279s8-nix-2.34.7/bin/nix --extra-experimental-features nix-command --extra-experimental-features flakes --log-format internal-json run .#packages.x86_64-linux.nix-ci-check-gammaloop-nextest-python-api --print-build-logs
  16. 17.73 s
  17. 17.90 s Downloading cached nix-ci-check-gammaloop-nextest-python-api from https://cache.nix-ci.com
  18. 17.91 s Downloaded cached nix-ci-check-gammaloop-nextest-python-api (1104 B) in 13ms
  19. 17.91 s Progress: 0 of 1 built, 1 of 1 downloaded from cache
  20. 23.60 s evaluating derivation 'g copying '/nix/store/hphc evaluating derivation 'g
  21. 28.19 s copying '/nix/store/hphc evaluating derivation 'g copying '/nix/store/hphc evaluating derivation 'g copying '/nix/store/hphc evaluating derivation 'g copying '/nix/store/hphc evaluating derivation 'g copying '/nix/store/hphc evaluating derivation 'g copying '/nix/store/hphc evaluating derivation 'g copying '/nix/store/hphc evaluating derivation 'g copying '/nix/store/hphc evaluating derivation 'g querying gammaloop-nexte querying info about miss querying gammaloop-nexte [0/1 built, 0.0 KiB DL] [1/0/1 built, 0.0 KiB DLgammaloop-nextest-python-api> Extracting 1 binary, 1 build script output directory, and 3 linked paths to /build/nextest-archive-LFNGHa
  22. 28.25 s gammaloop-nextest-python-api> Extracted 18 files to /build/nextest-archive-LFNGHa in 0.06s
  23. 28.26 s gammaloop-nextest-python-api> ------------
  24. 28.26 s gammaloop-nextest-python-api> Nextest run ID eca58ccf-43e7-4881-a9b1-c8edde7e61b2 with nextest profile: ci_gammaloop
  25. 28.26 s gammaloop-nextest-python-api> Starting 5 tests across 1 binary
  26. 28.39 s gammaloop-nextest-python-api> FAIL [ 0.130s] (1/5) gammaloop-integration-tests::test_python_api python_evaluate_sample_honors_generate_events_and_observable_snapshots
  27. 28.39 s gammaloop-nextest-python-api> stdout ---
  28. 28.39 s gammaloop-nextest-python-api>
  29. 28.39 s gammaloop-nextest-python-api> running 1 test
  30. 28.39 s gammaloop-nextest-python-api> test python_evaluate_sample_honors_generate_events_and_observable_snapshots ... FAILED
  31. 28.39 s gammaloop-nextest-python-api>
  32. 28.39 s gammaloop-nextest-python-api> failures:
  33. 28.39 s gammaloop-nextest-python-api>
  34. 28.39 s gammaloop-nextest-python-api> failures:
  35. 28.39 s gammaloop-nextest-python-api> python_evaluate_sample_honors_generate_events_and_observable_snapshots
  36. 28.39 s gammaloop-nextest-python-api>
  37. 28.39 s gammaloop-nextest-python-api> test result: FAILED. 0 passed; 1 failed; 0 ignored; 0 measured; 4 filtered out; finished in 0.12s
  38. 28.39 s gammaloop-nextest-python-api>
  39. 28.39 s gammaloop-nextest-python-api> stderr ---
  40. 28.39 s gammaloop-nextest-python-api> Error: Python API test subprocess failed.
  41. 28.39 s gammaloop-nextest-python-api> stdout:
  42. 28.39 s gammaloop-nextest-python-api> ┌────────────────────────────────────────────────────────┐
  43. 28.39 s gammaloop-nextest-python-api> │ You are running a restricted Symbolica instance. │
  44. 28.39 s gammaloop-nextest-python-api> │ │
  45. 28.39 s gammaloop-nextest-python-api> │ This mode is only permitted for non-commercial use and │
  46. 28.39 s gammaloop-nextest-python-api> │ is limited to one instance and core per machine. │
  47. 28.39 s gammaloop-nextest-python-api> │ │
  48. 28.39 s gammaloop-nextest-python-api> │ Hobbyists can easily acquire a free license key │
  49. 28.39 s gammaloop-nextest-python-api> │ that unlocks all cores and removes this banner: │
  50. 28.39 s gammaloop-nextest-python-api> │ │
  51. 28.39 s gammaloop-nextest-python-api> │ from symbolica import * │
  52. 28.39 s gammaloop-nextest-python-api> │ request_hobbyist_license('YOUR_NAME', 'YOUR_EMAIL') │
  53. 28.39 s gammaloop-nextest-python-api> │ │
  54. 28.39 s gammaloop-nextest-python-api> │ All other users can obtain a free 30-day trial key: │
  55. 28.39 s gammaloop-nextest-python-api> │ │
  56. 28.39 s gammaloop-nextest-python-api> │ from symbolica import * │
  57. 28.39 s gammaloop-nextest-python-api> │ request_trial_license('NAME', 'EMAIL', 'EMPLOYER') │
  58. 28.39 s gammaloop-nextest-python-api> │ │
  59. 28.39 s gammaloop-nextest-python-api> │ See https://symbolica.io/docs/get_started.html#license │
  60. 28.39 s gammaloop-nextest-python-api> └────────────────────────────────────────────────────────┘
  61. 28.39 s gammaloop-nextest-python-api> ┌───────────────────────────────────────────────────────────────────────────────────────────────────────────┐
  62. 28.39 s gammaloop-nextest-python-api> │ Cannot start new unlicensed Symbolica instance since there is already another one running on the machine. │
  63. 28.39 s gammaloop-nextest-python-api> └───────────────────────────────────────────────────────────────────────────────────────────────────────────┘
  64. 28.39 s gammaloop-nextest-python-api>
  65. 28.39 s gammaloop-nextest-python-api> stderr:
  66. 28.39 s gammaloop-nextest-python-api> ┌───────────────────────────────────┐
  67. 28.39 s gammaloop-nextest-python-api> │ The Symbolica license has expired │
  68. 28.39 s gammaloop-nextest-python-api> └───────────────────────────────────┘
  69. 28.39 s gammaloop-nextest-python-api>
  70. 28.39 s gammaloop-nextest-python-api>
  71. 28.39 s gammaloop-nextest-python-api> Location:
  72. 28.39 s gammaloop-nextest-python-api> tests/tests/test_python_api.rs:157:20
  73. 28.39 s gammaloop-nextest-python-api>
  74. 28.39 s gammaloop-nextest-python-api> FAIL [ 0.136s] (2/5) gammaloop-integration-tests::test_python_api python_evaluate_samples_batch_and_momentum_space_have_expected_shape
  75. 28.39 s gammaloop-nextest-python-api> stdout ---
  76. 28.39 s gammaloop-nextest-python-api>
  77. 28.39 s gammaloop-nextest-python-api> running 1 test
  78. 28.39 s gammaloop-nextest-python-api> test python_evaluate_samples_batch_and_momentum_space_have_expected_shape ... FAILED
  79. 28.39 s gammaloop-nextest-python-api>
  80. 28.39 s gammaloop-nextest-python-api> failures:
  81. 28.39 s gammaloop-nextest-python-api>
  82. 28.39 s gammaloop-nextest-python-api> failures:
  83. 28.39 s gammaloop-nextest-python-api> python_evaluate_samples_batch_and_momentum_space_have_expected_shape
  84. 28.39 s gammaloop-nextest-python-api>
  85. 28.39 s gammaloop-nextest-python-api> test result: FAILED. 0 passed; 1 failed; 0 ignored; 0 measured; 4 filtered out; finished in 0.13s
  86. 28.39 s gammaloop-nextest-python-api>
  87. 28.39 s gammaloop-nextest-python-api> stderr ---
  88. 28.39 s gammaloop-nextest-python-api> Error: Python API test subprocess failed.
  89. 28.39 s gammaloop-nextest-python-api> stdout:
  90. 28.39 s gammaloop-nextest-python-api> ┌────────────────────────────────────────────────────────┐
  91. 28.39 s gammaloop-nextest-python-api> │ You are running a restricted Symbolica instance. │
  92. 28.39 s gammaloop-nextest-python-api> │ │
  93. 28.39 s gammaloop-nextest-python-api> │ This mode is only permitted for non-commercial use and │
  94. 28.39 s gammaloop-nextest-python-api> │ is limited to one instance and core per machine. │
  95. 28.39 s gammaloop-nextest-python-api> │ │
  96. 28.39 s gammaloop-nextest-python-api> │ Hobbyists can easily acquire a free license key │
  97. 28.39 s gammaloop-nextest-python-api> │ that unlocks all cores and removes this banner: │
  98. 28.39 s gammaloop-nextest-python-api> │ │
  99. 28.39 s gammaloop-nextest-python-api> │ from symbolica import * │
  100. 28.39 s gammaloop-nextest-python-api> │ request_hobbyist_license('YOUR_NAME', 'YOUR_EMAIL') │
  101. 28.39 s gammaloop-nextest-python-api> │ │
  102. 28.39 s gammaloop-nextest-python-api> │ All other users can obtain a free 30-day trial key: │
  103. 28.39 s gammaloop-nextest-python-api> │ │
  104. 28.39 s gammaloop-nextest-python-api> │ from symbolica import * │
  105. 28.39 s gammaloop-nextest-python-api> │ request_trial_license('NAME', 'EMAIL', 'EMPLOYER') │
  106. 28.39 s gammaloop-nextest-python-api> │ │
  107. 28.39 s gammaloop-nextest-python-api> │ See https://symbolica.io/docs/get_started.html#license │
  108. 28.39 s gammaloop-nextest-python-api> └────────────────────────────────────────────────────────┘
  109. 28.39 s gammaloop-nextest-python-api> ┌───────────────────────────────────────────────────────────────────────────────────────────────────────────┐
  110. 28.39 s gammaloop-nextest-python-api> │ Cannot start new unlicensed Symbolica instance since there is already another one running on the machine. │
  111. 28.39 s gammaloop-nextest-python-api> └───────────────────────────────────────────────────────────────────────────────────────────────────────────┘
  112. 28.39 s gammaloop-nextest-python-api>
  113. 28.39 s gammaloop-nextest-python-api> stderr:
  114. 28.39 s gammaloop-nextest-python-api> ┌───────────────────────────────────┐
  115. 28.39 s gammaloop-nextest-python-api> │ The Symbolica license has expired │
  116. 28.39 s gammaloop-nextest-python-api> └───────────────────────────────────┘
  117. 28.39 s gammaloop-nextest-python-api>
  118. 28.39 s gammaloop-nextest-python-api>
  119. 28.39 s gammaloop-nextest-python-api> Location:
  120. 28.39 s gammaloop-nextest-python-api> tests/tests/test_python_api.rs:157:20
  121. 28.39 s gammaloop-nextest-python-api>
  122. 28.40 s gammaloop-nextest-python-api> FAIL [ 0.140s] (3/5) gammaloop-integration-tests::test_python_api python_session_getters_return_live_toml_and_command_blocks
  123. 28.40 s gammaloop-nextest-python-api> stdout ---
  124. 28.40 s gammaloop-nextest-python-api>
  125. 28.40 s gammaloop-nextest-python-api> running 1 test
  126. 28.40 s gammaloop-nextest-python-api> test python_session_getters_return_live_toml_and_command_blocks ... FAILED
  127. 28.40 s gammaloop-nextest-python-api>
  128. 28.40 s gammaloop-nextest-python-api> failures:
  129. 28.40 s gammaloop-nextest-python-api>
  130. 28.40 s gammaloop-nextest-python-api> failures:
  131. 28.40 s gammaloop-nextest-python-api> python_session_getters_return_live_toml_and_command_blocks
  132. 28.40 s gammaloop-nextest-python-api>
  133. 28.40 s gammaloop-nextest-python-api> test result: FAILED. 0 passed; 1 failed; 0 ignored; 0 measured; 4 filtered out; finished in 0.13s
  134. 28.40 s gammaloop-nextest-python-api>
  135. 28.40 s gammaloop-nextest-python-api> stderr ---
  136. 28.40 s gammaloop-nextest-python-api> Error: Python API test subprocess failed.
  137. 28.40 s gammaloop-nextest-python-api> stdout:
  138. 28.40 s gammaloop-nextest-python-api> ┌────────────────────────────────────────────────────────┐
  139. 28.40 s gammaloop-nextest-python-api> │ You are running a restricted Symbolica instance. │
  140. 28.40 s gammaloop-nextest-python-api> │ │
  141. 28.40 s gammaloop-nextest-python-api> │ This mode is only permitted for non-commercial use and │
  142. 28.40 s gammaloop-nextest-python-api> │ is limited to one instance and core per machine. │
  143. 28.40 s gammaloop-nextest-python-api> │ │
  144. 28.40 s gammaloop-nextest-python-api> │ Hobbyists can easily acquire a free license key │
  145. 28.40 s gammaloop-nextest-python-api> │ that unlocks all cores and removes this banner: │
  146. 28.40 s gammaloop-nextest-python-api> │ │
  147. 28.40 s gammaloop-nextest-python-api> │ from symbolica import * │
  148. 28.40 s gammaloop-nextest-python-api> │ request_hobbyist_license('YOUR_NAME', 'YOUR_EMAIL') │
  149. 28.40 s gammaloop-nextest-python-api> │ │
  150. 28.40 s gammaloop-nextest-python-api> │ All other users can obtain a free 30-day trial key: │
  151. 28.40 s gammaloop-nextest-python-api> │ │
  152. 28.40 s gammaloop-nextest-python-api> │ from symbolica import * │
  153. 28.40 s gammaloop-nextest-python-api> │ request_trial_license('NAME', 'EMAIL', 'EMPLOYER') │
  154. 28.40 s gammaloop-nextest-python-api> │ │
  155. 28.40 s gammaloop-nextest-python-api> │ See https://symbolica.io/docs/get_started.html#license │
  156. 28.40 s gammaloop-nextest-python-api> └────────────────────────────────────────────────────────┘
  157. 28.40 s gammaloop-nextest-python-api> ┌───────────────────────────────────────────────────────────────────────────────────────────────────────────┐
  158. 28.40 s gammaloop-nextest-python-api> │ Cannot start new unlicensed Symbolica instance since there is already another one running on the machine. │
  159. 28.40 s gammaloop-nextest-python-api> └───────────────────────────────────────────────────────────────────────────────────────────────────────────┘
  160. 28.40 s gammaloop-nextest-python-api>
  161. 28.40 s gammaloop-nextest-python-api> stderr:
  162. 28.40 s gammaloop-nextest-python-api> ┌───────────────────────────────────┐
  163. 28.40 s gammaloop-nextest-python-api> │ The Symbolica license has expired │
  164. 28.40 s gammaloop-nextest-python-api> └───────────────────────────────────┘
  165. 28.40 s gammaloop-nextest-python-api>
  166. 28.40 s gammaloop-nextest-python-api>
  167. 28.40 s gammaloop-nextest-python-api> Location:
  168. 28.40 s gammaloop-nextest-python-api> tests/tests/test_python_api.rs:157:20
  169. 28.40 s gammaloop-nextest-python-api>
  170. 28.47 s gammaloop-nextest-python-api> FAIL [ 0.212s] (4/5) gammaloop-integration-tests::test_python_api python_settings_wrappers_expose_nested_runtime_and_global_settings
  171. 28.47 s gammaloop-nextest-python-api> stdout ---
  172. 28.47 s gammaloop-nextest-python-api>
  173. 28.47 s gammaloop-nextest-python-api> running 1 test
  174. 28.47 s gammaloop-nextest-python-api> test python_settings_wrappers_expose_nested_runtime_and_global_settings ... FAILED
  175. 28.47 s gammaloop-nextest-python-api>
  176. 28.47 s gammaloop-nextest-python-api> failures:
  177. 28.47 s gammaloop-nextest-python-api>
  178. 28.47 s gammaloop-nextest-python-api> failures:
  179. 28.47 s gammaloop-nextest-python-api> python_settings_wrappers_expose_nested_runtime_and_global_settings
  180. 28.47 s gammaloop-nextest-python-api>
  181. 28.47 s gammaloop-nextest-python-api> test result: FAILED. 0 passed; 1 failed; 0 ignored; 0 measured; 4 filtered out; finished in 0.21s
  182. 28.47 s gammaloop-nextest-python-api>
  183. 28.47 s gammaloop-nextest-python-api> stderr ---
  184. 28.47 s gammaloop-nextest-python-api> Error: Python API test subprocess failed.
  185. 28.47 s gammaloop-nextest-python-api> stdout:
  186. 28.47 s gammaloop-nextest-python-api> ┌────────────────────────────────────────────────────────┐
  187. 28.47 s gammaloop-nextest-python-api> │ You are running a restricted Symbolica instance. │
  188. 28.47 s gammaloop-nextest-python-api> │ │
  189. 28.47 s gammaloop-nextest-python-api> │ This mode is only permitted for non-commercial use and │
  190. 28.47 s gammaloop-nextest-python-api> │ is limited to one instance and core per machine. │
  191. 28.47 s gammaloop-nextest-python-api> │ │
  192. 28.47 s gammaloop-nextest-python-api> │ Hobbyists can easily acquire a free license key │
  193. 28.47 s gammaloop-nextest-python-api> │ that unlocks all cores and removes this banner: │
  194. 28.47 s gammaloop-nextest-python-api> │ │
  195. 28.47 s gammaloop-nextest-python-api> │ from symbolica import * │
  196. 28.47 s gammaloop-nextest-python-api> │ request_hobbyist_license('YOUR_NAME', 'YOUR_EMAIL') │
  197. 28.47 s gammaloop-nextest-python-api> │ │
  198. 28.47 s gammaloop-nextest-python-api> │ All other users can obtain a free 30-day trial key: │
  199. 28.47 s gammaloop-nextest-python-api> │ │
  200. 28.47 s gammaloop-nextest-python-api> │ from symbolica import * │
  201. 28.47 s gammaloop-nextest-python-api> │ request_trial_license('NAME', 'EMAIL', 'EMPLOYER') │
  202. 28.47 s gammaloop-nextest-python-api> │ │
  203. 28.47 s gammaloop-nextest-python-api> │ See https://symbolica.io/docs/get_started.html#license │
  204. 28.47 s gammaloop-nextest-python-api> └────────────────────────────────────────────────────────┘
  205. 28.47 s gammaloop-nextest-python-api> ┌───────────────────────────────────────────────────────────────────────────────────────────────────────────┐
  206. 28.47 s gammaloop-nextest-python-api> │ Cannot start new unlicensed Symbolica instance since there is already another one running on the machine. │
  207. 28.47 s gammaloop-nextest-python-api> └───────────────────────────────────────────────────────────────────────────────────────────────────────────┘
  208. 28.47 s gammaloop-nextest-python-api>
  209. 28.47 s gammaloop-nextest-python-api> stderr:
  210. 28.47 s gammaloop-nextest-python-api> ┌───────────────────────────────────┐
  211. 28.47 s gammaloop-nextest-python-api> │ The Symbolica license has expired │
  212. 28.47 s gammaloop-nextest-python-api> └───────────────────────────────────┘
  213. 28.47 s gammaloop-nextest-python-api>
  214. 28.47 s gammaloop-nextest-python-api>
  215. 28.47 s gammaloop-nextest-python-api> Location:
  216. 28.47 s gammaloop-nextest-python-api> tests/tests/test_python_api.rs:157:20
  217. 28.47 s gammaloop-nextest-python-api>
  218. 28.56 s gammaloop-nextest-python-api> FAIL [ 0.300s] (5/5) gammaloop-integration-tests::test_python_api python_evaluate_sample_preserves_graph_grouping_and_incoming_pdgs
  219. 28.56 s gammaloop-nextest-python-api> stdout ---
  220. 28.56 s gammaloop-nextest-python-api>
  221. 28.56 s gammaloop-nextest-python-api> running 1 test
  222. 28.56 s gammaloop-nextest-python-api> test python_evaluate_sample_preserves_graph_grouping_and_incoming_pdgs ... FAILED
  223. 28.56 s gammaloop-nextest-python-api>
  224. 28.56 s gammaloop-nextest-python-api> failures:
  225. 28.56 s gammaloop-nextest-python-api>
  226. 28.56 s gammaloop-nextest-python-api> failures:
  227. 28.56 s gammaloop-nextest-python-api> python_evaluate_sample_preserves_graph_grouping_and_incoming_pdgs
  228. 28.56 s gammaloop-nextest-python-api>
  229. 28.56 s gammaloop-nextest-python-api> test result: FAILED. 0 passed; 1 failed; 0 ignored; 0 measured; 4 filtered out; finished in 0.29s
  230. 28.56 s gammaloop-nextest-python-api>
  231. 28.56 s gammaloop-nextest-python-api> stderr ---
  232. 28.56 s gammaloop-nextest-python-api> Error: Python API test subprocess failed.
  233. 28.56 s gammaloop-nextest-python-api> stdout:
  234. 28.56 s gammaloop-nextest-python-api> ┌────────────────────────────────────────────────────────┐
  235. 28.56 s gammaloop-nextest-python-api> │ You are running a restricted Symbolica instance. │
  236. 28.56 s gammaloop-nextest-python-api> │ │
  237. 28.56 s gammaloop-nextest-python-api> │ This mode is only permitted for non-commercial use and │
  238. 28.56 s gammaloop-nextest-python-api> │ is limited to one instance and core per machine. │
  239. 28.56 s gammaloop-nextest-python-api> │ │
  240. 28.56 s gammaloop-nextest-python-api> │ Hobbyists can easily acquire a free license key │
  241. 28.56 s gammaloop-nextest-python-api> │ that unlocks all cores and removes this banner: │
  242. 28.56 s gammaloop-nextest-python-api> │ │
  243. 28.56 s gammaloop-nextest-python-api> │ from symbolica import * │
  244. 28.56 s gammaloop-nextest-python-api> │ request_hobbyist_license('YOUR_NAME', 'YOUR_EMAIL') │
  245. 28.56 s gammaloop-nextest-python-api> │ │
  246. 28.56 s gammaloop-nextest-python-api> │ All other users can obtain a free 30-day trial key: │
  247. 28.56 s gammaloop-nextest-python-api> │ │
  248. 28.56 s gammaloop-nextest-python-api> │ from symbolica import * │
  249. 28.56 s gammaloop-nextest-python-api> │ request_trial_license('NAME', 'EMAIL', 'EMPLOYER') │
  250. 28.56 s gammaloop-nextest-python-api> │ │
  251. 28.56 s gammaloop-nextest-python-api> │ See https://symbolica.io/docs/get_started.html#license │
  252. 28.56 s gammaloop-nextest-python-api> └────────────────────────────────────────────────────────┘
  253. 28.56 s gammaloop-nextest-python-api> ┌───────────────────────────────────────────────────────────────────────────────────────────────────────────┐
  254. 28.56 s gammaloop-nextest-python-api> │ Cannot start new unlicensed Symbolica instance since there is already another one running on the machine. │
  255. 28.56 s gammaloop-nextest-python-api> └───────────────────────────────────────────────────────────────────────────────────────────────────────────┘
  256. 28.56 s gammaloop-nextest-python-api>
  257. 28.56 s gammaloop-nextest-python-api> stderr:
  258. 28.56 s gammaloop-nextest-python-api> ┌───────────────────────────────────┐
  259. 28.56 s gammaloop-nextest-python-api> │ The Symbolica license has expired │
  260. 28.56 s gammaloop-nextest-python-api> └───────────────────────────────────┘
  261. 28.56 s gammaloop-nextest-python-api> [2026-09-01 22:09:21.894] @gammaloop_api::se... INFO : Running command import model sm-default
  262. 28.56 s gammaloop-nextest-python-api> [2026-09-01 22:09:21.894] @import::model INFO : Loading built-in JSON model sm-default
  263. 28.56 s gammaloop-nextest-python-api> [2026-09-01 22:09:21.907] @gammaloop_api::se... INFO : Running command set default-runtime kv kinematics.externals='{"type":"constant","data":{"momenta":[[32.0,0.0,0.0,32.0],[32.0,0.0,0.0,-32.0]],"helicities":[1,1]}}'
  264. 28.56 s gammaloop-nextest-python-api> [2026-09-01 22:09:21.907] @gammaloop_api::se... INFO : Running command set default-runtime kv subtraction.disable_threshold_subtraction=true
  265. 28.56 s gammaloop-nextest-python-api> [2026-09-01 22:09:21.908] @gammaloop_api::se... INFO : Running command generate xs e+ e- > d d~ g | e- a d g QED^2==4 [{{2}} QCD=0] --numerator-grouping group_identical_graphs_up_to_sign --clear-existing-processes --only-diagrams
  266. 28.56 s gammaloop-nextest-python-api> [2026-09-01 22:09:22.049] @commands::generate INFO : Generated cross-section 2 graphs.
  267. 28.56 s gammaloop-nextest-python-api> [2026-09-01 22:09:22.050] @commands::generate INFO : Only diagram generation was requested, skipping integrand generation. You can generate integrands later using the 'generate existing <options>' command.
  268. 28.56 s gammaloop-nextest-python-api> [2026-09-01 22:09:22.050] @gammaloop_api::se... INFO : Running command generate
  269. 28.56 s gammaloop-nextest-python-api>
  270. 28.56 s gammaloop-nextest-python-api>
  271. 28.56 s gammaloop-nextest-python-api> Location:
  272. 28.56 s gammaloop-nextest-python-api> tests/tests/test_python_api.rs:157:20
  273. 28.56 s gammaloop-nextest-python-api>
  274. 28.56 s gammaloop-nextest-python-api> ------------
  275. 28.56 s gammaloop-nextest-python-api> Summary [ 0.301s] 5 tests run: 0 passed, 5 failed, 0 skipped
  276. 28.56 s gammaloop-nextest-python-api> FAIL [ 0.130s] (1/5) gammaloop-integration-tests::test_python_api python_evaluate_sample_honors_generate_events_and_observable_snapshots
  277. 28.56 s gammaloop-nextest-python-api> stdout ---
  278. 28.56 s gammaloop-nextest-python-api>
  279. 28.56 s gammaloop-nextest-python-api> running 1 test
  280. 28.56 s gammaloop-nextest-python-api> test python_evaluate_sample_honors_generate_events_and_observable_snapshots ... FAILED
  281. 28.56 s gammaloop-nextest-python-api>
  282. 28.56 s gammaloop-nextest-python-api> failures:
  283. 28.56 s gammaloop-nextest-python-api>
  284. 28.56 s gammaloop-nextest-python-api> failures:
  285. 28.56 s gammaloop-nextest-python-api> python_evaluate_sample_honors_generate_events_and_observable_snapshots
  286. 28.56 s gammaloop-nextest-python-api>
  287. 28.56 s gammaloop-nextest-python-api> test result: FAILED. 0 passed; 1 failed; 0 ignored; 0 measured; 4 filtered out; finished in 0.12s
  288. 28.56 s gammaloop-nextest-python-api>
  289. 28.56 s gammaloop-nextest-python-api> stderr ---
  290. 28.56 s gammaloop-nextest-python-api> Error: Python API test subprocess failed.
  291. 28.56 s gammaloop-nextest-python-api> stdout:
  292. 28.56 s gammaloop-nextest-python-api> ┌────────────────────────────────────────────────────────┐
  293. 28.56 s gammaloop-nextest-python-api> │ You are running a restricted Symbolica instance. │
  294. 28.56 s gammaloop-nextest-python-api> │ │
  295. 28.56 s gammaloop-nextest-python-api> │ This mode is only permitted for non-commercial use and │
  296. 28.56 s gammaloop-nextest-python-api> │ is limited to one instance and core per machine. │
  297. 28.56 s gammaloop-nextest-python-api> │ │
  298. 28.56 s gammaloop-nextest-python-api> │ Hobbyists can easily acquire a free license key │
  299. 28.56 s gammaloop-nextest-python-api> │ that unlocks all cores and removes this banner: │
  300. 28.56 s gammaloop-nextest-python-api> │ │
  301. 28.56 s gammaloop-nextest-python-api> │ from symbolica import * │
  302. 28.56 s gammaloop-nextest-python-api> │ request_hobbyist_license('YOUR_NAME', 'YOUR_EMAIL') │
  303. 28.56 s gammaloop-nextest-python-api> │ │
  304. 28.56 s gammaloop-nextest-python-api> │ All other users can obtain a free 30-day trial key: │
  305. 28.56 s gammaloop-nextest-python-api> │ │
  306. 28.56 s gammaloop-nextest-python-api> │ from symbolica import * │
  307. 28.56 s gammaloop-nextest-python-api> │ request_trial_license('NAME', 'EMAIL', 'EMPLOYER') │
  308. 28.56 s gammaloop-nextest-python-api> │ │
  309. 28.56 s gammaloop-nextest-python-api> │ See https://symbolica.io/docs/get_started.html#license │
  310. 28.56 s gammaloop-nextest-python-api> └────────────────────────────────────────────────────────┘
  311. 28.56 s gammaloop-nextest-python-api> ┌───────────────────────────────────────────────────────────────────────────────────────────────────────────┐
  312. 28.56 s gammaloop-nextest-python-api> │ Cannot start new unlicensed Symbolica instance since there is already another one running on the machine. │
  313. 28.56 s gammaloop-nextest-python-api> └───────────────────────────────────────────────────────────────────────────────────────────────────────────┘
  314. 28.56 s gammaloop-nextest-python-api>
  315. 28.56 s gammaloop-nextest-python-api> stderr:
  316. 28.56 s gammaloop-nextest-python-api> ┌───────────────────────────────────┐
  317. 28.56 s gammaloop-nextest-python-api> │ The Symbolica license has expired │
  318. 28.56 s gammaloop-nextest-python-api> └───────────────────────────────────┘
  319. 28.56 s gammaloop-nextest-python-api>
  320. 28.56 s gammaloop-nextest-python-api>
  321. 28.56 s gammaloop-nextest-python-api> Location:
  322. 28.56 s gammaloop-nextest-python-api> tests/tests/test_python_api.rs:157:20
  323. 28.56 s gammaloop-nextest-python-api>
  324. 28.56 s gammaloop-nextest-python-api> FAIL [ 0.136s] (2/5) gammaloop-integration-tests::test_python_api python_evaluate_samples_batch_and_momentum_space_have_expected_shape
  325. 28.56 s gammaloop-nextest-python-api> stdout ---
  326. 28.56 s gammaloop-nextest-python-api>
  327. 28.56 s gammaloop-nextest-python-api> running 1 test
  328. 28.56 s gammaloop-nextest-python-api> test python_evaluate_samples_batch_and_momentum_space_have_expected_shape ... FAILED
  329. 28.56 s gammaloop-nextest-python-api>
  330. 28.56 s gammaloop-nextest-python-api> failures:
  331. 28.56 s gammaloop-nextest-python-api>
  332. 28.56 s gammaloop-nextest-python-api> failures:
  333. 28.56 s gammaloop-nextest-python-api> python_evaluate_samples_batch_and_momentum_space_have_expected_shape
  334. 28.56 s gammaloop-nextest-python-api>
  335. 28.56 s gammaloop-nextest-python-api> test result: FAILED. 0 passed; 1 failed; 0 ignored; 0 measured; 4 filtered out; finished in 0.13s
  336. 28.56 s gammaloop-nextest-python-api>
  337. 28.56 s gammaloop-nextest-python-api> stderr ---
  338. 28.56 s gammaloop-nextest-python-api> Error: Python API test subprocess failed.
  339. 28.56 s gammaloop-nextest-python-api> stdout:
  340. 28.56 s gammaloop-nextest-python-api> ┌────────────────────────────────────────────────────────┐
  341. 28.56 s gammaloop-nextest-python-api> │ You are running a restricted Symbolica instance. │
  342. 28.56 s gammaloop-nextest-python-api> │ │
  343. 28.56 s gammaloop-nextest-python-api> │ This mode is only permitted for non-commercial use and │
  344. 28.56 s gammaloop-nextest-python-api> │ is limited to one instance and core per machine. │
  345. 28.56 s gammaloop-nextest-python-api> │ │
  346. 28.56 s gammaloop-nextest-python-api> │ Hobbyists can easily acquire a free license key │
  347. 28.56 s gammaloop-nextest-python-api> │ that unlocks all cores and removes this banner: │
  348. 28.56 s gammaloop-nextest-python-api> │ │
  349. 28.56 s gammaloop-nextest-python-api> │ from symbolica import * │
  350. 28.56 s gammaloop-nextest-python-api> │ request_hobbyist_license('YOUR_NAME', 'YOUR_EMAIL') │
  351. 28.56 s gammaloop-nextest-python-api> │ │
  352. 28.56 s gammaloop-nextest-python-api> │ All other users can obtain a free 30-day trial key: │
  353. 28.56 s gammaloop-nextest-python-api> │ │
  354. 28.56 s gammaloop-nextest-python-api> │ from symbolica import * │
  355. 28.56 s gammaloop-nextest-python-api> │ request_trial_license('NAME', 'EMAIL', 'EMPLOYER') │
  356. 28.56 s gammaloop-nextest-python-api> │ │
  357. 28.56 s gammaloop-nextest-python-api> │ See https://symbolica.io/docs/get_started.html#license │
  358. 28.56 s gammaloop-nextest-python-api> └────────────────────────────────────────────────────────┘
  359. 28.56 s gammaloop-nextest-python-api> ┌───────────────────────────────────────────────────────────────────────────────────────────────────────────┐
  360. 28.56 s gammaloop-nextest-python-api> │ Cannot start new unlicensed Symbolica instance since there is already another one running on the machine. │
  361. 28.56 s gammaloop-nextest-python-api> └───────────────────────────────────────────────────────────────────────────────────────────────────────────┘
  362. 28.56 s gammaloop-nextest-python-api>
  363. 28.56 s gammaloop-nextest-python-api> stderr:
  364. 28.56 s gammaloop-nextest-python-api> ┌───────────────────────────────────┐
  365. 28.56 s gammaloop-nextest-python-api> │ The Symbolica license has expired │
  366. 28.56 s gammaloop-nextest-python-api> └───────────────────────────────────┘
  367. 28.56 s gammaloop-nextest-python-api>
  368. 28.56 s gammaloop-nextest-python-api>
  369. 28.56 s gammaloop-nextest-python-api> Location:
  370. 28.56 s gammaloop-nextest-python-api> tests/tests/test_python_api.rs:157:20
  371. 28.56 s gammaloop-nextest-python-api>
  372. 28.56 s gammaloop-nextest-python-api> FAIL [ 0.140s] (3/5) gammaloop-integration-tests::test_python_api python_session_getters_return_live_toml_and_command_blocks
  373. 28.56 s gammaloop-nextest-python-api> stdout ---
  374. 28.56 s gammaloop-nextest-python-api>
  375. 28.56 s gammaloop-nextest-python-api> running 1 test
  376. 28.56 s gammaloop-nextest-python-api> test python_session_getters_return_live_toml_and_command_blocks ... FAILED
  377. 28.56 s gammaloop-nextest-python-api>
  378. 28.56 s gammaloop-nextest-python-api> failures:
  379. 28.56 s gammaloop-nextest-python-api>
  380. 28.56 s gammaloop-nextest-python-api> failures:
  381. 28.56 s gammaloop-nextest-python-api> python_session_getters_return_live_toml_and_command_blocks
  382. 28.56 s gammaloop-nextest-python-api>
  383. 28.56 s gammaloop-nextest-python-api> test result: FAILED. 0 passed; 1 failed; 0 ignored; 0 measured; 4 filtered out; finished in 0.13s
  384. 28.56 s gammaloop-nextest-python-api>
  385. 28.56 s gammaloop-nextest-python-api> stderr ---
  386. 28.56 s gammaloop-nextest-python-api> Error: Python API test subprocess failed.
  387. 28.56 s gammaloop-nextest-python-api> stdout:
  388. 28.56 s gammaloop-nextest-python-api> ┌────────────────────────────────────────────────────────┐
  389. 28.56 s gammaloop-nextest-python-api> │ You are running a restricted Symbolica instance. │
  390. 28.56 s gammaloop-nextest-python-api> │ │
  391. 28.56 s gammaloop-nextest-python-api> │ This mode is only permitted for non-commercial use and │
  392. 28.56 s gammaloop-nextest-python-api> │ is limited to one instance and core per machine. │
  393. 28.56 s gammaloop-nextest-python-api> │ │
  394. 28.56 s gammaloop-nextest-python-api> │ Hobbyists can easily acquire a free license key │
  395. 28.56 s gammaloop-nextest-python-api> │ that unlocks all cores and removes this banner: │
  396. 28.56 s gammaloop-nextest-python-api> │ │
  397. 28.56 s gammaloop-nextest-python-api> │ from symbolica import * │
  398. 28.56 s gammaloop-nextest-python-api> │ request_hobbyist_license('YOUR_NAME', 'YOUR_EMAIL') │
  399. 28.56 s gammaloop-nextest-python-api> │ │
  400. 28.56 s gammaloop-nextest-python-api> │ All other users can obtain a free 30-day trial key: │
  401. 28.56 s gammaloop-nextest-python-api> │ │
  402. 28.56 s gammaloop-nextest-python-api> │ from symbolica import * │
  403. 28.56 s gammaloop-nextest-python-api> │ request_trial_license('NAME', 'EMAIL', 'EMPLOYER') │
  404. 28.56 s gammaloop-nextest-python-api> │ │
  405. 28.56 s gammaloop-nextest-python-api> │ See https://symbolica.io/docs/get_started.html#license │
  406. 28.56 s gammaloop-nextest-python-api> └────────────────────────────────────────────────────────┘
  407. 28.56 s gammaloop-nextest-python-api> ┌───────────────────────────────────────────────────────────────────────────────────────────────────────────┐
  408. 28.56 s gammaloop-nextest-python-api> │ Cannot start new unlicensed Symbolica instance since there is already another one running on the machine. │
  409. 28.56 s gammaloop-nextest-python-api> └───────────────────────────────────────────────────────────────────────────────────────────────────────────┘
  410. 28.56 s gammaloop-nextest-python-api>
  411. 28.56 s gammaloop-nextest-python-api> stderr:
  412. 28.56 s gammaloop-nextest-python-api> ┌───────────────────────────────────┐
  413. 28.56 s gammaloop-nextest-python-api> │ The Symbolica license has expired │
  414. 28.56 s gammaloop-nextest-python-api> └───────────────────────────────────┘
  415. 28.56 s gammaloop-nextest-python-api>
  416. 28.56 s gammaloop-nextest-python-api>
  417. 28.56 s gammaloop-nextest-python-api> Location:
  418. 28.56 s gammaloop-nextest-python-api> tests/tests/test_python_api.rs:157:20
  419. 28.56 s gammaloop-nextest-python-api>
  420. 28.56 s gammaloop-nextest-python-api> FAIL [ 0.212s] (4/5) gammaloop-integration-tests::test_python_api python_settings_wrappers_expose_nested_runtime_and_global_settings
  421. 28.56 s gammaloop-nextest-python-api> stdout ---
  422. 28.56 s gammaloop-nextest-python-api>
  423. 28.56 s gammaloop-nextest-python-api> running 1 test
  424. 28.56 s gammaloop-nextest-python-api> test python_settings_wrappers_expose_nested_runtime_and_global_settings ... FAILED
  425. 28.56 s gammaloop-nextest-python-api>
  426. 28.56 s gammaloop-nextest-python-api> failures:
  427. 28.56 s gammaloop-nextest-python-api>
  428. 28.56 s gammaloop-nextest-python-api> failures:
  429. 28.56 s gammaloop-nextest-python-api> python_settings_wrappers_expose_nested_runtime_and_global_settings
  430. 28.56 s gammaloop-nextest-python-api>
  431. 28.56 s gammaloop-nextest-python-api> test result: FAILED. 0 passed; 1 failed; 0 ignored; 0 measured; 4 filtered out; finished in 0.21s
  432. 28.56 s gammaloop-nextest-python-api>
  433. 28.56 s gammaloop-nextest-python-api> stderr ---
  434. 28.56 s gammaloop-nextest-python-api> Error: Python API test subprocess failed.
  435. 28.56 s gammaloop-nextest-python-api> stdout:
  436. 28.56 s gammaloop-nextest-python-api> ┌────────────────────────────────────────────────────────┐
  437. 28.56 s gammaloop-nextest-python-api> │ You are running a restricted Symbolica instance. │
  438. 28.56 s gammaloop-nextest-python-api> │ │
  439. 28.56 s gammaloop-nextest-python-api> │ This mode is only permitted for non-commercial use and │
  440. 28.56 s gammaloop-nextest-python-api> │ is limited to one instance and core per machine. │
  441. 28.56 s gammaloop-nextest-python-api> │ │
  442. 28.56 s gammaloop-nextest-python-api> │ Hobbyists can easily acquire a free license key │
  443. 28.56 s gammaloop-nextest-python-api> │ that unlocks all cores and removes this banner: │
  444. 28.56 s gammaloop-nextest-python-api> │ │
  445. 28.56 s gammaloop-nextest-python-api> │ from symbolica import * │
  446. 28.56 s gammaloop-nextest-python-api> │ request_hobbyist_license('YOUR_NAME', 'YOUR_EMAIL') │
  447. 28.56 s gammaloop-nextest-python-api> │ │
  448. 28.56 s gammaloop-nextest-python-api> │ All other users can obtain a free 30-day trial key: │
  449. 28.56 s gammaloop-nextest-python-api> │ │
  450. 28.56 s gammaloop-nextest-python-api> │ from symbolica import * │
  451. 28.56 s gammaloop-nextest-python-api> │ request_trial_license('NAME', 'EMAIL', 'EMPLOYER') │
  452. 28.56 s gammaloop-nextest-python-api> │ │
  453. 28.56 s gammaloop-nextest-python-api> │ See https://symbolica.io/docs/get_started.html#license │
  454. 28.56 s gammaloop-nextest-python-api> └────────────────────────────────────────────────────────┘
  455. 28.56 s gammaloop-nextest-python-api> ┌───────────────────────────────────────────────────────────────────────────────────────────────────────────┐
  456. 28.56 s gammaloop-nextest-python-api> │ Cannot start new unlicensed Symbolica instance since there is already another one running on the machine. │
  457. 28.56 s gammaloop-nextest-python-api> └───────────────────────────────────────────────────────────────────────────────────────────────────────────┘
  458. 28.56 s gammaloop-nextest-python-api>
  459. 28.56 s gammaloop-nextest-python-api> stderr:
  460. 28.56 s gammaloop-nextest-python-api> ┌───────────────────────────────────┐
  461. 28.56 s gammaloop-nextest-python-api> │ The Symbolica license has expired │
  462. 28.56 s gammaloop-nextest-python-api> └───────────────────────────────────┘
  463. 28.56 s gammaloop-nextest-python-api>
  464. 28.56 s gammaloop-nextest-python-api>
  465. 28.56 s gammaloop-nextest-python-api> Location:
  466. 28.56 s gammaloop-nextest-python-api> tests/tests/test_python_api.rs:157:20
  467. 28.56 s gammaloop-nextest-python-api>
  468. 28.56 s gammaloop-nextest-python-api> FAIL [ 0.300s] (5/5) gammaloop-integration-tests::test_python_api python_evaluate_sample_preserves_graph_grouping_and_incoming_pdgs
  469. 28.56 s gammaloop-nextest-python-api> stdout ---
  470. 28.56 s gammaloop-nextest-python-api>
  471. 28.56 s gammaloop-nextest-python-api> running 1 test
  472. 28.56 s gammaloop-nextest-python-api> test python_evaluate_sample_preserves_graph_grouping_and_incoming_pdgs ... FAILED
  473. 28.56 s gammaloop-nextest-python-api>
  474. 28.56 s gammaloop-nextest-python-api> failures:
  475. 28.56 s gammaloop-nextest-python-api>
  476. 28.56 s gammaloop-nextest-python-api> failures:
  477. 28.56 s gammaloop-nextest-python-api> python_evaluate_sample_preserves_graph_grouping_and_incoming_pdgs
  478. 28.56 s gammaloop-nextest-python-api>
  479. 28.56 s gammaloop-nextest-python-api> test result: FAILED. 0 passed; 1 failed; 0 ignored; 0 measured; 4 filtered out; finished in 0.29s
  480. 28.56 s gammaloop-nextest-python-api>
  481. 28.56 s gammaloop-nextest-python-api> stderr ---
  482. 28.56 s gammaloop-nextest-python-api> Error: Python API test subprocess failed.
  483. 28.56 s gammaloop-nextest-python-api> stdout:
  484. 28.56 s gammaloop-nextest-python-api> ┌────────────────────────────────────────────────────────┐
  485. 28.56 s gammaloop-nextest-python-api> │ You are running a restricted Symbolica instance. │
  486. 28.56 s gammaloop-nextest-python-api> │ │
  487. 28.56 s gammaloop-nextest-python-api> │ This mode is only permitted for non-commercial use and │
  488. 28.56 s gammaloop-nextest-python-api> │ is limited to one instance and core per machine. │
  489. 28.56 s gammaloop-nextest-python-api> │ │
  490. 28.56 s gammaloop-nextest-python-api> │ Hobbyists can easily acquire a free license key │
  491. 28.56 s gammaloop-nextest-python-api> │ that unlocks all cores and removes this banner: │
  492. 28.56 s gammaloop-nextest-python-api> │ │
  493. 28.56 s gammaloop-nextest-python-api> │ from symbolica import * │
  494. 28.56 s gammaloop-nextest-python-api> │ request_hobbyist_license('YOUR_NAME', 'YOUR_EMAIL') │
  495. 28.56 s gammaloop-nextest-python-api> │ │
  496. 28.56 s gammaloop-nextest-python-api> │ All other users can obtain a free 30-day trial key: │
  497. 28.56 s gammaloop-nextest-python-api> │ │
  498. 28.56 s gammaloop-nextest-python-api> │ from symbolica import * │
  499. 28.56 s gammaloop-nextest-python-api> │ request_trial_license('NAME', 'EMAIL', 'EMPLOYER') │
  500. 28.56 s gammaloop-nextest-python-api> │ │
  501. 28.56 s gammaloop-nextest-python-api> │ See https://symbolica.io/docs/get_started.html#license │
  502. 28.56 s gammaloop-nextest-python-api> └────────────────────────────────────────────────────────┘
  503. 28.56 s gammaloop-nextest-python-api> ┌───────────────────────────────────────────────────────────────────────────────────────────────────────────┐
  504. 28.56 s gammaloop-nextest-python-api> │ Cannot start new unlicensed Symbolica instance since there is already another one running on the machine. │
  505. 28.56 s gammaloop-nextest-python-api> └───────────────────────────────────────────────────────────────────────────────────────────────────────────┘
  506. 28.56 s gammaloop-nextest-python-api>
  507. 28.56 s gammaloop-nextest-python-api> stderr:
  508. 28.56 s gammaloop-nextest-python-api> ┌───────────────────────────────────┐
  509. 28.56 s gammaloop-nextest-python-api> │ The Symbolica license has expired │
  510. 28.56 s gammaloop-nextest-python-api> └───────────────────────────────────┘
  511. 28.56 s gammaloop-nextest-python-api> [2026-09-01 22:09:21.894] @gammaloop_api::se... INFO : Running command import model sm-default
  512. 28.56 s gammaloop-nextest-python-api> [2026-09-01 22:09:21.894] @import::model INFO : Loading built-in JSON model sm-default
  513. 28.56 s gammaloop-nextest-python-api> [2026-09-01 22:09:21.907] @gammaloop_api::se... INFO : Running command set default-runtime kv kinematics.externals='{"type":"constant","data":{"momenta":[[32.0,0.0,0.0,32.0],[32.0,0.0,0.0,-32.0]],"helicities":[1,1]}}'
  514. 28.56 s gammaloop-nextest-python-api> [2026-09-01 22:09:21.907] @gammaloop_api::se... INFO : Running command set default-runtime kv subtraction.disable_threshold_subtraction=true
  515. 28.56 s gammaloop-nextest-python-api> [2026-09-01 22:09:21.908] @gammaloop_api::se... INFO : Running command generate xs e+ e- > d d~ g | e- a d g QED^2==4 [{{2}} QCD=0] --numerator-grouping group_identical_graphs_up_to_sign --clear-existing-processes --only-diagrams
  516. 28.56 s gammaloop-nextest-python-api> [2026-09-01 22:09:22.049] @commands::generate INFO : Generated cross-section 2 graphs.
  517. 28.56 s gammaloop-nextest-python-api> [2026-09-01 22:09:22.050] @commands::generate INFO : Only diagram generation was requested, skipping integrand generation. You can generate integrands later using the 'generate existing <options>' command.
  518. 28.56 s gammaloop-nextest-python-api> [2026-09-01 22:09:22.050] @gammaloop_api::se... INFO : Running command generate
  519. 28.56 s gammaloop-nextest-python-api>
  520. 28.56 s gammaloop-nextest-python-api>
  521. 28.56 s gammaloop-nextest-python-api> Location:
  522. 28.56 s gammaloop-nextest-python-api> tests/tests/test_python_api.rs:157:20
  523. 28.56 s gammaloop-nextest-python-api>
  524. 28.57 s gammaloop-nextest-python-api> error: test run failed
  525. 28.59 s gammaloop-nextest-python-api>
  526. 28.59 s gammaloop-nextest-python-api> ========== nextest test summary ==========
  527. 28.59 s gammaloop-nextest-python-api> report: target/nextest/ci_gammaloop/junit.xml
  528. 28.59 s gammaloop-nextest-python-api> tests: 5, failures: 5, errors: 0
  529. 28.59 s gammaloop-nextest-python-api>
  530. 28.59 s gammaloop-nextest-python-api> 1. gammaloop-integration-tests::test_python_api::python_evaluate_sample_honors_generate_events_and_observable_snapshots
  531. 28.59 s gammaloop-nextest-python-api> failure: test failure with exit code 101
  532. 28.59 s gammaloop-nextest-python-api> Error: Python API test subprocess failed.
  533. 28.59 s gammaloop-nextest-python-api> stdout:
  534. 28.59 s gammaloop-nextest-python-api> ┌────────────────────────────────────────────────────────┐
  535. 28.59 s gammaloop-nextest-python-api> │ You are running a restricted Symbolica instance. │
  536. 28.59 s gammaloop-nextest-python-api> │ │
  537. 28.59 s gammaloop-nextest-python-api> │ This mode is only permitted for non-commercial use and │
  538. 28.59 s gammaloop-nextest-python-api> │ is limited to one instance and core per machine. │
  539. 28.59 s gammaloop-nextest-python-api> │ │
  540. 28.59 s gammaloop-nextest-python-api> │ Hobbyists can easily acquire a free license key │
  541. 28.59 s gammaloop-nextest-python-api> │ that unlocks all cores and removes this banner: │
  542. 28.59 s gammaloop-nextest-python-api> │ │
  543. 28.59 s gammaloop-nextest-python-api> │ from symbolica import * │
  544. 28.59 s gammaloop-nextest-python-api> │ request_hobbyist_license('YOUR_NAME', 'YOUR_EMAIL') │
  545. 28.59 s gammaloop-nextest-python-api> │ │
  546. 28.59 s gammaloop-nextest-python-api> │ All other users can obtain a free 30-day trial key: │
  547. 28.59 s gammaloop-nextest-python-api> │ │
  548. 28.59 s gammaloop-nextest-python-api> │ from symbolica import * │
  549. 28.59 s gammaloop-nextest-python-api> │ request_trial_license('NAME', 'EMAIL', 'EMPLOYER') │
  550. 28.59 s gammaloop-nextest-python-api> │ │
  551. 28.59 s gammaloop-nextest-python-api> │ See https://symbolica.io/docs/get_started.html#license │
  552. 28.59 s gammaloop-nextest-python-api> └────────────────────────────────────────────────────────┘
  553. 28.59 s gammaloop-nextest-python-api> ┌───────────────────────────────────────────────────────────────────────────────────────────────────────────┐
  554. 28.59 s gammaloop-nextest-python-api> │ Cannot start new unlicensed Symbolica instance since there is already another one running on the machine. │
  555. 28.59 s gammaloop-nextest-python-api> └───────────────────────────────────────────────────────────────────────────────────────────────────────────┘
  556. 28.59 s gammaloop-nextest-python-api>
  557. 28.59 s gammaloop-nextest-python-api> stderr:
  558. 28.59 s gammaloop-nextest-python-api> ┌───────────────────────────────────┐
  559. 28.59 s gammaloop-nextest-python-api> │ The Symbolica license has expired │
  560. 28.59 s gammaloop-nextest-python-api> └───────────────────────────────────┘
  561. 28.59 s gammaloop-nextest-python-api>
  562. 28.59 s gammaloop-nextest-python-api>
  563. 28.59 s gammaloop-nextest-python-api> Location:
  564. 28.59 s gammaloop-nextest-python-api> tests/tests/test_python_api.rs:157:20
  565. 28.59 s gammaloop-nextest-python-api> system-out
  566. 28.59 s gammaloop-nextest-python-api> running 1 test
  567. 28.59 s gammaloop-nextest-python-api> test python_evaluate_sample_honors_generate_events_and_observable_snapshots ... FAILED
  568. 28.59 s gammaloop-nextest-python-api>
  569. 28.59 s gammaloop-nextest-python-api> failures:
  570. 28.59 s gammaloop-nextest-python-api>
  571. 28.59 s gammaloop-nextest-python-api> failures:
  572. 28.59 s gammaloop-nextest-python-api> python_evaluate_sample_honors_generate_events_and_observable_snapshots
  573. 28.59 s gammaloop-nextest-python-api>
  574. 28.59 s gammaloop-nextest-python-api> test result: FAILED. 0 passed; 1 failed; 0 ignored; 0 measured; 4 filtered out; finished in 0.12s
  575. 28.59 s gammaloop-nextest-python-api> system-err
  576. 28.59 s gammaloop-nextest-python-api> Error: Python API test subprocess failed.
  577. 28.59 s gammaloop-nextest-python-api> stdout:
  578. 28.59 s gammaloop-nextest-python-api> ┌────────────────────────────────────────────────────────┐
  579. 28.59 s gammaloop-nextest-python-api> │ You are running a restricted Symbolica instance. │
  580. 28.59 s gammaloop-nextest-python-api> │ │
  581. 28.59 s gammaloop-nextest-python-api> │ This mode is only permitted for non-commercial use and │
  582. 28.59 s gammaloop-nextest-python-api> │ is limited to one instance and core per machine. │
  583. 28.59 s gammaloop-nextest-python-api> │ │
  584. 28.59 s gammaloop-nextest-python-api> │ Hobbyists can easily acquire a free license key │
  585. 28.59 s gammaloop-nextest-python-api> │ that unlocks all cores and removes this banner: │
  586. 28.59 s gammaloop-nextest-python-api> │ │
  587. 28.59 s gammaloop-nextest-python-api> │ from symbolica import * │
  588. 28.59 s gammaloop-nextest-python-api> │ request_hobbyist_license('YOUR_NAME', 'YOUR_EMAIL') │
  589. 28.59 s gammaloop-nextest-python-api> │ │
  590. 28.59 s gammaloop-nextest-python-api> │ All other users can obtain a free 30-day trial key: │
  591. 28.59 s gammaloop-nextest-python-api> │ │
  592. 28.59 s gammaloop-nextest-python-api> │ from symbolica import * │
  593. 28.59 s gammaloop-nextest-python-api> │ request_trial_license('NAME', 'EMAIL', 'EMPLOYER') │
  594. 28.59 s gammaloop-nextest-python-api> │ │
  595. 28.59 s gammaloop-nextest-python-api> │ See https://symbolica.io/docs/get_started.html#license │
  596. 28.59 s gammaloop-nextest-python-api> └────────────────────────────────────────────────────────┘
  597. 28.59 s gammaloop-nextest-python-api> ┌───────────────────────────────────────────────────────────────────────────────────────────────────────────┐
  598. 28.59 s gammaloop-nextest-python-api> │ Cannot start new unlicensed Symbolica instance since there is already another one running on the machine. │
  599. 28.59 s gammaloop-nextest-python-api> └───────────────────────────────────────────────────────────────────────────────────────────────────────────┘
  600. 28.59 s gammaloop-nextest-python-api>
  601. 28.59 s gammaloop-nextest-python-api> stderr:
  602. 28.59 s gammaloop-nextest-python-api> ┌───────────────────────────────────┐
  603. 28.59 s gammaloop-nextest-python-api> │ The Symbolica license has expired │
  604. 28.59 s gammaloop-nextest-python-api> └───────────────────────────────────┘
  605. 28.59 s gammaloop-nextest-python-api>
  606. 28.59 s gammaloop-nextest-python-api>
  607. 28.59 s gammaloop-nextest-python-api> Location:
  608. 28.59 s gammaloop-nextest-python-api> tests/tests/test_python_api.rs:157:20
  609. 28.59 s gammaloop-nextest-python-api>
  610. 28.59 s gammaloop-nextest-python-api> 2. gammaloop-integration-tests::test_python_api::python_evaluate_samples_batch_and_momentum_space_have_expected_shape
  611. 28.59 s gammaloop-nextest-python-api> failure: test failure with exit code 101
  612. 28.59 s gammaloop-nextest-python-api> Error: Python API test subprocess failed.
  613. 28.59 s gammaloop-nextest-python-api> stdout:
  614. 28.59 s gammaloop-nextest-python-api> ┌────────────────────────────────────────────────────────┐
  615. 28.59 s gammaloop-nextest-python-api> │ You are running a restricted Symbolica instance. │
  616. 28.59 s gammaloop-nextest-python-api> │ │
  617. 28.59 s gammaloop-nextest-python-api> │ This mode is only permitted for non-commercial use and │
  618. 28.59 s gammaloop-nextest-python-api> │ is limited to one instance and core per machine. │
  619. 28.59 s gammaloop-nextest-python-api> │ │
  620. 28.59 s gammaloop-nextest-python-api> │ Hobbyists can easily acquire a free license key │
  621. 28.59 s gammaloop-nextest-python-api> │ that unlocks all cores and removes this banner: │
  622. 28.59 s gammaloop-nextest-python-api> │ │
  623. 28.59 s gammaloop-nextest-python-api> │ from symbolica import * │
  624. 28.59 s gammaloop-nextest-python-api> │ request_hobbyist_license('YOUR_NAME', 'YOUR_EMAIL') │
  625. 28.59 s gammaloop-nextest-python-api> │ │
  626. 28.59 s gammaloop-nextest-python-api> │ All other users can obtain a free 30-day trial key: │
  627. 28.59 s gammaloop-nextest-python-api> │ │
  628. 28.59 s gammaloop-nextest-python-api> │ from symbolica import * │
  629. 28.59 s gammaloop-nextest-python-api> │ request_trial_license('NAME', 'EMAIL', 'EMPLOYER') │
  630. 28.59 s gammaloop-nextest-python-api> │ │
  631. 28.59 s gammaloop-nextest-python-api> │ See https://symbolica.io/docs/get_started.html#license │
  632. 28.59 s gammaloop-nextest-python-api> └────────────────────────────────────────────────────────┘
  633. 28.59 s gammaloop-nextest-python-api> ┌───────────────────────────────────────────────────────────────────────────────────────────────────────────┐
  634. 28.59 s gammaloop-nextest-python-api> │ Cannot start new unlicensed Symbolica instance since there is already another one running on the machine. │
  635. 28.59 s gammaloop-nextest-python-api> └───────────────────────────────────────────────────────────────────────────────────────────────────────────┘
  636. 28.59 s gammaloop-nextest-python-api>
  637. 28.59 s gammaloop-nextest-python-api> stderr:
  638. 28.59 s gammaloop-nextest-python-api> ┌───────────────────────────────────┐
  639. 28.59 s gammaloop-nextest-python-api> │ The Symbolica license has expired │
  640. 28.59 s gammaloop-nextest-python-api> └───────────────────────────────────┘
  641. 28.59 s gammaloop-nextest-python-api>
  642. 28.59 s gammaloop-nextest-python-api>
  643. 28.59 s gammaloop-nextest-python-api> Location:
  644. 28.59 s gammaloop-nextest-python-api> tests/tests/test_python_api.rs:157:20
  645. 28.59 s gammaloop-nextest-python-api> system-out
  646. 28.59 s gammaloop-nextest-python-api> running 1 test
  647. 28.59 s gammaloop-nextest-python-api> test python_evaluate_samples_batch_and_momentum_space_have_expected_shape ... FAILED
  648. 28.59 s gammaloop-nextest-python-api>
  649. 28.59 s gammaloop-nextest-python-api> failures:
  650. 28.59 s gammaloop-nextest-python-api>
  651. 28.59 s gammaloop-nextest-python-api> failures:
  652. 28.59 s gammaloop-nextest-python-api> python_evaluate_samples_batch_and_momentum_space_have_expected_shape
  653. 28.59 s gammaloop-nextest-python-api>
  654. 28.59 s gammaloop-nextest-python-api> test result: FAILED. 0 passed; 1 failed; 0 ignored; 0 measured; 4 filtered out; finished in 0.13s
  655. 28.59 s gammaloop-nextest-python-api> system-err
  656. 28.59 s gammaloop-nextest-python-api> Error: Python API test subprocess failed.
  657. 28.59 s gammaloop-nextest-python-api> stdout:
  658. 28.59 s gammaloop-nextest-python-api> ┌────────────────────────────────────────────────────────┐
  659. 28.59 s gammaloop-nextest-python-api> │ You are running a restricted Symbolica instance. │
  660. 28.59 s gammaloop-nextest-python-api> │ │
  661. 28.59 s gammaloop-nextest-python-api> │ This mode is only permitted for non-commercial use and │
  662. 28.59 s gammaloop-nextest-python-api> │ is limited to one instance and core per machine. │
  663. 28.59 s gammaloop-nextest-python-api> │ │
  664. 28.59 s gammaloop-nextest-python-api> │ Hobbyists can easily acquire a free license key │
  665. 28.59 s gammaloop-nextest-python-api> │ that unlocks all cores and removes this banner: │
  666. 28.59 s gammaloop-nextest-python-api> │ │
  667. 28.59 s gammaloop-nextest-python-api> │ from symbolica import * │
  668. 28.59 s gammaloop-nextest-python-api> │ request_hobbyist_license('YOUR_NAME', 'YOUR_EMAIL') │
  669. 28.59 s gammaloop-nextest-python-api> │ │
  670. 28.59 s gammaloop-nextest-python-api> │ All other users can obtain a free 30-day trial key: │
  671. 28.59 s gammaloop-nextest-python-api> │ │
  672. 28.59 s gammaloop-nextest-python-api> │ from symbolica import * │
  673. 28.59 s gammaloop-nextest-python-api> │ request_trial_license('NAME', 'EMAIL', 'EMPLOYER') │
  674. 28.59 s gammaloop-nextest-python-api> │ │
  675. 28.59 s gammaloop-nextest-python-api> │ See https://symbolica.io/docs/get_started.html#license │
  676. 28.59 s gammaloop-nextest-python-api> └────────────────────────────────────────────────────────┘
  677. 28.59 s gammaloop-nextest-python-api> ┌───────────────────────────────────────────────────────────────────────────────────────────────────────────┐
  678. 28.59 s gammaloop-nextest-python-api> │ Cannot start new unlicensed Symbolica instance since there is already another one running on the machine. │
  679. 28.59 s gammaloop-nextest-python-api> └───────────────────────────────────────────────────────────────────────────────────────────────────────────┘
  680. 28.59 s gammaloop-nextest-python-api>
  681. 28.59 s gammaloop-nextest-python-api> stderr:
  682. 28.59 s gammaloop-nextest-python-api> ┌───────────────────────────────────┐
  683. 28.59 s gammaloop-nextest-python-api> │ The Symbolica license has expired │
  684. 28.59 s gammaloop-nextest-python-api> └───────────────────────────────────┘
  685. 28.59 s gammaloop-nextest-python-api>
  686. 28.59 s gammaloop-nextest-python-api>
  687. 28.59 s gammaloop-nextest-python-api> Location:
  688. 28.59 s gammaloop-nextest-python-api> tests/tests/test_python_api.rs:157:20
  689. 28.59 s gammaloop-nextest-python-api>
  690. 28.59 s gammaloop-nextest-python-api> 3. gammaloop-integration-tests::test_python_api::python_session_getters_return_live_toml_and_command_blocks
  691. 28.59 s gammaloop-nextest-python-api> failure: test failure with exit code 101
  692. 28.59 s gammaloop-nextest-python-api> Error: Python API test subprocess failed.
  693. 28.59 s gammaloop-nextest-python-api> stdout:
  694. 28.59 s gammaloop-nextest-python-api> ┌────────────────────────────────────────────────────────┐
  695. 28.59 s gammaloop-nextest-python-api> │ You are running a restricted Symbolica instance. │
  696. 28.59 s gammaloop-nextest-python-api> │ │
  697. 28.59 s gammaloop-nextest-python-api> │ This mode is only permitted for non-commercial use and │
  698. 28.59 s gammaloop-nextest-python-api> │ is limited to one instance and core per machine. │
  699. 28.59 s gammaloop-nextest-python-api> │ │
  700. 28.59 s gammaloop-nextest-python-api> │ Hobbyists can easily acquire a free license key │
  701. 28.59 s gammaloop-nextest-python-api> │ that unlocks all cores and removes this banner: │
  702. 28.59 s gammaloop-nextest-python-api> │ │
  703. 28.59 s gammaloop-nextest-python-api> │ from symbolica import * │
  704. 28.59 s gammaloop-nextest-python-api> │ request_hobbyist_license('YOUR_NAME', 'YOUR_EMAIL') │
  705. 28.59 s gammaloop-nextest-python-api> │ │
  706. 28.59 s gammaloop-nextest-python-api> │ All other users can obtain a free 30-day trial key: │
  707. 28.59 s gammaloop-nextest-python-api> │ │
  708. 28.59 s gammaloop-nextest-python-api> │ from symbolica import * │
  709. 28.59 s gammaloop-nextest-python-api> │ request_trial_license('NAME', 'EMAIL', 'EMPLOYER') │
  710. 28.59 s gammaloop-nextest-python-api> │ │
  711. 28.59 s gammaloop-nextest-python-api> │ See https://symbolica.io/docs/get_started.html#license │
  712. 28.59 s gammaloop-nextest-python-api> └────────────────────────────────────────────────────────┘
  713. 28.59 s gammaloop-nextest-python-api> ┌───────────────────────────────────────────────────────────────────────────────────────────────────────────┐
  714. 28.59 s gammaloop-nextest-python-api> │ Cannot start new unlicensed Symbolica instance since there is already another one running on the machine. │
  715. 28.59 s gammaloop-nextest-python-api> └───────────────────────────────────────────────────────────────────────────────────────────────────────────┘
  716. 28.59 s gammaloop-nextest-python-api>
  717. 28.59 s gammaloop-nextest-python-api> stderr:
  718. 28.59 s gammaloop-nextest-python-api> ┌───────────────────────────────────┐
  719. 28.59 s gammaloop-nextest-python-api> │ The Symbolica license has expired │
  720. 28.59 s gammaloop-nextest-python-api> └───────────────────────────────────┘
  721. 28.59 s gammaloop-nextest-python-api>
  722. 28.59 s gammaloop-nextest-python-api>
  723. 28.59 s gammaloop-nextest-python-api> Location:
  724. 28.59 s gammaloop-nextest-python-api> tests/tests/test_python_api.rs:157:20
  725. 28.59 s gammaloop-nextest-python-api> system-out
  726. 28.59 s gammaloop-nextest-python-api> running 1 test
  727. 28.59 s gammaloop-nextest-python-api> test python_session_getters_return_live_toml_and_command_blocks ... FAILED
  728. 28.59 s gammaloop-nextest-python-api>
  729. 28.59 s gammaloop-nextest-python-api> failures:
  730. 28.59 s gammaloop-nextest-python-api>
  731. 28.59 s gammaloop-nextest-python-api> failures:
  732. 28.59 s gammaloop-nextest-python-api> python_session_getters_return_live_toml_and_command_blocks
  733. 28.59 s gammaloop-nextest-python-api>
  734. 28.59 s gammaloop-nextest-python-api> test result: FAILED. 0 passed; 1 failed; 0 ignored; 0 measured; 4 filtered out; finished in 0.13s
  735. 28.59 s gammaloop-nextest-python-api> system-err
  736. 28.59 s gammaloop-nextest-python-api> Error: Python API test subprocess failed.
  737. 28.59 s gammaloop-nextest-python-api> stdout:
  738. 28.59 s gammaloop-nextest-python-api> ┌────────────────────────────────────────────────────────┐
  739. 28.59 s gammaloop-nextest-python-api> │ You are running a restricted Symbolica instance. │
  740. 28.59 s gammaloop-nextest-python-api> │ │
  741. 28.59 s gammaloop-nextest-python-api> │ This mode is only permitted for non-commercial use and │
  742. 28.59 s gammaloop-nextest-python-api> │ is limited to one instance and core per machine. │
  743. 28.59 s gammaloop-nextest-python-api> │ │
  744. 28.59 s gammaloop-nextest-python-api> │ Hobbyists can easily acquire a free license key │
  745. 28.59 s gammaloop-nextest-python-api> │ that unlocks all cores and removes this banner: │
  746. 28.59 s gammaloop-nextest-python-api> │ │
  747. 28.59 s gammaloop-nextest-python-api> │ from symbolica import * │
  748. 28.59 s gammaloop-nextest-python-api> │ request_hobbyist_license('YOUR_NAME', 'YOUR_EMAIL') │
  749. 28.59 s gammaloop-nextest-python-api> │ │
  750. 28.59 s gammaloop-nextest-python-api> │ All other users can obtain a free 30-day trial key: │
  751. 28.59 s gammaloop-nextest-python-api> │ │
  752. 28.59 s gammaloop-nextest-python-api> │ from symbolica import * │
  753. 28.59 s gammaloop-nextest-python-api> │ request_trial_license('NAME', 'EMAIL', 'EMPLOYER') │
  754. 28.59 s gammaloop-nextest-python-api> │ │
  755. 28.59 s gammaloop-nextest-python-api> │ See https://symbolica.io/docs/get_started.html#license │
  756. 28.59 s gammaloop-nextest-python-api> └────────────────────────────────────────────────────────┘
  757. 28.59 s gammaloop-nextest-python-api> ┌───────────────────────────────────────────────────────────────────────────────────────────────────────────┐
  758. 28.59 s gammaloop-nextest-python-api> │ Cannot start new unlicensed Symbolica instance since there is already another one running on the machine. │
  759. 28.59 s gammaloop-nextest-python-api> └───────────────────────────────────────────────────────────────────────────────────────────────────────────┘
  760. 28.60 s gammaloop-nextest-python-api>
  761. 28.60 s gammaloop-nextest-python-api> stderr:
  762. 28.60 s gammaloop-nextest-python-api> ┌───────────────────────────────────┐
  763. 28.60 s gammaloop-nextest-python-api> │ The Symbolica license has expired │
  764. 28.60 s gammaloop-nextest-python-api> └───────────────────────────────────┘
  765. 28.60 s gammaloop-nextest-python-api>
  766. 28.60 s gammaloop-nextest-python-api>
  767. 28.60 s gammaloop-nextest-python-api> Location:
  768. 28.60 s gammaloop-nextest-python-api> tests/tests/test_python_api.rs:157:20
  769. 28.60 s gammaloop-nextest-python-api>
  770. 28.60 s gammaloop-nextest-python-api> 4. gammaloop-integration-tests::test_python_api::python_settings_wrappers_expose_nested_runtime_and_global_settings
  771. 28.60 s gammaloop-nextest-python-api> failure: test failure with exit code 101
  772. 28.60 s gammaloop-nextest-python-api> Error: Python API test subprocess failed.
  773. 28.60 s gammaloop-nextest-python-api> stdout:
  774. 28.60 s gammaloop-nextest-python-api> ┌────────────────────────────────────────────────────────┐
  775. 28.60 s gammaloop-nextest-python-api> │ You are running a restricted Symbolica instance. │
  776. 28.60 s gammaloop-nextest-python-api> │ │
  777. 28.60 s gammaloop-nextest-python-api> │ This mode is only permitted for non-commercial use and │
  778. 28.60 s gammaloop-nextest-python-api> │ is limited to one instance and core per machine. │
  779. 28.60 s gammaloop-nextest-python-api> │ │
  780. 28.60 s gammaloop-nextest-python-api> │ Hobbyists can easily acquire a free license key │
  781. 28.60 s gammaloop-nextest-python-api> │ that unlocks all cores and removes this banner: │
  782. 28.60 s gammaloop-nextest-python-api> │ │
  783. 28.60 s gammaloop-nextest-python-api> │ from symbolica import * │
  784. 28.60 s gammaloop-nextest-python-api> │ request_hobbyist_license('YOUR_NAME', 'YOUR_EMAIL') │
  785. 28.60 s gammaloop-nextest-python-api> │ │
  786. 28.60 s gammaloop-nextest-python-api> │ All other users can obtain a free 30-day trial key: │
  787. 28.60 s gammaloop-nextest-python-api> │ │
  788. 28.60 s gammaloop-nextest-python-api> │ from symbolica import * │
  789. 28.60 s gammaloop-nextest-python-api> │ request_trial_license('NAME', 'EMAIL', 'EMPLOYER') │
  790. 28.60 s gammaloop-nextest-python-api> │ │
  791. 28.60 s gammaloop-nextest-python-api> │ See https://symbolica.io/docs/get_started.html#license │
  792. 28.60 s gammaloop-nextest-python-api> └────────────────────────────────────────────────────────┘
  793. 28.60 s gammaloop-nextest-python-api> ┌───────────────────────────────────────────────────────────────────────────────────────────────────────────┐
  794. 28.60 s gammaloop-nextest-python-api> │ Cannot start new unlicensed Symbolica instance since there is already another one running on the machine. │
  795. 28.60 s gammaloop-nextest-python-api> └───────────────────────────────────────────────────────────────────────────────────────────────────────────┘
  796. 28.60 s gammaloop-nextest-python-api>
  797. 28.60 s gammaloop-nextest-python-api> stderr:
  798. 28.60 s gammaloop-nextest-python-api> ┌───────────────────────────────────┐
  799. 28.60 s gammaloop-nextest-python-api> │ The Symbolica license has expired │
  800. 28.60 s gammaloop-nextest-python-api> └───────────────────────────────────┘
  801. 28.60 s gammaloop-nextest-python-api>
  802. 28.60 s gammaloop-nextest-python-api>
  803. 28.60 s gammaloop-nextest-python-api> Location:
  804. 28.60 s gammaloop-nextest-python-api> tests/tests/test_python_api.rs:157:20
  805. 28.60 s gammaloop-nextest-python-api> system-out
  806. 28.60 s gammaloop-nextest-python-api> running 1 test
  807. 28.60 s gammaloop-nextest-python-api> test python_settings_wrappers_expose_nested_runtime_and_global_settings ... FAILED
  808. 28.60 s gammaloop-nextest-python-api>
  809. 28.60 s gammaloop-nextest-python-api> failures:
  810. 28.60 s gammaloop-nextest-python-api>
  811. 28.60 s gammaloop-nextest-python-api> failures:
  812. 28.60 s gammaloop-nextest-python-api> python_settings_wrappers_expose_nested_runtime_and_global_settings
  813. 28.60 s gammaloop-nextest-python-api>
  814. 28.60 s gammaloop-nextest-python-api> test result: FAILED. 0 passed; 1 failed; 0 ignored; 0 measured; 4 filtered out; finished in 0.21s
  815. 28.60 s gammaloop-nextest-python-api> system-err
  816. 28.60 s gammaloop-nextest-python-api> Error: Python API test subprocess failed.
  817. 28.60 s gammaloop-nextest-python-api> stdout:
  818. 28.60 s gammaloop-nextest-python-api> ┌────────────────────────────────────────────────────────┐
  819. 28.60 s gammaloop-nextest-python-api> │ You are running a restricted Symbolica instance. │
  820. 28.60 s gammaloop-nextest-python-api> │ │
  821. 28.60 s gammaloop-nextest-python-api> │ This mode is only permitted for non-commercial use and │
  822. 28.60 s gammaloop-nextest-python-api> │ is limited to one instance and core per machine. │
  823. 28.60 s gammaloop-nextest-python-api> │ │
  824. 28.60 s gammaloop-nextest-python-api> │ Hobbyists can easily acquire a free license key │
  825. 28.60 s gammaloop-nextest-python-api> │ that unlocks all cores and removes this banner: │
  826. 28.60 s gammaloop-nextest-python-api> │ │
  827. 28.60 s gammaloop-nextest-python-api> │ from symbolica import * │
  828. 28.60 s gammaloop-nextest-python-api> │ request_hobbyist_license('YOUR_NAME', 'YOUR_EMAIL') │
  829. 28.60 s gammaloop-nextest-python-api> │ │
  830. 28.60 s gammaloop-nextest-python-api> │ All other users can obtain a free 30-day trial key: │
  831. 28.60 s gammaloop-nextest-python-api> │ │
  832. 28.60 s gammaloop-nextest-python-api> │ from symbolica import * │
  833. 28.60 s gammaloop-nextest-python-api> │ request_trial_license('NAME', 'EMAIL', 'EMPLOYER') │
  834. 28.60 s gammaloop-nextest-python-api> │ │
  835. 28.60 s gammaloop-nextest-python-api> │ See https://symbolica.io/docs/get_started.html#license │
  836. 28.60 s gammaloop-nextest-python-api> └────────────────────────────────────────────────────────┘
  837. 28.60 s gammaloop-nextest-python-api> ┌───────────────────────────────────────────────────────────────────────────────────────────────────────────┐
  838. 28.60 s gammaloop-nextest-python-api> │ Cannot start new unlicensed Symbolica instance since there is already another one running on the machine. │
  839. 28.60 s gammaloop-nextest-python-api> └───────────────────────────────────────────────────────────────────────────────────────────────────────────┘
  840. 28.60 s gammaloop-nextest-python-api>
  841. 28.60 s gammaloop-nextest-python-api> stderr:
  842. 28.60 s gammaloop-nextest-python-api> ┌───────────────────────────────────┐
  843. 28.60 s gammaloop-nextest-python-api> │ The Symbolica license has expired │
  844. 28.60 s gammaloop-nextest-python-api> └───────────────────────────────────┘
  845. 28.60 s gammaloop-nextest-python-api>
  846. 28.60 s gammaloop-nextest-python-api>
  847. 28.60 s gammaloop-nextest-python-api> Location:
  848. 28.60 s gammaloop-nextest-python-api> tests/tests/test_python_api.rs:157:20
  849. 28.60 s gammaloop-nextest-python-api>
  850. 28.60 s gammaloop-nextest-python-api> 5. gammaloop-integration-tests::test_python_api::python_evaluate_sample_preserves_graph_grouping_and_incoming_pdgs
  851. 28.60 s gammaloop-nextest-python-api> failure: test failure with exit code 101
  852. 28.60 s gammaloop-nextest-python-api> Error: Python API test subprocess failed.
  853. 28.60 s gammaloop-nextest-python-api> stdout:
  854. 28.60 s gammaloop-nextest-python-api> ┌────────────────────────────────────────────────────────┐
  855. 28.60 s gammaloop-nextest-python-api> │ You are running a restricted Symbolica instance. │
  856. 28.60 s gammaloop-nextest-python-api> │ │
  857. 28.60 s gammaloop-nextest-python-api> │ This mode is only permitted for non-commercial use and │
  858. 28.60 s gammaloop-nextest-python-api> │ is limited to one instance and core per machine. │
  859. 28.60 s gammaloop-nextest-python-api> │ │
  860. 28.60 s gammaloop-nextest-python-api> │ Hobbyists can easily acquire a free license key │
  861. 28.60 s gammaloop-nextest-python-api> │ that unlocks all cores and removes this banner: │
  862. 28.60 s gammaloop-nextest-python-api> │ │
  863. 28.60 s gammaloop-nextest-python-api> │ from symbolica import * │
  864. 28.60 s gammaloop-nextest-python-api> │ request_hobbyist_license('YOUR_NAME', 'YOUR_EMAIL') │
  865. 28.60 s gammaloop-nextest-python-api> │ │
  866. 28.60 s gammaloop-nextest-python-api> │ All other users can obtain a free 30-day trial key: │
  867. 28.60 s gammaloop-nextest-python-api> │ │
  868. 28.60 s gammaloop-nextest-python-api> │ from symbolica import * │
  869. 28.60 s gammaloop-nextest-python-api> │ request_trial_license('NAME', 'EMAIL', 'EMPLOYER') │
  870. 28.60 s gammaloop-nextest-python-api> │ │
  871. 28.60 s gammaloop-nextest-python-api> │ See https://symbolica.io/docs/get_started.html#license │
  872. 28.60 s gammaloop-nextest-python-api> └────────────────────────────────────────────────────────┘
  873. 28.60 s gammaloop-nextest-python-api> ┌───────────────────────────────────────────────────────────────────────────────────────────────────────────┐
  874. 28.60 s gammaloop-nextest-python-api> │ Cannot start new unlicensed Symbolica instance since there is already another one running on the machine. │
  875. 28.60 s gammaloop-nextest-python-api> └───────────────────────────────────────────────────────────────────────────────────────────────────────────┘
  876. 28.60 s gammaloop-nextest-python-api>
  877. 28.60 s gammaloop-nextest-python-api> stderr:
  878. 28.60 s gammaloop-nextest-python-api> ┌───────────────────────────────────┐
  879. 28.60 s gammaloop-nextest-python-api> │ The Symbolica license has expired │
  880. 28.60 s gammaloop-nextest-python-api> └───────────────────────────────────┘
  881. 28.60 s gammaloop-nextest-python-api> [2026-09-01 22:09:21.894] @gammaloop_api::se... INFO : Running command import model sm-default
  882. 28.60 s gammaloop-nextest-python-api> [2026-09-01 22:09:21.894] @import::model INFO : Loading built-in JSON model sm-default
  883. 28.60 s gammaloop-nextest-python-api> [2026-09-01 22:09:21.907] @gammaloop_api::se... INFO : Running command set default-runtime kv kinematics.externals='{"type":"constant","data":{"momenta":[[32.0,0.0,0.0,32.0],[32.0,0.0,0.0,-32.0]],"helicities":[1,1]}}'
  884. 28.60 s gammaloop-nextest-python-api> [2026-09-01 22:09:21.907] @gammaloop_api::se... INFO : Running command set default-runtime kv subtraction.disable_threshold_subtraction=true
  885. 28.60 s gammaloop-nextest-python-api> [2026-09-01 22:09:21.908] @gammaloop_api::se... INFO : Running command generate xs e+ e- > d d~ g | e- a d g QED^2==4 [{{2}} QCD=0] --numerator-grouping group_identical_graphs_up_to_sign --clear-existing-processes --only-diagrams
  886. 28.60 s gammaloop-nextest-python-api> [2026-09-01 22:09:22.049] @commands::generate INFO : Generated cross-section 2 graphs.
  887. 28.60 s gammaloop-nextest-python-api> [2026-09-01 22:09:22.050] @commands::generate INFO : Only diagram generation was requested, skipping integrand generation. You can generate integrands later using the 'generate existing <options>' command.
  888. 28.60 s gammaloop-nextest-python-api> [2026-09-01 22:09:22.050] @gammaloop_api::se... INFO : Running command generate
  889. 28.60 s gammaloop-nextest-python-api>
  890. 28.60 s gammaloop-nextest-python-api>
  891. 28.60 s gammaloop-nextest-python-api> Location:
  892. 28.60 s gammaloop-nextest-python-api> tests/tests/test_python_api.rs:157:20
  893. 28.60 s gammaloop-nextest-python-api> system-out
  894. 28.60 s gammaloop-nextest-python-api> running 1 test
  895. 28.60 s gammaloop-nextest-python-api> test python_evaluate_sample_preserves_graph_grouping_and_incoming_pdgs ... FAILED
  896. 28.60 s gammaloop-nextest-python-api>
  897. 28.60 s gammaloop-nextest-python-api> failures:
  898. 28.60 s gammaloop-nextest-python-api>
  899. 28.60 s gammaloop-nextest-python-api> failures:
  900. 28.60 s gammaloop-nextest-python-api> python_evaluate_sample_preserves_graph_grouping_and_incoming_pdgs
  901. 28.60 s gammaloop-nextest-python-api>
  902. 28.60 s gammaloop-nextest-python-api> test result: FAILED. 0 passed; 1 failed; 0 ignored; 0 measured; 4 filtered out; finished in 0.29s
  903. 28.60 s gammaloop-nextest-python-api> system-err
  904. 28.60 s gammaloop-nextest-python-api> Error: Python API test subprocess failed.
  905. 28.60 s gammaloop-nextest-python-api> stdout:
  906. 28.60 s gammaloop-nextest-python-api> ┌────────────────────────────────────────────────────────┐
  907. 28.60 s gammaloop-nextest-python-api> │ You are running a restricted Symbolica instance. │
  908. 28.60 s gammaloop-nextest-python-api> │ │
  909. 28.60 s gammaloop-nextest-python-api> │ This mode is only permitted for non-commercial use and │
  910. 28.60 s gammaloop-nextest-python-api> │ is limited to one instance and core per machine. │
  911. 28.60 s gammaloop-nextest-python-api> │ │
  912. 28.60 s gammaloop-nextest-python-api> │ Hobbyists can easily acquire a free license key │
  913. 28.60 s gammaloop-nextest-python-api> │ that unlocks all cores and removes this banner: │
  914. 28.60 s gammaloop-nextest-python-api> │ │
  915. 28.60 s gammaloop-nextest-python-api> │ from symbolica import * │
  916. 28.60 s gammaloop-nextest-python-api> │ request_hobbyist_license('YOUR_NAME', 'YOUR_EMAIL') │
  917. 28.60 s gammaloop-nextest-python-api> │ │
  918. 28.60 s gammaloop-nextest-python-api> │ All other users can obtain a free 30-day trial key: │
  919. 28.60 s gammaloop-nextest-python-api> │ │
  920. 28.60 s gammaloop-nextest-python-api> │ from symbolica import * │
  921. 28.60 s gammaloop-nextest-python-api> │ request_trial_license('NAME', 'EMAIL', 'EMPLOYER') │
  922. 28.60 s gammaloop-nextest-python-api> │ │
  923. 28.60 s gammaloop-nextest-python-api> │ See https://symbolica.io/docs/get_started.html#license │
  924. 28.60 s gammaloop-nextest-python-api> └────────────────────────────────────────────────────────┘
  925. 28.60 s gammaloop-nextest-python-api> ┌───────────────────────────────────────────────────────────────────────────────────────────────────────────┐
  926. 28.60 s gammaloop-nextest-python-api> │ Cannot start new unlicensed Symbolica instance since there is already another one running on the machine. │
  927. 28.60 s gammaloop-nextest-python-api> └───────────────────────────────────────────────────────────────────────────────────────────────────────────┘
  928. 28.60 s gammaloop-nextest-python-api>
  929. 28.60 s gammaloop-nextest-python-api> stderr:
  930. 28.60 s gammaloop-nextest-python-api> ┌───────────────────────────────────┐
  931. 28.60 s gammaloop-nextest-python-api> │ The Symbolica license has expired │
  932. 28.60 s gammaloop-nextest-python-api> └───────────────────────────────────┘
  933. 28.60 s gammaloop-nextest-python-api> [2026-09-01 22:09:21.894] @gammaloop_api::se... INFO : Running command import model sm-default
  934. 28.60 s gammaloop-nextest-python-api> [2026-09-01 22:09:21.894] @import::model INFO : Loading built-in JSON model sm-default
  935. 28.60 s gammaloop-nextest-python-api> [2026-09-01 22:09:21.907] @gammaloop_api::se... INFO : Running command set default-runtime kv kinematics.externals='{"type":"constant","data":{"momenta":[[32.0,0.0,0.0,32.0],[32.0,0.0,0.0,-32.0]],"helicities":[1,1]}}'
  936. 28.60 s gammaloop-nextest-python-api> [2026-09-01 22:09:21.907] @gammaloop_api::se... INFO : Running command set default-runtime kv subtraction.disable_threshold_subtraction=true
  937. 28.60 s gammaloop-nextest-python-api> [2026-09-01 22:09:21.908] @gammaloop_api::se... INFO : Running command generate xs e+ e- > d d~ g | e- a d g QED^2==4 [{{2}} QCD=0] --numerator-grouping group_identical_graphs_up_to_sign --clear-existing-processes --only-diagrams
  938. 28.60 s gammaloop-nextest-python-api> [2026-09-01 22:09:22.049] @commands::generate INFO : Generated cross-section 2 graphs.
  939. 28.60 s gammaloop-nextest-python-api> [2026-09-01 22:09:22.050] @commands::generate INFO : Only diagram generation was requested, skipping integrand generation. You can generate integrands later using the 'generate existing <options>' command.
  940. 28.60 s gammaloop-nextest-python-api> [2026-09-01 22:09:22.050] @gammaloop_api::se... INFO : Running command generate
  941. 28.60 s gammaloop-nextest-python-api>
  942. 28.60 s gammaloop-nextest-python-api>
  943. 28.60 s gammaloop-nextest-python-api> Location:
  944. 28.60 s gammaloop-nextest-python-api> tests/tests/test_python_api.rs:157:20
  945. 28.60 s gammaloop-nextest-python-api> =========================================
  946. 28.64 s error: Cannot build '/nix/store/271q8fjm505dyqck3n8ihm4f8zacvzmd-gammaloop-nextest-python-api.drv'.
  947. 28.74 s Reason: builder failed with exit code 100.
  948. 28.74 s Output paths:
  949. 28.74 s /nix/store/6s7gh3jbpmvcgzp68k39cvm0g23p6wcs-gammaloop-nextest-python-api
  950. 28.74 s Last 925 log lines:
  951. 28.74 s > Extracting 1 binary, 1 build script output directory, and 3 linked paths to /build/nextest-archive-LFNGHa
  952. 28.74 s > Extracted 18 files to /build/nextest-archive-LFNGHa in 0.06s
  953. 28.74 s > ------------
  954. 28.74 s > Nextest run ID eca58ccf-43e7-4881-a9b1-c8edde7e61b2 with nextest profile: ci_gammaloop
  955. 28.74 s > Starting 5 tests across 1 binary
  956. 28.74 s > FAIL [ 0.130s] (1/5) gammaloop-integration-tests::test_python_api python_evaluate_sample_honors_generate_events_and_observable_snapshots
  957. 28.74 s > stdout ---
  958. 28.74 s >
  959. 28.74 s > running 1 test
  960. 28.74 s > test python_evaluate_sample_honors_generate_events_and_observable_snapshots ... FAILED
  961. 28.74 s >
  962. 28.74 s > failures:
  963. 28.74 s >
  964. 28.74 s > failures:
  965. 28.74 s > python_evaluate_sample_honors_generate_events_and_observable_snapshots
  966. 28.74 s >
  967. 28.74 s > test result: FAILED. 0 passed; 1 failed; 0 ignored; 0 measured; 4 filtered out; finished in 0.12s
  968. 28.74 s >
  969. 28.74 s > stderr ---
  970. 28.74 s > Error: Python API test subprocess failed.
  971. 28.74 s > stdout:
  972. 28.74 s > ┌────────────────────────────────────────────────────────┐
  973. 28.74 s > │ You are running a restricted Symbolica instance. │
  974. 28.74 s > │ │
  975. 28.74 s > │ This mode is only permitted for non-commercial use and │
  976. 28.74 s > │ is limited to one instance and core per machine. │
  977. 28.74 s > │ │
  978. 28.74 s > │ Hobbyists can easily acquire a free license key │
  979. 28.74 s > │ that unlocks all cores and removes this banner: │
  980. 28.74 s > │ │
  981. 28.74 s > │ from symbolica import * │
  982. 28.74 s > │ request_hobbyist_license('YOUR_NAME', 'YOUR_EMAIL') │
  983. 28.74 s > │ │
  984. 28.74 s > │ All other users can obtain a free 30-day trial key: │
  985. 28.74 s > │ │
  986. 28.74 s > │ from symbolica import * │
  987. 28.74 s > │ request_trial_license('NAME', 'EMAIL', 'EMPLOYER') │
  988. 28.74 s > │ │
  989. 28.74 s > │ See https://symbolica.io/docs/get_started.html#license │
  990. 28.74 s > └────────────────────────────────────────────────────────┘
  991. 28.74 s > ┌───────────────────────────────────────────────────────────────────────────────────────────────────────────┐
  992. 28.74 s > │ Cannot start new unlicensed Symbolica instance since there is already another one running on the machine. │
  993. 28.74 s > └───────────────────────────────────────────────────────────────────────────────────────────────────────────┘
  994. 28.74 s >
  995. 28.74 s > stderr:
  996. 28.74 s > ┌───────────────────────────────────┐
  997. 28.74 s > │ The Symbolica license has expired │
  998. 28.74 s > └───────────────────────────────────┘
  999. 28.74 s >
  1000. 28.74 s >
  1001. 28.74 s > Location:
  1002. 28.74 s > tests/tests/test_python_api.rs:157:20
  1003. 28.74 s >
  1004. 28.74 s > FAIL [ 0.136s] (2/5) gammaloop-integration-tests::test_python_api python_evaluate_samples_batch_and_momentum_space_have_expected_shape
  1005. 28.74 s > stdout ---
  1006. 28.74 s >
  1007. 28.74 s > running 1 test
  1008. 28.74 s > test python_evaluate_samples_batch_and_momentum_space_have_expected_shape ... FAILED
  1009. 28.74 s >
  1010. 28.74 s > failures:
  1011. 28.74 s >
  1012. 28.74 s > failures:
  1013. 28.74 s > python_evaluate_samples_batch_and_momentum_space_have_expected_shape
  1014. 28.74 s >
  1015. 28.74 s > test result: FAILED. 0 passed; 1 failed; 0 ignored; 0 measured; 4 filtered out; finished in 0.13s
  1016. 28.74 s >
  1017. 28.74 s > stderr ---
  1018. 28.74 s > Error: Python API test subprocess failed.
  1019. 28.74 s > stdout:
  1020. 28.74 s > ┌────────────────────────────────────────────────────────┐
  1021. 28.74 s > │ You are running a restricted Symbolica instance. │
  1022. 28.74 s > │ │
  1023. 28.74 s > │ This mode is only permitted for non-commercial use and │
  1024. 28.74 s > │ is limited to one instance and core per machine. │
  1025. 28.74 s > │ │
  1026. 28.74 s > │ Hobbyists can easily acquire a free license key │
  1027. 28.74 s > │ that unlocks all cores and removes this banner: │
  1028. 28.74 s > │ │
  1029. 28.74 s > │ from symbolica import * │
  1030. 28.74 s > │ request_hobbyist_license('YOUR_NAME', 'YOUR_EMAIL') │
  1031. 28.74 s > │ │
  1032. 28.74 s > │ All other users can obtain a free 30-day trial key: │
  1033. 28.74 s > │ │
  1034. 28.74 s > │ from symbolica import * │
  1035. 28.74 s > │ request_trial_license('NAME', 'EMAIL', 'EMPLOYER') │
  1036. 28.74 s > │ │
  1037. 28.74 s > │ See https://symbolica.io/docs/get_started.html#license │
  1038. 28.74 s > └────────────────────────────────────────────────────────┘
  1039. 28.74 s > ┌───────────────────────────────────────────────────────────────────────────────────────────────────────────┐
  1040. 28.74 s > │ Cannot start new unlicensed Symbolica instance since there is already another one running on the machine. │
  1041. 28.74 s > └───────────────────────────────────────────────────────────────────────────────────────────────────────────┘
  1042. 28.74 s >
  1043. 28.74 s > stderr:
  1044. 28.74 s > ┌───────────────────────────────────┐
  1045. 28.74 s > │ The Symbolica license has expired │
  1046. 28.74 s > └───────────────────────────────────┘
  1047. 28.74 s >
  1048. 28.74 s >
  1049. 28.74 s > Location:
  1050. 28.74 s > tests/tests/test_python_api.rs:157:20
  1051. 28.74 s >
  1052. 28.74 s > FAIL [ 0.140s] (3/5) gammaloop-integration-tests::test_python_api python_session_getters_return_live_toml_and_command_blocks
  1053. 28.74 s > stdout ---
  1054. 28.74 s >
  1055. 28.74 s > running 1 test
  1056. 28.74 s > test python_session_getters_return_live_toml_and_command_blocks ... FAILED
  1057. 28.74 s >
  1058. 28.74 s > failures:
  1059. 28.74 s >
  1060. 28.74 s > failures:
  1061. 28.74 s > python_session_getters_return_live_toml_and_command_blocks
  1062. 28.74 s >
  1063. 28.74 s > test result: FAILED. 0 passed; 1 failed; 0 ignored; 0 measured; 4 filtered out; finished in 0.13s
  1064. 28.74 s >
  1065. 28.74 s > stderr ---
  1066. 28.74 s > Error: Python API test subprocess failed.
  1067. 28.74 s > stdout:
  1068. 28.74 s > ┌────────────────────────────────────────────────────────┐
  1069. 28.74 s > │ You are running a restricted Symbolica instance. │
  1070. 28.74 s > │ │
  1071. 28.74 s > │ This mode is only permitted for non-commercial use and │
  1072. 28.74 s > │ is limited to one instance and core per machine. │
  1073. 28.74 s > │ │
  1074. 28.74 s > │ Hobbyists can easily acquire a free license key │
  1075. 28.74 s > │ that unlocks all cores and removes this banner: │
  1076. 28.74 s > │ │
  1077. 28.74 s > │ from symbolica import * │
  1078. 28.74 s > │ request_hobbyist_license('YOUR_NAME', 'YOUR_EMAIL') │
  1079. 28.74 s > │ │
  1080. 28.74 s > │ All other users can obtain a free 30-day trial key: │
  1081. 28.74 s > │ │
  1082. 28.74 s > │ from symbolica import * │
  1083. 28.74 s > │ request_trial_license('NAME', 'EMAIL', 'EMPLOYER') │
  1084. 28.74 s > │ │
  1085. 28.74 s > │ See https://symbolica.io/docs/get_started.html#license │
  1086. 28.74 s > └────────────────────────────────────────────────────────┘
  1087. 28.74 s > ┌───────────────────────────────────────────────────────────────────────────────────────────────────────────┐
  1088. 28.74 s > │ Cannot start new unlicensed Symbolica instance since there is already another one running on the machine. │
  1089. 28.74 s > └───────────────────────────────────────────────────────────────────────────────────────────────────────────┘
  1090. 28.74 s >
  1091. 28.74 s > stderr:
  1092. 28.74 s > ┌───────────────────────────────────┐
  1093. 28.74 s > │ The Symbolica license has expired │
  1094. 28.74 s > └───────────────────────────────────┘
  1095. 28.74 s >
  1096. 28.74 s >
  1097. 28.74 s > Location:
  1098. 28.74 s > tests/tests/test_python_api.rs:157:20
  1099. 28.74 s >
  1100. 28.74 s > FAIL [ 0.212s] (4/5) gammaloop-integration-tests::test_python_api python_settings_wrappers_expose_nested_runtime_and_global_settings
  1101. 28.74 s > stdout ---
  1102. 28.74 s >
  1103. 28.74 s > running 1 test
  1104. 28.74 s > test python_settings_wrappers_expose_nested_runtime_and_global_settings ... FAILED
  1105. 28.74 s >
  1106. 28.74 s > failures:
  1107. 28.74 s >
  1108. 28.74 s > failures:
  1109. 28.74 s > python_settings_wrappers_expose_nested_runtime_and_global_settings
  1110. 28.74 s >
  1111. 28.74 s > test result: FAILED. 0 passed; 1 failed; 0 ignored; 0 measured; 4 filtered out; finished in 0.21s
  1112. 28.74 s >
  1113. 28.74 s > stderr ---
  1114. 28.74 s > Error: Python API test subprocess failed.
  1115. 28.74 s > stdout:
  1116. 28.74 s > ┌────────────────────────────────────────────────────────┐
  1117. 28.74 s > │ You are running a restricted Symbolica instance. │
  1118. 28.74 s > │ │
  1119. 28.74 s > │ This mode is only permitted for non-commercial use and │
  1120. 28.74 s > │ is limited to one instance and core per machine. │
  1121. 28.74 s > │ │
  1122. 28.74 s > │ Hobbyists can easily acquire a free license key │
  1123. 28.74 s > │ that unlocks all cores and removes this banner: │
  1124. 28.74 s > │ │
  1125. 28.74 s > │ from symbolica import * │
  1126. 28.74 s > │ request_hobbyist_license('YOUR_NAME', 'YOUR_EMAIL') │
  1127. 28.74 s > │ │
  1128. 28.74 s > │ All other users can obtain a free 30-day trial key: │
  1129. 28.74 s > │ │
  1130. 28.74 s > │ from symbolica import * │
  1131. 28.74 s > │ request_trial_license('NAME', 'EMAIL', 'EMPLOYER') │
  1132. 28.74 s > │ │
  1133. 28.74 s > │ See https://symbolica.io/docs/get_started.html#license │
  1134. 28.74 s > └────────────────────────────────────────────────────────┘
  1135. 28.74 s > ┌───────────────────────────────────────────────────────────────────────────────────────────────────────────┐
  1136. 28.74 s > │ Cannot start new unlicensed Symbolica instance since there is already another one running on the machine. │
  1137. 28.74 s > └───────────────────────────────────────────────────────────────────────────────────────────────────────────┘
  1138. 28.74 s >
  1139. 28.74 s > stderr:
  1140. 28.74 s > ┌───────────────────────────────────┐
  1141. 28.74 s > │ The Symbolica license has expired │
  1142. 28.74 s > └───────────────────────────────────┘
  1143. 28.74 s >
  1144. 28.74 s >
  1145. 28.74 s > Location:
  1146. 28.74 s > tests/tests/test_python_api.rs:157:20
  1147. 28.74 s >
  1148. 28.74 s > FAIL [ 0.300s] (5/5) gammaloop-integration-tests::test_python_api python_evaluate_sample_preserves_graph_grouping_and_incoming_pdgs
  1149. 28.74 s > stdout ---
  1150. 28.74 s >
  1151. 28.74 s > running 1 test
  1152. 28.74 s > test python_evaluate_sample_preserves_graph_grouping_and_incoming_pdgs ... FAILED
  1153. 28.74 s >
  1154. 28.74 s > failures:
  1155. 28.74 s >
  1156. 28.74 s > failures:
  1157. 28.74 s > python_evaluate_sample_preserves_graph_grouping_and_incoming_pdgs
  1158. 28.74 s >
  1159. 28.74 s > test result: FAILED. 0 passed; 1 failed; 0 ignored; 0 measured; 4 filtered out; finished in 0.29s
  1160. 28.74 s >
  1161. 28.74 s > stderr ---
  1162. 28.74 s > Error: Python API test subprocess failed.
  1163. 28.74 s > stdout:
  1164. 28.74 s > ┌────────────────────────────────────────────────────────┐
  1165. 28.74 s > │ You are running a restricted Symbolica instance. │
  1166. 28.74 s > │ │
  1167. 28.74 s > │ This mode is only permitted for non-commercial use and │
  1168. 28.74 s > │ is limited to one instance and core per machine. │
  1169. 28.74 s > │ │
  1170. 28.74 s > │ Hobbyists can easily acquire a free license key │
  1171. 28.74 s > │ that unlocks all cores and removes this banner: │
  1172. 28.74 s > │ │
  1173. 28.74 s > │ from symbolica import * │
  1174. 28.74 s > │ request_hobbyist_license('YOUR_NAME', 'YOUR_EMAIL') │
  1175. 28.74 s > │ │
  1176. 28.74 s > │ All other users can obtain a free 30-day trial key: │
  1177. 28.74 s > │ │
  1178. 28.74 s > │ from symbolica import * │
  1179. 28.74 s > │ request_trial_license('NAME', 'EMAIL', 'EMPLOYER') │
  1180. 28.74 s > │ │
  1181. 28.74 s > │ See https://symbolica.io/docs/get_started.html#license │
  1182. 28.74 s > └────────────────────────────────────────────────────────┘
  1183. 28.74 s > ┌───────────────────────────────────────────────────────────────────────────────────────────────────────────┐
  1184. 28.74 s > │ Cannot start new unlicensed Symbolica instance since there is already another one running on the machine. │
  1185. 28.74 s > └───────────────────────────────────────────────────────────────────────────────────────────────────────────┘
  1186. 28.74 s >
  1187. 28.74 s > stderr:
  1188. 28.74 s > ┌───────────────────────────────────┐
  1189. 28.74 s > │ The Symbolica license has expired │
  1190. 28.74 s > └───────────────────────────────────┘
  1191. 28.74 s > [2026-09-01 22:09:21.894] @gammaloop_api::se... INFO : Running command import model sm-default
  1192. 28.74 s > [2026-09-01 22:09:21.894] @import::model INFO : Loading built-in JSON model sm-default
  1193. 28.74 s > [2026-09-01 22:09:21.907] @gammaloop_api::se... INFO : Running command set default-runtime kv kinematics.externals='{"type":"constant","data":{"momenta":[[32.0,0.0,0.0,32.0],[32.0,0.0,0.0,-32.0]],"helicities":[1,1]}}'
  1194. 28.74 s > [2026-09-01 22:09:21.907] @gammaloop_api::se... INFO : Running command set default-runtime kv subtraction.disable_threshold_subtraction=true
  1195. 28.74 s > [2026-09-01 22:09:21.908] @gammaloop_api::se... INFO : Running command generate xs e+ e- > d d~ g | e- a d g QED^2==4 [{{2}} QCD=0] --numerator-grouping group_identical_graphs_up_to_sign --clear-existing-processes --only-diagrams
  1196. 28.74 s > [2026-09-01 22:09:22.049] @commands::generate INFO : Generated cross-section 2 graphs.
  1197. 28.74 s > [2026-09-01 22:09:22.050] @commands::generate INFO : Only diagram generation was requested, skipping integrand generation. You can generate integrands later using the 'generate existing <options>' command.
  1198. 28.74 s > [2026-09-01 22:09:22.050] @gammaloop_api::se... INFO : Running command generate
  1199. 28.74 s >
  1200. 28.74 s >
  1201. 28.74 s > Location:
  1202. 28.74 s > tests/tests/test_python_api.rs:157:20
  1203. 28.74 s >
  1204. 28.74 s > ------------
  1205. 28.74 s > Summary [ 0.301s] 5 tests run: 0 passed, 5 failed, 0 skipped
  1206. 28.74 s > FAIL [ 0.130s] (1/5) gammaloop-integration-tests::test_python_api python_evaluate_sample_honors_generate_events_and_observable_snapshots
  1207. 28.74 s > stdout ---
  1208. 28.74 s >
  1209. 28.74 s > running 1 test
  1210. 28.74 s > test python_evaluate_sample_honors_generate_events_and_observable_snapshots ... FAILED
  1211. 28.74 s >
  1212. 28.74 s > failures:
  1213. 28.74 s >
  1214. 28.74 s > failures:
  1215. 28.74 s > python_evaluate_sample_honors_generate_events_and_observable_snapshots
  1216. 28.74 s >
  1217. 28.74 s > test result: FAILED. 0 passed; 1 failed; 0 ignored; 0 measured; 4 filtered out; finished in 0.12s
  1218. 28.74 s >
  1219. 28.74 s > stderr ---
  1220. 28.74 s > Error: Python API test subprocess failed.
  1221. 28.74 s > stdout:
  1222. 28.74 s > ┌────────────────────────────────────────────────────────┐
  1223. 28.74 s > │ You are running a restricted Symbolica instance. │
  1224. 28.74 s > │ │
  1225. 28.74 s > │ This mode is only permitted for non-commercial use and │
  1226. 28.74 s > │ is limited to one instance and core per machine. │
  1227. 28.74 s > │ │
  1228. 28.74 s > │ Hobbyists can easily acquire a free license key │
  1229. 28.74 s > │ that unlocks all cores and removes this banner: │
  1230. 28.74 s > │ │
  1231. 28.74 s > │ from symbolica import * │
  1232. 28.74 s > │ request_hobbyist_license('YOUR_NAME', 'YOUR_EMAIL') │
  1233. 28.74 s > │ │
  1234. 28.74 s > │ All other users can obtain a free 30-day trial key: │
  1235. 28.74 s > │ │
  1236. 28.74 s > │ from symbolica import * │
  1237. 28.74 s > │ request_trial_license('NAME', 'EMAIL', 'EMPLOYER') │
  1238. 28.74 s > │ │
  1239. 28.74 s > │ See https://symbolica.io/docs/get_started.html#license │
  1240. 28.74 s > └────────────────────────────────────────────────────────┘
  1241. 28.74 s > ┌───────────────────────────────────────────────────────────────────────────────────────────────────────────┐
  1242. 28.74 s > │ Cannot start new unlicensed Symbolica instance since there is already another one running on the machine. │
  1243. 28.74 s > └───────────────────────────────────────────────────────────────────────────────────────────────────────────┘
  1244. 28.74 s >
  1245. 28.74 s > stderr:
  1246. 28.74 s > ┌───────────────────────────────────┐
  1247. 28.74 s > │ The Symbolica license has expired │
  1248. 28.74 s > └───────────────────────────────────┘
  1249. 28.74 s >
  1250. 28.74 s >
  1251. 28.74 s > Location:
  1252. 28.74 s > tests/tests/test_python_api.rs:157:20
  1253. 28.74 s >
  1254. 28.74 s > FAIL [ 0.136s] (2/5) gammaloop-integration-tests::test_python_api python_evaluate_samples_batch_and_momentum_space_have_expected_shape
  1255. 28.74 s > stdout ---
  1256. 28.74 s >
  1257. 28.74 s > running 1 test
  1258. 28.74 s > test python_evaluate_samples_batch_and_momentum_space_have_expected_shape ... FAILED
  1259. 28.74 s >
  1260. 28.74 s > failures:
  1261. 28.74 s >
  1262. 28.74 s > failures:
  1263. 28.74 s > python_evaluate_samples_batch_and_momentum_space_have_expected_shape
  1264. 28.74 s >
  1265. 28.74 s > test result: FAILED. 0 passed; 1 failed; 0 ignored; 0 measured; 4 filtered out; finished in 0.13s
  1266. 28.74 s >
  1267. 28.74 s > stderr ---
  1268. 28.74 s > Error: Python API test subprocess failed.
  1269. 28.74 s > stdout:
  1270. 28.74 s > ┌────────────────────────────────────────────────────────┐
  1271. 28.74 s > │ You are running a restricted Symbolica instance. │
  1272. 28.74 s > │ │
  1273. 28.74 s > │ This mode is only permitted for non-commercial use and │
  1274. 28.74 s > │ is limited to one instance and core per machine. │
  1275. 28.74 s > │ │
  1276. 28.74 s > │ Hobbyists can easily acquire a free license key │
  1277. 28.74 s > │ that unlocks all cores and removes this banner: │
  1278. 28.74 s > │ │
  1279. 28.74 s > │ from symbolica import * │
  1280. 28.74 s > │ request_hobbyist_license('YOUR_NAME', 'YOUR_EMAIL') │
  1281. 28.74 s > │ │
  1282. 28.74 s > │ All other users can obtain a free 30-day trial key: │
  1283. 28.74 s > │ │
  1284. 28.74 s > │ from symbolica import * │
  1285. 28.74 s > │ request_trial_license('NAME', 'EMAIL', 'EMPLOYER') │
  1286. 28.74 s > │ │
  1287. 28.74 s > │ See https://symbolica.io/docs/get_started.html#license │
  1288. 28.74 s > └────────────────────────────────────────────────────────┘
  1289. 28.74 s > ┌───────────────────────────────────────────────────────────────────────────────────────────────────────────┐
  1290. 28.74 s > │ Cannot start new unlicensed Symbolica instance since there is already another one running on the machine. │
  1291. 28.74 s > └───────────────────────────────────────────────────────────────────────────────────────────────────────────┘
  1292. 28.74 s >
  1293. 28.74 s > stderr:
  1294. 28.74 s > ┌───────────────────────────────────┐
  1295. 28.74 s > │ The Symbolica license has expired │
  1296. 28.74 s > └───────────────────────────────────┘
  1297. 28.74 s >
  1298. 28.74 s >
  1299. 28.74 s > Location:
  1300. 28.74 s > tests/tests/test_python_api.rs:157:20
  1301. 28.74 s >
  1302. 28.74 s > FAIL [ 0.140s] (3/5) gammaloop-integration-tests::test_python_api python_session_getters_return_live_toml_and_command_blocks
  1303. 28.74 s > stdout ---
  1304. 28.74 s >
  1305. 28.74 s > running 1 test
  1306. 28.74 s > test python_session_getters_return_live_toml_and_command_blocks ... FAILED
  1307. 28.74 s >
  1308. 28.74 s > failures:
  1309. 28.74 s >
  1310. 28.74 s > failures:
  1311. 28.74 s > python_session_getters_return_live_toml_and_command_blocks
  1312. 28.74 s >
  1313. 28.74 s > test result: FAILED. 0 passed; 1 failed; 0 ignored; 0 measured; 4 filtered out; finished in 0.13s
  1314. 28.74 s >
  1315. 28.74 s > stderr ---
  1316. 28.74 s > Error: Python API test subprocess failed.
  1317. 28.74 s > stdout:
  1318. 28.74 s > ┌────────────────────────────────────────────────────────┐
  1319. 28.74 s > │ You are running a restricted Symbolica instance. │
  1320. 28.74 s > │ │
  1321. 28.74 s > │ This mode is only permitted for non-commercial use and │
  1322. 28.74 s > │ is limited to one instance and core per machine. │
  1323. 28.74 s > │ │
  1324. 28.74 s > │ Hobbyists can easily acquire a free license key │
  1325. 28.74 s > │ that unlocks all cores and removes this banner: │
  1326. 28.74 s > │ │
  1327. 28.74 s > │ from symbolica import * │
  1328. 28.74 s > │ request_hobbyist_license('YOUR_NAME', 'YOUR_EMAIL') │
  1329. 28.74 s > │ │
  1330. 28.74 s > │ All other users can obtain a free 30-day trial key: │
  1331. 28.74 s > │ │
  1332. 28.74 s > │ from symbolica import * │
  1333. 28.74 s > │ request_trial_license('NAME', 'EMAIL', 'EMPLOYER') │
  1334. 28.74 s > │ │
  1335. 28.74 s > │ See https://symbolica.io/docs/get_started.html#license │
  1336. 28.74 s > └────────────────────────────────────────────────────────┘
  1337. 28.74 s > ┌───────────────────────────────────────────────────────────────────────────────────────────────────────────┐
  1338. 28.74 s > │ Cannot start new unlicensed Symbolica instance since there is already another one running on the machine. │
  1339. 28.74 s > └───────────────────────────────────────────────────────────────────────────────────────────────────────────┘
  1340. 28.74 s >
  1341. 28.74 s > stderr:
  1342. 28.74 s > ┌───────────────────────────────────┐
  1343. 28.74 s > │ The Symbolica license has expired │
  1344. 28.74 s > └───────────────────────────────────┘
  1345. 28.74 s >
  1346. 28.74 s >
  1347. 28.74 s > Location:
  1348. 28.74 s > tests/tests/test_python_api.rs:157:20
  1349. 28.74 s >
  1350. 28.74 s > FAIL [ 0.212s] (4/5) gammaloop-integration-tests::test_python_api python_settings_wrappers_expose_nested_runtime_and_global_settings
  1351. 28.74 s > stdout ---
  1352. 28.74 s >
  1353. 28.74 s > running 1 test
  1354. 28.74 s > test python_settings_wrappers_expose_nested_runtime_and_global_settings ... FAILED
  1355. 28.74 s >
  1356. 28.74 s > failures:
  1357. 28.74 s >
  1358. 28.74 s > failures:
  1359. 28.74 s > python_settings_wrappers_expose_nested_runtime_and_global_settings
  1360. 28.74 s >
  1361. 28.74 s > test result: FAILED. 0 passed; 1 failed; 0 ignored; 0 measured; 4 filtered out; finished in 0.21s
  1362. 28.74 s >
  1363. 28.74 s > stderr ---
  1364. 28.74 s > Error: Python API test subprocess failed.
  1365. 28.74 s > stdout:
  1366. 28.74 s > ┌────────────────────────────────────────────────────────┐
  1367. 28.74 s > │ You are running a restricted Symbolica instance. │
  1368. 28.74 s > │ │
  1369. 28.74 s > │ This mode is only permitted for non-commercial use and │
  1370. 28.74 s > │ is limited to one instance and core per machine. │
  1371. 28.74 s > │ │
  1372. 28.74 s > │ Hobbyists can easily acquire a free license key │
  1373. 28.74 s > │ that unlocks all cores and removes this banner: │
  1374. 28.74 s > │ │
  1375. 28.74 s > │ from symbolica import * │
  1376. 28.74 s > │ request_hobbyist_license('YOUR_NAME', 'YOUR_EMAIL') │
  1377. 28.74 s > │ │
  1378. 28.74 s > │ All other users can obtain a free 30-day trial key: │
  1379. 28.74 s > │ │
  1380. 28.74 s > │ from symbolica import * │
  1381. 28.74 s > │ request_trial_license('NAME', 'EMAIL', 'EMPLOYER') │
  1382. 28.74 s > │ │
  1383. 28.74 s > │ See https://symbolica.io/docs/get_started.html#license │
  1384. 28.74 s > └────────────────────────────────────────────────────────┘
  1385. 28.74 s > ┌───────────────────────────────────────────────────────────────────────────────────────────────────────────┐
  1386. 28.74 s > │ Cannot start new unlicensed Symbolica instance since there is already another one running on the machine. │
  1387. 28.74 s > └───────────────────────────────────────────────────────────────────────────────────────────────────────────┘
  1388. 28.74 s >
  1389. 28.74 s > stderr:
  1390. 28.74 s > ┌───────────────────────────────────┐
  1391. 28.74 s > │ The Symbolica license has expired │
  1392. 28.74 s > └───────────────────────────────────┘
  1393. 28.74 s >
  1394. 28.74 s >
  1395. 28.74 s > Location:
  1396. 28.74 s > tests/tests/test_python_api.rs:157:20
  1397. 28.74 s >
  1398. 28.74 s > FAIL [ 0.300s] (5/5) gammaloop-integration-tests::test_python_api python_evaluate_sample_preserves_graph_grouping_and_incoming_pdgs
  1399. 28.74 s > stdout ---
  1400. 28.74 s >
  1401. 28.74 s > running 1 test
  1402. 28.74 s > test python_evaluate_sample_preserves_graph_grouping_and_incoming_pdgs ... FAILED
  1403. 28.74 s >
  1404. 28.74 s > failures:
  1405. 28.74 s >
  1406. 28.74 s > failures:
  1407. 28.74 s > python_evaluate_sample_preserves_graph_grouping_and_incoming_pdgs
  1408. 28.74 s >
  1409. 28.74 s > test result: FAILED. 0 passed; 1 failed; 0 ignored; 0 measured; 4 filtered out; finished in 0.29s
  1410. 28.74 s >
  1411. 28.74 s > stderr ---
  1412. 28.74 s > Error: Python API test subprocess failed.
  1413. 28.74 s > stdout:
  1414. 28.74 s > ┌────────────────────────────────────────────────────────┐
  1415. 28.74 s > │ You are running a restricted Symbolica instance. │
  1416. 28.74 s > │ │
  1417. 28.74 s > │ This mode is only permitted for non-commercial use and │
  1418. 28.74 s > │ is limited to one instance and core per machine. │
  1419. 28.74 s > │ │
  1420. 28.74 s > │ Hobbyists can easily acquire a free license key │
  1421. 28.74 s > │ that unlocks all cores and removes this banner: │
  1422. 28.74 s > │ │
  1423. 28.74 s > │ from symbolica import * │
  1424. 28.74 s > │ request_hobbyist_license('YOUR_NAME', 'YOUR_EMAIL') │
  1425. 28.74 s > │ │
  1426. 28.74 s > │ All other users can obtain a free 30-day trial key: │
  1427. 28.74 s > │ │
  1428. 28.74 s > │ from symbolica import * │
  1429. 28.74 s > │ request_trial_license('NAME', 'EMAIL', 'EMPLOYER') │
  1430. 28.74 s > │ │
  1431. 28.74 s > │ See https://symbolica.io/docs/get_started.html#license │
  1432. 28.74 s > └────────────────────────────────────────────────────────┘
  1433. 28.74 s > ┌───────────────────────────────────────────────────────────────────────────────────────────────────────────┐
  1434. 28.74 s > │ Cannot start new unlicensed Symbolica instance since there is already another one running on the machine. │
  1435. 28.74 s > └───────────────────────────────────────────────────────────────────────────────────────────────────────────┘
  1436. 28.74 s >
  1437. 28.74 s > stderr:
  1438. 28.74 s > ┌───────────────────────────────────┐
  1439. 28.74 s > │ The Symbolica license has expired │
  1440. 28.74 s > └───────────────────────────────────┘
  1441. 28.74 s > [2026-09-01 22:09:21.894] @gammaloop_api::se... INFO : Running command import model sm-default
  1442. 28.74 s > [2026-09-01 22:09:21.894] @import::model INFO : Loading built-in JSON model sm-default
  1443. 28.74 s > [2026-09-01 22:09:21.907] @gammaloop_api::se... INFO : Running command set default-runtime kv kinematics.externals='{"type":"constant","data":{"momenta":[[32.0,0.0,0.0,32.0],[32.0,0.0,0.0,-32.0]],"helicities":[1,1]}}'
  1444. 28.74 s > [2026-09-01 22:09:21.907] @gammaloop_api::se... INFO : Running command set default-runtime kv subtraction.disable_threshold_subtraction=true
  1445. 28.74 s > [2026-09-01 22:09:21.908] @gammaloop_api::se... INFO : Running command generate xs e+ e- > d d~ g | e- a d g QED^2==4 [{{2}} QCD=0] --numerator-grouping group_identical_graphs_up_to_sign --clear-existing-processes --only-diagrams
  1446. 28.74 s > [2026-09-01 22:09:22.049] @commands::generate INFO : Generated cross-section 2 graphs.
  1447. 28.74 s > [2026-09-01 22:09:22.050] @commands::generate INFO : Only diagram generation was requested, skipping integrand generation. You can generate integrands later using the 'generate existing <options>' command.
  1448. 28.74 s > [2026-09-01 22:09:22.050] @gammaloop_api::se... INFO : Running command generate
  1449. 28.74 s >
  1450. 28.74 s >
  1451. 28.74 s > Location:
  1452. 28.74 s > tests/tests/test_python_api.rs:157:20
  1453. 28.74 s >
  1454. 28.74 s > error: test run failed
  1455. 28.74 s >
  1456. 28.74 s > ========== nextest test summary ==========
  1457. 28.74 s > report: target/nextest/ci_gammaloop/junit.xml
  1458. 28.74 s > tests: 5, failures: 5, errors: 0
  1459. 28.74 s >
  1460. 28.74 s > 1. gammaloop-integration-tests::test_python_api::python_evaluate_sample_honors_generate_events_and_observable_snapshots
  1461. 28.74 s > failure: test failure with exit code 101
  1462. 28.74 s > Error: Python API test subprocess failed.
  1463. 28.74 s > stdout:
  1464. 28.74 s > ┌────────────────────────────────────────────────────────┐
  1465. 28.74 s > │ You are running a restricted Symbolica instance. │
  1466. 28.74 s > │ │
  1467. 28.74 s > │ This mode is only permitted for non-commercial use and │
  1468. 28.74 s > │ is limited to one instance and core per machine. │
  1469. 28.74 s > │ │
  1470. 28.74 s > │ Hobbyists can easily acquire a free license key │
  1471. 28.74 s > │ that unlocks all cores and removes this banner: │
  1472. 28.74 s > │ │
  1473. 28.74 s > │ from symbolica import * │
  1474. 28.74 s > │ request_hobbyist_license('YOUR_NAME', 'YOUR_EMAIL') │
  1475. 28.74 s > │ │
  1476. 28.74 s > │ All other users can obtain a free 30-day trial key: │
  1477. 28.74 s > │ │
  1478. 28.74 s > │ from symbolica import * │
  1479. 28.74 s > │ request_trial_license('NAME', 'EMAIL', 'EMPLOYER') │
  1480. 28.74 s > │ │
  1481. 28.74 s > │ See https://symbolica.io/docs/get_started.html#license │
  1482. 28.74 s > └────────────────────────────────────────────────────────┘
  1483. 28.74 s > ┌───────────────────────────────────────────────────────────────────────────────────────────────────────────┐
  1484. 28.74 s > │ Cannot start new unlicensed Symbolica instance since there is already another one running on the machine. │
  1485. 28.74 s > └───────────────────────────────────────────────────────────────────────────────────────────────────────────┘
  1486. 28.74 s >
  1487. 28.74 s > stderr:
  1488. 28.74 s > ┌───────────────────────────────────┐
  1489. 28.74 s > │ The Symbolica license has expired │
  1490. 28.74 s > └───────────────────────────────────┘
  1491. 28.74 s >
  1492. 28.74 s >
  1493. 28.74 s > Location:
  1494. 28.74 s > tests/tests/test_python_api.rs:157:20
  1495. 28.74 s > system-out
  1496. 28.74 s > running 1 test
  1497. 28.74 s > test python_evaluate_sample_honors_generate_events_and_observable_snapshots ... FAILED
  1498. 28.74 s >
  1499. 28.74 s > failures:
  1500. 28.74 s >
  1501. 28.74 s > failures:
  1502. 28.74 s > python_evaluate_sample_honors_generate_events_and_observable_snapshots
  1503. 28.74 s >
  1504. 28.74 s > test result: FAILED. 0 passed; 1 failed; 0 ignored; 0 measured; 4 filtered out; finished in 0.12s
  1505. 28.74 s > system-err
  1506. 28.74 s > Error: Python API test subprocess failed.
  1507. 28.74 s > stdout:
  1508. 28.74 s > ┌────────────────────────────────────────────────────────┐
  1509. 28.74 s > │ You are running a restricted Symbolica instance. │
  1510. 28.74 s > │ │
  1511. 28.74 s > │ This mode is only permitted for non-commercial use and │
  1512. 28.74 s > │ is limited to one instance and core per machine. │
  1513. 28.74 s > │ │
  1514. 28.74 s > │ Hobbyists can easily acquire a free license key │
  1515. 28.74 s > │ that unlocks all cores and removes this banner: │
  1516. 28.74 s > │ │
  1517. 28.74 s > │ from symbolica import * │
  1518. 28.74 s > │ request_hobbyist_license('YOUR_NAME', 'YOUR_EMAIL') │
  1519. 28.74 s > │ │
  1520. 28.74 s > │ All other users can obtain a free 30-day trial key: │
  1521. 28.74 s > │ │
  1522. 28.74 s > │ from symbolica import * │
  1523. 28.74 s > │ request_trial_license('NAME', 'EMAIL', 'EMPLOYER') │
  1524. 28.74 s > │ │
  1525. 28.74 s > │ See https://symbolica.io/docs/get_started.html#license │
  1526. 28.74 s > └────────────────────────────────────────────────────────┘
  1527. 28.74 s > ┌───────────────────────────────────────────────────────────────────────────────────────────────────────────┐
  1528. 28.74 s > │ Cannot start new unlicensed Symbolica instance since there is already another one running on the machine. │
  1529. 28.74 s > └───────────────────────────────────────────────────────────────────────────────────────────────────────────┘
  1530. 28.74 s >
  1531. 28.74 s > stderr:
  1532. 28.74 s > ┌───────────────────────────────────┐
  1533. 28.74 s > │ The Symbolica license has expired │
  1534. 28.74 s > └───────────────────────────────────┘
  1535. 28.74 s >
  1536. 28.74 s >
  1537. 28.74 s > Location:
  1538. 28.74 s > tests/tests/test_python_api.rs:157:20
  1539. 28.74 s >
  1540. 28.74 s > 2. gammaloop-integration-tests::test_python_api::python_evaluate_samples_batch_and_momentum_space_have_expected_shape
  1541. 28.74 s > failure: test failure with exit code 101
  1542. 28.74 s > Error: Python API test subprocess failed.
  1543. 28.74 s > stdout:
  1544. 28.74 s > ┌────────────────────────────────────────────────────────┐
  1545. 28.74 s > │ You are running a restricted Symbolica instance. │
  1546. 28.74 s > │ │
  1547. 28.74 s > │ This mode is only permitted for non-commercial use and │
  1548. 28.74 s > │ is limited to one instance and core per machine. │
  1549. 28.74 s > │ │
  1550. 28.74 s > │ Hobbyists can easily acquire a free license key │
  1551. 28.74 s > │ that unlocks all cores and removes this banner: │
  1552. 28.74 s > │ │
  1553. 28.74 s > │ from symbolica import * │
  1554. 28.74 s > │ request_hobbyist_license('YOUR_NAME', 'YOUR_EMAIL') │
  1555. 28.74 s > │ │
  1556. 28.74 s > │ All other users can obtain a free 30-day trial key: │
  1557. 28.74 s > │ │
  1558. 28.74 s > │ from symbolica import * │
  1559. 28.74 s > │ request_trial_license('NAME', 'EMAIL', 'EMPLOYER') │
  1560. 28.74 s > │ │
  1561. 28.74 s > │ See https://symbolica.io/docs/get_started.html#license │
  1562. 28.74 s > └────────────────────────────────────────────────────────┘
  1563. 28.74 s > ┌───────────────────────────────────────────────────────────────────────────────────────────────────────────┐
  1564. 28.74 s > │ Cannot start new unlicensed Symbolica instance since there is already another one running on the machine. │
  1565. 28.74 s > └───────────────────────────────────────────────────────────────────────────────────────────────────────────┘
  1566. 28.74 s >
  1567. 28.74 s > stderr:
  1568. 28.74 s > ┌───────────────────────────────────┐
  1569. 28.74 s > │ The Symbolica license has expired │
  1570. 28.74 s > └───────────────────────────────────┘
  1571. 28.74 s >
  1572. 28.74 s >
  1573. 28.74 s > Location:
  1574. 28.74 s > tests/tests/test_python_api.rs:157:20
  1575. 28.74 s > system-out
  1576. 28.74 s > running 1 test
  1577. 28.74 s > test python_evaluate_samples_batch_and_momentum_space_have_expected_shape ... FAILED
  1578. 28.74 s >
  1579. 28.74 s > failures:
  1580. 28.74 s >
  1581. 28.74 s > failures:
  1582. 28.74 s > python_evaluate_samples_batch_and_momentum_space_have_expected_shape
  1583. 28.74 s >
  1584. 28.74 s > test result: FAILED. 0 passed; 1 failed; 0 ignored; 0 measured; 4 filtered out; finished in 0.13s
  1585. 28.74 s > system-err
  1586. 28.74 s > Error: Python API test subprocess failed.
  1587. 28.74 s > stdout:
  1588. 28.74 s > ┌────────────────────────────────────────────────────────┐
  1589. 28.74 s > │ You are running a restricted Symbolica instance. │
  1590. 28.74 s > │ │
  1591. 28.74 s > │ This mode is only permitted for non-commercial use and │
  1592. 28.74 s > │ is limited to one instance and core per machine. │
  1593. 28.74 s > │ │
  1594. 28.74 s > │ Hobbyists can easily acquire a free license key │
  1595. 28.74 s > │ that unlocks all cores and removes this banner: │
  1596. 28.74 s > │ │
  1597. 28.74 s > │ from symbolica import * │
  1598. 28.74 s > │ request_hobbyist_license('YOUR_NAME', 'YOUR_EMAIL') │
  1599. 28.74 s > │ │
  1600. 28.74 s > │ All other users can obtain a free 30-day trial key: │
  1601. 28.74 s > │ │
  1602. 28.74 s > │ from symbolica import * │
  1603. 28.74 s > │ request_trial_license('NAME', 'EMAIL', 'EMPLOYER') │
  1604. 28.74 s > │ │
  1605. 28.74 s > │ See https://symbolica.io/docs/get_started.html#license │
  1606. 28.74 s > └────────────────────────────────────────────────────────┘
  1607. 28.74 s > ┌───────────────────────────────────────────────────────────────────────────────────────────────────────────┐
  1608. 28.74 s > │ Cannot start new unlicensed Symbolica instance since there is already another one running on the machine. │
  1609. 28.74 s > └───────────────────────────────────────────────────────────────────────────────────────────────────────────┘
  1610. 28.74 s >
  1611. 28.74 s > stderr:
  1612. 28.74 s > ┌───────────────────────────────────┐
  1613. 28.74 s > │ The Symbolica license has expired │
  1614. 28.74 s > └───────────────────────────────────┘
  1615. 28.74 s >
  1616. 28.74 s >
  1617. 28.74 s > Location:
  1618. 28.74 s > tests/tests/test_python_api.rs:157:20
  1619. 28.74 s >
  1620. 28.74 s > 3. gammaloop-integration-tests::test_python_api::python_session_getters_return_live_toml_and_command_blocks
  1621. 28.74 s > failure: test failure with exit code 101
  1622. 28.74 s > Error: Python API test subprocess failed.
  1623. 28.74 s > stdout:
  1624. 28.74 s > ┌────────────────────────────────────────────────────────┐
  1625. 28.74 s > │ You are running a restricted Symbolica instance. │
  1626. 28.74 s > │ │
  1627. 28.74 s > │ This mode is only permitted for non-commercial use and │
  1628. 28.74 s > │ is limited to one instance and core per machine. │
  1629. 28.74 s > │ │
  1630. 28.74 s > │ Hobbyists can easily acquire a free license key │
  1631. 28.74 s > │ that unlocks all cores and removes this banner: │
  1632. 28.74 s > │ │
  1633. 28.74 s > │ from symbolica import * │
  1634. 28.74 s > │ request_hobbyist_license('YOUR_NAME', 'YOUR_EMAIL') │
  1635. 28.74 s > │ │
  1636. 28.74 s > │ All other users can obtain a free 30-day trial key: │
  1637. 28.74 s > │ │
  1638. 28.74 s > │ from symbolica import * │
  1639. 28.74 s > │ request_trial_license('NAME', 'EMAIL', 'EMPLOYER') │
  1640. 28.74 s > │ │
  1641. 28.74 s > │ See https://symbolica.io/docs/get_started.html#license │
  1642. 28.74 s > └────────────────────────────────────────────────────────┘
  1643. 28.74 s > ┌───────────────────────────────────────────────────────────────────────────────────────────────────────────┐
  1644. 28.74 s > │ Cannot start new unlicensed Symbolica instance since there is already another one running on the machine. │
  1645. 28.74 s > └───────────────────────────────────────────────────────────────────────────────────────────────────────────┘
  1646. 28.74 s >
  1647. 28.74 s > stderr:
  1648. 28.74 s > ┌───────────────────────────────────┐
  1649. 28.74 s > │ The Symbolica license has expired │
  1650. 28.74 s > └───────────────────────────────────┘
  1651. 28.74 s >
  1652. 28.74 s >
  1653. 28.74 s > Location:
  1654. 28.74 s > tests/tests/test_python_api.rs:157:20
  1655. 28.74 s > system-out
  1656. 28.74 s > running 1 test
  1657. 28.74 s > test python_session_getters_return_live_toml_and_command_blocks ... FAILED
  1658. 28.74 s >
  1659. 28.74 s > failures:
  1660. 28.74 s >
  1661. 28.74 s > failures:
  1662. 28.74 s > python_session_getters_return_live_toml_and_command_blocks
  1663. 28.74 s >
  1664. 28.74 s > test result: FAILED. 0 passed; 1 failed; 0 ignored; 0 measured; 4 filtered out; finished in 0.13s
  1665. 28.74 s > system-err
  1666. 28.74 s > Error: Python API test subprocess failed.
  1667. 28.74 s > stdout:
  1668. 28.74 s > ┌────────────────────────────────────────────────────────┐
  1669. 28.74 s > │ You are running a restricted Symbolica instance. │
  1670. 28.74 s > │ │
  1671. 28.74 s > │ This mode is only permitted for non-commercial use and │
  1672. 28.74 s > │ is limited to one instance and core per machine. │
  1673. 28.74 s > │ │
  1674. 28.74 s > │ Hobbyists can easily acquire a free license key │
  1675. 28.74 s > │ that unlocks all cores and removes this banner: │
  1676. 28.74 s > │ │
  1677. 28.74 s > │ from symbolica import * │
  1678. 28.74 s > │ request_hobbyist_license('YOUR_NAME', 'YOUR_EMAIL') │
  1679. 28.74 s > │ │
  1680. 28.74 s > │ All other users can obtain a free 30-day trial key: │
  1681. 28.74 s > │ │
  1682. 28.74 s > │ from symbolica import * │
  1683. 28.74 s > │ request_trial_license('NAME', 'EMAIL', 'EMPLOYER') │
  1684. 28.74 s > │ │
  1685. 28.74 s > │ See https://symbolica.io/docs/get_started.html#license │
  1686. 28.74 s > └────────────────────────────────────────────────────────┘
  1687. 28.74 s > ┌───────────────────────────────────────────────────────────────────────────────────────────────────────────┐
  1688. 28.74 s > │ Cannot start new unlicensed Symbolica instance since there is already another one running on the machine. │
  1689. 28.74 s > └───────────────────────────────────────────────────────────────────────────────────────────────────────────┘
  1690. 28.74 s >
  1691. 28.74 s > stderr:
  1692. 28.74 s > ┌───────────────────────────────────┐
  1693. 28.74 s > │ The Symbolica license has expired │
  1694. 28.74 s > └───────────────────────────────────┘
  1695. 28.74 s >
  1696. 28.74 s >
  1697. 28.74 s > Location:
  1698. 28.74 s > tests/tests/test_python_api.rs:157:20
  1699. 28.74 s >
  1700. 28.74 s > 4. gammaloop-integration-tests::test_python_api::python_settings_wrappers_expose_nested_runtime_and_global_settings
  1701. 28.74 s > failure: test failure with exit code 101
  1702. 28.74 s > Error: Python API test subprocess failed.
  1703. 28.74 s > stdout:
  1704. 28.74 s > ┌────────────────────────────────────────────────────────┐
  1705. 28.74 s > │ You are running a restricted Symbolica instance. │
  1706. 28.74 s > │ │
  1707. 28.74 s > │ This mode is only permitted for non-commercial use and │
  1708. 28.74 s > │ is limited to one instance and core per machine. │
  1709. 28.74 s > │ │
  1710. 28.74 s > │ Hobbyists can easily acquire a free license key │
  1711. 28.74 s > │ that unlocks all cores and removes this banner: │
  1712. 28.74 s > │ │
  1713. 28.74 s > │ from symbolica import * │
  1714. 28.74 s > │ request_hobbyist_license('YOUR_NAME', 'YOUR_EMAIL') │
  1715. 28.74 s > │ │
  1716. 28.74 s > │ All other users can obtain a free 30-day trial key: │
  1717. 28.74 s > │ │
  1718. 28.74 s > │ from symbolica import * │
  1719. 28.74 s > │ request_trial_license('NAME', 'EMAIL', 'EMPLOYER') │
  1720. 28.74 s > │ │
  1721. 28.74 s > │ See https://symbolica.io/docs/get_started.html#license │
  1722. 28.74 s > └────────────────────────────────────────────────────────┘
  1723. 28.74 s > ┌───────────────────────────────────────────────────────────────────────────────────────────────────────────┐
  1724. 28.74 s > │ Cannot start new unlicensed Symbolica instance since there is already another one running on the machine. │
  1725. 28.74 s > └───────────────────────────────────────────────────────────────────────────────────────────────────────────┘
  1726. 28.74 s >
  1727. 28.74 s > stderr:
  1728. 28.74 s > ┌───────────────────────────────────┐
  1729. 28.74 s > │ The Symbolica license has expired │
  1730. 28.74 s > └───────────────────────────────────┘
  1731. 28.74 s >
  1732. 28.74 s >
  1733. 28.74 s > Location:
  1734. 28.74 s > tests/tests/test_python_api.rs:157:20
  1735. 28.74 s > system-out
  1736. 28.74 s > running 1 test
  1737. 28.74 s > test python_settings_wrappers_expose_nested_runtime_and_global_settings ... FAILED
  1738. 28.74 s >
  1739. 28.74 s > failures:
  1740. 28.74 s >
  1741. 28.74 s > failures:
  1742. 28.74 s > python_settings_wrappers_expose_nested_runtime_and_global_settings
  1743. 28.74 s >
  1744. 28.74 s > test result: FAILED. 0 passed; 1 failed; 0 ignored; 0 measured; 4 filtered out; finished in 0.21s
  1745. 28.74 s > system-err
  1746. 28.74 s > Error: Python API test subprocess failed.
  1747. 28.74 s > stdout:
  1748. 28.74 s > ┌────────────────────────────────────────────────────────┐
  1749. 28.74 s > │ You are running a restricted Symbolica instance. │
  1750. 28.74 s > │ │
  1751. 28.74 s > │ This mode is only permitted for non-commercial use and │
  1752. 28.74 s > │ is limited to one instance and core per machine. │
  1753. 28.74 s > │ │
  1754. 28.74 s > │ Hobbyists can easily acquire a free license key │
  1755. 28.74 s > │ that unlocks all cores and removes this banner: │
  1756. 28.74 s > │ │
  1757. 28.74 s > │ from symbolica import * │
  1758. 28.74 s > │ request_hobbyist_license('YOUR_NAME', 'YOUR_EMAIL') │
  1759. 28.74 s > │ │
  1760. 28.74 s > │ All other users can obtain a free 30-day trial key: │
  1761. 28.74 s > │ │
  1762. 28.74 s > │ from symbolica import * │
  1763. 28.74 s > │ request_trial_license('NAME', 'EMAIL', 'EMPLOYER') │
  1764. 28.74 s > │ │
  1765. 28.74 s > │ See https://symbolica.io/docs/get_started.html#license │
  1766. 28.74 s > └────────────────────────────────────────────────────────┘
  1767. 28.74 s > ┌───────────────────────────────────────────────────────────────────────────────────────────────────────────┐
  1768. 28.74 s > │ Cannot start new unlicensed Symbolica instance since there is already another one running on the machine. │
  1769. 28.74 s > └───────────────────────────────────────────────────────────────────────────────────────────────────────────┘
  1770. 28.74 s >
  1771. 28.74 s > stderr:
  1772. 28.74 s > ┌───────────────────────────────────┐
  1773. 28.74 s > │ The Symbolica license has expired │
  1774. 28.74 s > └───────────────────────────────────┘
  1775. 28.74 s >
  1776. 28.74 s >
  1777. 28.74 s > Location:
  1778. 28.74 s > tests/tests/test_python_api.rs:157:20
  1779. 28.74 s >
  1780. 28.74 s > 5. gammaloop-integration-tests::test_python_api::python_evaluate_sample_preserves_graph_grouping_and_incoming_pdgs
  1781. 28.74 s > failure: test failure with exit code 101
  1782. 28.74 s > Error: Python API test subprocess failed.
  1783. 28.74 s > stdout:
  1784. 28.74 s > ┌────────────────────────────────────────────────────────┐
  1785. 28.74 s > │ You are running a restricted Symbolica instance. │
  1786. 28.74 s > │ │
  1787. 28.74 s > │ This mode is only permitted for non-commercial use and │
  1788. 28.74 s > │ is limited to one instance and core per machine. │
  1789. 28.74 s > │ │
  1790. 28.74 s > │ Hobbyists can easily acquire a free license key │
  1791. 28.74 s > │ that unlocks all cores and removes this banner: │
  1792. 28.74 s > │ │
  1793. 28.74 s > │ from symbolica import * │
  1794. 28.74 s > │ request_hobbyist_license('YOUR_NAME', 'YOUR_EMAIL') │
  1795. 28.74 s > │ │
  1796. 28.74 s > │ All other users can obtain a free 30-day trial key: │
  1797. 28.74 s > │ │
  1798. 28.74 s > │ from symbolica import * │
  1799. 28.74 s > │ request_trial_license('NAME', 'EMAIL', 'EMPLOYER') │
  1800. 28.74 s > │ │
  1801. 28.74 s > │ See https://symbolica.io/docs/get_started.html#license │
  1802. 28.74 s > └────────────────────────────────────────────────────────┘
  1803. 28.74 s > ┌───────────────────────────────────────────────────────────────────────────────────────────────────────────┐
  1804. 28.74 s > │ Cannot start new unlicensed Symbolica instance since there is already another one running on the machine. │
  1805. 28.74 s > └───────────────────────────────────────────────────────────────────────────────────────────────────────────┘
  1806. 28.74 s >
  1807. 28.74 s > stderr:
  1808. 28.74 s > ┌───────────────────────────────────┐
  1809. 28.74 s > │ The Symbolica license has expired │
  1810. 28.74 s > └───────────────────────────────────┘
  1811. 28.74 s > [2026-09-01 22:09:21.894] @gammaloop_api::se... INFO : Running command import model sm-default
  1812. 28.74 s > [2026-09-01 22:09:21.894] @import::model INFO : Loading built-in JSON model sm-default
  1813. 28.74 s > [2026-09-01 22:09:21.907] @gammaloop_api::se... INFO : Running command set default-runtime kv kinematics.externals='{"type":"constant","data":{"momenta":[[32.0,0.0,0.0,32.0],[32.0,0.0,0.0,-32.0]],"helicities":[1,1]}}'
  1814. 28.74 s > [2026-09-01 22:09:21.907] @gammaloop_api::se... INFO : Running command set default-runtime kv subtraction.disable_threshold_subtraction=true
  1815. 28.74 s > [2026-09-01 22:09:21.908] @gammaloop_api::se... INFO : Running command generate xs e+ e- > d d~ g | e- a d g QED^2==4 [{{2}} QCD=0] --numerator-grouping group_identical_graphs_up_to_sign --clear-existing-processes --only-diagrams
  1816. 28.74 s > [2026-09-01 22:09:22.049] @commands::generate INFO : Generated cross-section 2 graphs.
  1817. 28.74 s > [2026-09-01 22:09:22.050] @commands::generate INFO : Only diagram generation was requested, skipping integrand generation. You can generate integrands later using the 'generate existing <options>' command.
  1818. 28.74 s > [2026-09-01 22:09:22.050] @gammaloop_api::se... INFO : Running command generate
  1819. 28.74 s >
  1820. 28.74 s >
  1821. 28.74 s > Location:
  1822. 28.74 s > tests/tests/test_python_api.rs:157:20
  1823. 28.74 s > system-out
  1824. 28.74 s > running 1 test
  1825. 28.74 s > test python_evaluate_sample_preserves_graph_grouping_and_incoming_pdgs ... FAILED
  1826. 28.74 s >
  1827. 28.74 s > failures:
  1828. 28.74 s >
  1829. 28.74 s > failures:
  1830. 28.74 s > python_evaluate_sample_preserves_graph_grouping_and_incoming_pdgs
  1831. 28.74 s >
  1832. 28.74 s > test result: FAILED. 0 passed; 1 failed; 0 ignored; 0 measured; 4 filtered out; finished in 0.29s
  1833. 28.74 s > system-err
  1834. 28.74 s > Error: Python API test subprocess failed.
  1835. 28.74 s > stdout:
  1836. 28.74 s > ┌────────────────────────────────────────────────────────┐
  1837. 28.74 s > │ You are running a restricted Symbolica instance. │
  1838. 28.74 s > │ │
  1839. 28.74 s > │ This mode is only permitted for non-commercial use and │
  1840. 28.74 s > │ is limited to one instance and core per machine. │
  1841. 28.74 s > │ │
  1842. 28.74 s > │ Hobbyists can easily acquire a free license key │
  1843. 28.74 s > │ that unlocks all cores and removes this banner: │
  1844. 28.74 s > │ │
  1845. 28.74 s > │ from symbolica import * │
  1846. 28.74 s > │ request_hobbyist_license('YOUR_NAME', 'YOUR_EMAIL') │
  1847. 28.74 s > │ │
  1848. 28.74 s > │ All other users can obtain a free 30-day trial key: │
  1849. 28.74 s > │ │
  1850. 28.74 s > │ from symbolica import * │
  1851. 28.74 s > │ request_trial_license('NAME', 'EMAIL', 'EMPLOYER') │
  1852. 28.74 s > │ │
  1853. 28.74 s > │ See https://symbolica.io/docs/get_started.html#license │
  1854. 28.74 s > └────────────────────────────────────────────────────────┘
  1855. 28.74 s > ┌───────────────────────────────────────────────────────────────────────────────────────────────────────────┐
  1856. 28.74 s > │ Cannot start new unlicensed Symbolica instance since there is already another one running on the machine. │
  1857. 28.74 s > └───────────────────────────────────────────────────────────────────────────────────────────────────────────┘
  1858. 28.74 s >
  1859. 28.74 s > stderr:
  1860. 28.74 s > ┌───────────────────────────────────┐
  1861. 28.74 s > │ The Symbolica license has expired │
  1862. 28.74 s > └───────────────────────────────────┘
  1863. 28.74 s > [2026-09-01 22:09:21.894] @gammaloop_api::se... INFO : Running command import model sm-default
  1864. 28.74 s > [2026-09-01 22:09:21.894] @import::model INFO : Loading built-in JSON model sm-default
  1865. 28.74 s > [2026-09-01 22:09:21.907] @gammaloop_api::se... INFO : Running command set default-runtime kv kinematics.externals='{"type":"constant","data":{"momenta":[[32.0,0.0,0.0,32.0],[32.0,0.0,0.0,-32.0]],"helicities":[1,1]}}'
  1866. 28.74 s > [2026-09-01 22:09:21.907] @gammaloop_api::se... INFO : Running command set default-runtime kv subtraction.disable_threshold_subtraction=true
  1867. 28.74 s > [2026-09-01 22:09:21.908] @gammaloop_api::se... INFO : Running command generate xs e+ e- > d d~ g | e- a d g QED^2==4 [{{2}} QCD=0] --numerator-grouping group_identical_graphs_up_to_sign --clear-existing-processes --only-diagrams
  1868. 28.74 s > [2026-09-01 22:09:22.049] @commands::generate INFO : Generated cross-section 2 graphs.
  1869. 28.74 s > [2026-09-01 22:09:22.050] @commands::generate INFO : Only diagram generation was requested, skipping integrand generation. You can generate integrands later using the 'generate existing <options>' command.
  1870. 28.74 s > [2026-09-01 22:09:22.050] @gammaloop_api::se... INFO : Running command generate
  1871. 28.74 s >
  1872. 28.74 s >
  1873. 28.74 s > Location:
  1874. 28.74 s > tests/tests/test_python_api.rs:157:20
  1875. 28.74 s > =========================================
  1876. 28.74 s For full logs, run:
  1877. 28.74 s nix log /nix/store/271q8fjm505dyqck3n8ihm4f8zacvzmd-gammaloop-nextest-python-api.drv
  1878. 28.76 s [0 built (1 failed), 0.0Run failed.