1. 0.82 s $ /nix/store/9ypz3flqsrl5xl495mm8h645gadjsxi1-coreutils-9.11/bin/timeout --kill-after=15s 7200s /nix/store/23zk8sgzamrbmj1fday15szf7f2279s8-nix-2.34.7/bin/nix --extra-experimental-features nix-command --extra-experimental-features flakes flake clone git+https://github.com/alphal00p/gammaloop --dest /tmp/nix-ci-worker/stable-pwd/repo/
  2. 1.61 s Cloning into '/tmp/nix-ci-worker/stable-pwd/repo'...
  3. 1.63 s remote: Enumerating objects: 66372, done.
  4. 1.73 s remote: Counting objects: 0% (1/9023) remote: Counting objects: 1% (91/9023) remote: Counting objects: 2% (181/9023) remote: Counting objects: 3% (271/9023) remote: Counting objects: 4% (361/9023) remote: Counting objects: 5% (452/9023) remote: Counting objects: 6% (542/9023) remote: Counting objects: 7% (632/9023) remote: Counting objects: 8% (722/9023) remote: Counting objects: 9% (813/9023) remote: Counting objects: 10% (903/9023) remote: Counting objects: 11% (993/9023) remote: Counting objects: 12% (1083/9023) remote: Counting objects: 13% (1173/9023) remote: Counting objects: 14% (1264/9023) remote: Counting objects: 15% (1354/9023) remote: Counting objects: 16% (1444/9023) remote: Counting objects: 17% (1534/9023) remote: Counting objects: 18% (1625/9023) remote: Counting objects: 19% (1715/9023) remote: Counting objects: 20% (1805/9023) remote: Counting objects: 21% (1895/9023) remote: Counting objects: 22% (1986/9023) remote: Counting objects: 23% (2076/9023) remote: Counting objects: 24% (2166/9023) remote: Counting objects: 25% (2256/9023) remote: Counting objects: 26% (2346/9023) remote: Counting objects: 27% (2437/9023) remote: Counting objects: 28% (2527/9023) remote: Counting objects: 29% (2617/9023) remote: Counting objects: 30% (2707/9023) remote: Counting objects: 31% (2798/9023) remote: Counting objects: 32% (2888/9023) remote: Counting objects: 33% (2978/9023) remote: Counting objects: 34% (3068/9023) remote: Counting objects: 35% (3159/9023) remote: Counting objects: 36% (3249/9023) remote: Counting objects: 37% (3339/9023) remote: Counting objects: 38% (3429/9023) remote: Counting objects: 39% (3519/9023) remote: Counting objects: 40% (3610/9023) remote: Counting objects: 41% (3700/9023) remote: Counting objects: 42% (3790/9023) remote: Counting objects: 43% (3880/9023) remote: Counting objects: 44% (3971/9023) remote: Counting objects: 45% (4061/9023) remote: Counting objects: 46% (4151/9023) remote: Counting objects: 47% (4241/9023) remote: Counting objects: 48% (4332/9023) remote: Counting objects: 49% (4422/9023) remote: Counting objects: 50% (4512/9023) remote: Counting objects: 51% (4602/9023) remote: Counting objects: 52% (4692/9023) remote: Counting objects: 53% (4783/9023) remote: Counting objects: 54% (4873/9023) remote: Counting objects: 55% (4963/9023) remote: Counting objects: 56% (5053/9023) remote: Counting objects: 57% (5144/9023) remote: Counting objects: 58% (5234/9023) remote: Counting objects: 59% (5324/9023) remote: Counting objects: 60% (5414/9023) remote: Counting objects: 61% (5505/9023) remote: Counting objects: 62% (5595/9023) remote: Counting objects: 63% (5685/9023) remote: Counting objects: 64% (5775/9023) remote: Counting objects: 65% (5865/9023) remote: Counting objects: 66% (5956/9023) remote: Counting objects: 67% (6046/9023) remote: Counting objects: 68% (6136/9023) remote: Counting objects: 69% (6226/9023) remote: Counting objects: 70% (6317/9023) remote: Counting objects: 71% (6407/9023) remote: Counting objects: 72% (6497/9023) remote: Counting objects: 73% (6587/9023) remote: Counting objects: 74% (6678/9023) remote: Counting objects: 75% (6768/9023) remote: Counting objects: 76% (6858/9023) remote: Counting objects: 77% (6948/9023) remote: Counting objects: 78% (7038/9023) remote: Counting objects: 79% (7129/9023) remote: Counting objects: 80% (7219/9023) remote: Counting objects: 81% (7309/9023) remote: Counting objects: 82% (7399/9023) remote: Counting objects: 83% (7490/9023) remote: Counting objects: 84% (7580/9023) remote: Counting objects: 85% (7670/9023) remote: Counting objects: 86% (7760/9023) remote: Counting objects: 87% (7851/9023) remote: Counting objects: 88% (7941/9023) remote: Counting objects: 89% (8031/9023) remote: Counting objects: 90% (8121/9023) remote: Counting objects: 91% (8211/9023) remote: Counting objects: 92% (8302/9023) remote: Counting objects: 93% (8392/9023) remote: Counting objects: 94% (8482/9023) remote: Counting objects: 95% (8572/9023) remote: Counting objects: 96% (8663/9023) remote: Counting objects: 97% (8753/9023) remote: Counting objects: 98% (8843/9023) remote: Counting objects: 99% (8933/9023) remote: Counting objects: 100% (9023/9023) remote: Counting objects: 100% (9023/9023), done.
  5. 4.27 s remote: Compressing objects: 0% (1/2128) remote: Compressing objects: 1% (22/2128) remote: Compressing objects: 2% (43/2128) remote: Compressing objects: 3% (64/2128) remote: Compressing objects: 4% (86/2128) remote: Compressing objects: 5% (107/2128) remote: Compressing objects: 6% (128/2128) remote: Compressing objects: 7% (149/2128) remote: Compressing objects: 8% (171/2128) remote: Compressing objects: 9% (192/2128) remote: Compressing objects: 10% (213/2128) remote: Compressing objects: 11% (235/2128) remote: Compressing objects: 12% (256/2128) remote: Compressing objects: 13% (277/2128) remote: Compressing objects: 14% (298/2128) remote: Compressing objects: 15% (320/2128) remote: Compressing objects: 16% (341/2128) remote: Compressing objects: 17% (362/2128) remote: Compressing objects: 18% (384/2128) remote: Compressing objects: 19% (405/2128) remote: Compressing objects: 20% (426/2128) remote: Compressing objects: 20% (443/2128) remote: Compressing objects: 21% (447/2128) remote: Compressing objects: 22% (469/2128) remote: Compressing objects: 23% (490/2128) remote: Compressing objects: 24% (511/2128) remote: Compressing objects: 25% (532/2128) remote: Compressing objects: 26% (554/2128) remote: Compressing objects: 27% (575/2128) remote: Compressing objects: 27% (578/2128) remote: Compressing objects: 28% (596/2128) remote: Compressing objects: 29% (618/2128) remote: Compressing objects: 30% (639/2128) remote: Compressing objects: 31% (660/2128) remote: Compressing objects: 32% (681/2128) remote: Compressing objects: 33% (703/2128) remote: Compressing objects: 34% (724/2128) remote: Compressing objects: 35% (745/2128) remote: Compressing objects: 36% (767/2128) remote: Compressing objects: 37% (788/2128) remote: Compressing objects: 38% (809/2128) remote: Compressing objects: 39% (830/2128) remote: Compressing objects: 40% (852/2128) remote: Compressing objects: 41% (873/2128) remote: Compressing objects: 42% (894/2128) remote: Compressing objects: 43% (916/2128) remote: Compressing objects: 44% (937/2128) remote: Compressing objects: 45% (958/2128) remote: Compressing objects: 46% (979/2128) remote: Compressing objects: 47% (1001/2128) remote: Compressing objects: 48% (1022/2128) remote: Compressing objects: 49% (1043/2128) remote: Compressing objects: 50% (1064/2128) remote: Compressing objects: 51% (1086/2128) remote: Compressing objects: 52% (1107/2128) remote: Compressing objects: 53% (1128/2128) remote: Compressing objects: 54% (1150/2128) remote: Compressing objects: 55% (1171/2128) remote: Compressing objects: 56% (1192/2128) remote: Compressing objects: 57% (1213/2128) remote: Compressing objects: 58% (1235/2128) remote: Compressing objects: 59% (1256/2128) remote: Compressing objects: 60% (1277/2128) remote: Compressing objects: 61% (1299/2128) remote: Compressing objects: 62% (1320/2128) remote: Compressing objects: 63% (1341/2128) remote: Compressing objects: 64% (1362/2128) remote: Compressing objects: 65% (1384/2128) remote: Compressing objects: 66% (1405/2128) remote: Compressing objects: 67% (1426/2128) remote: Compressing objects: 68% (1448/2128) remote: Compressing objects: 69% (1469/2128) remote: Compressing objects: 70% (1490/2128) remote: Compressing objects: 71% (1511/2128) remote: Compressing objects: 72% (1533/2128) remote: Compressing objects: 73% (1554/2128) remote: Compressing objects: 74% (1575/2128) remote: Compressing objects: 75% (1596/2128) remote: Compressing objects: 76% (1618/2128) remote: Compressing objects: 77% (1639/2128) remote: Compressing objects: 78% (1660/2128) remote: Compressing objects: 79% (1682/2128) remote: Compressing objects: 80% (1703/2128) remote: Compressing objects: 81% (1724/2128) remote: Compressing objects: 82% (1745/2128) remote: Compressing objects: 83% (1767/2128) remote: Compressing objects: 84% (1788/2128) remote: Compressing objects: 85% (1809/2128) remote: Compressing objects: 86% (1831/2128) remote: Compressing objects: 87% (1852/2128) remote: Compressing objects: 88% (1873/2128) remote: Compressing objects: 89% (1894/2128) remote: Compressing objects: 90% (1916/2128) remote: Compressing objects: 91% (1937/2128) remote: Compressing objects: 92% (1958/2128) remote: Compressing objects: 93% (1980/2128) remote: Compressing objects: 94% (2001/2128) remote: Compressing objects: 95% (2022/2128) remote: Compressing objects: 96% (2043/2128) remote: Compressing objects: 97% (2065/2128) remote: Compressing objects: 98% (2086/2128) remote: Compressing objects: 99% (2107/2128) remote: Compressing objects: 100% (2128/2128) remote: Compressing objects: 100% (2128/2128), done.
  6. 7.13 s Receiving objects: 0% (1/66372) Receiving objects: 1% (664/66372) Receiving objects: 2% (1328/66372) Receiving objects: 3% (1992/66372) Receiving objects: 4% (2655/66372) Receiving objects: 5% (3319/66372) Receiving objects: 6% (3983/66372) Receiving objects: 7% (4647/66372) Receiving objects: 8% (5310/66372) Receiving objects: 9% (5974/66372) Receiving objects: 10% (6638/66372) Receiving objects: 11% (7301/66372) Receiving objects: 12% (7965/66372), 17.11 MiB | 34.19 MiB/s Receiving objects: 13% (8629/66372), 17.11 MiB | 34.19 MiB/s Receiving objects: 14% (9293/66372), 17.11 MiB | 34.19 MiB/s Receiving objects: 15% (9956/66372), 17.11 MiB | 34.19 MiB/s Receiving objects: 16% (10620/66372), 17.11 MiB | 34.19 MiB/s Receiving objects: 17% (11284/66372), 17.11 MiB | 34.19 MiB/s Receiving objects: 18% (11947/66372), 17.11 MiB | 34.19 MiB/s Receiving objects: 19% (12611/66372), 17.11 MiB | 34.19 MiB/s Receiving objects: 20% (13275/66372), 17.11 MiB | 34.19 MiB/s Receiving objects: 21% (13939/66372), 17.11 MiB | 34.19 MiB/s Receiving objects: 22% (14602/66372), 17.11 MiB | 34.19 MiB/s Receiving objects: 23% (15266/66372), 17.11 MiB | 34.19 MiB/s Receiving objects: 24% (15930/66372), 17.11 MiB | 34.19 MiB/s Receiving objects: 25% (16593/66372), 17.11 MiB | 34.19 MiB/s Receiving objects: 26% (17257/66372), 17.11 MiB | 34.19 MiB/s Receiving objects: 27% (17921/66372), 17.11 MiB | 34.19 MiB/s Receiving objects: 28% (18585/66372), 17.11 MiB | 34.19 MiB/s Receiving objects: 29% (19248/66372), 17.11 MiB | 34.19 MiB/s Receiving objects: 30% (19912/66372), 17.11 MiB | 34.19 MiB/s Receiving objects: 31% (20576/66372), 17.11 MiB | 34.19 MiB/s Receiving objects: 32% (21240/66372), 17.11 MiB | 34.19 MiB/s Receiving objects: 33% (21903/66372), 17.11 MiB | 34.19 MiB/s Receiving objects: 34% (22567/66372), 17.11 MiB | 34.19 MiB/s Receiving objects: 35% (23231/66372), 17.11 MiB | 34.19 MiB/s Receiving objects: 36% (23894/66372), 17.11 MiB | 34.19 MiB/s Receiving objects: 37% (24558/66372), 17.11 MiB | 34.19 MiB/s Receiving objects: 38% (25222/66372), 17.11 MiB | 34.19 MiB/s Receiving objects: 39% (25886/66372), 17.11 MiB | 34.19 MiB/s Receiving objects: 40% (26549/66372), 17.11 MiB | 34.19 MiB/s Receiving objects: 41% (27213/66372), 17.11 MiB | 34.19 MiB/s Receiving objects: 42% (27877/66372), 17.11 MiB | 34.19 MiB/s Receiving objects: 43% (28540/66372), 17.11 MiB | 34.19 MiB/s Receiving objects: 44% (29204/66372), 17.11 MiB | 34.19 MiB/s Receiving objects: 45% (29868/66372), 17.11 MiB | 34.19 MiB/s Receiving objects: 46% (30532/66372), 17.11 MiB | 34.19 MiB/s Receiving objects: 47% (31195/66372), 17.11 MiB | 34.19 MiB/s Receiving objects: 48% (31859/66372), 17.11 MiB | 34.19 MiB/s Receiving objects: 49% (32523/66372), 17.11 MiB | 34.19 MiB/s Receiving objects: 50% (33186/66372), 17.11 MiB | 34.19 MiB/s Receiving objects: 51% (33850/66372), 17.11 MiB | 34.19 MiB/s Receiving objects: 52% (34514/66372), 17.11 MiB | 34.19 MiB/s Receiving objects: 52% (34812/66372), 17.11 MiB | 34.19 MiB/s Receiving objects: 53% (35178/66372), 33.90 MiB | 33.89 MiB/s Receiving objects: 54% (35841/66372), 33.90 MiB | 33.89 MiB/s Receiving objects: 55% (36505/66372), 33.90 MiB | 33.89 MiB/s Receiving objects: 56% (37169/66372), 33.90 MiB | 33.89 MiB/s Receiving objects: 57% (37833/66372), 33.90 MiB | 33.89 MiB/s Receiving objects: 58% (38496/66372), 33.90 MiB | 33.89 MiB/s Receiving objects: 59% (39160/66372), 33.90 MiB | 33.89 MiB/s Receiving objects: 60% (39824/66372), 33.90 MiB | 33.89 MiB/s Receiving objects: 61% (40487/66372), 33.90 MiB | 33.89 MiB/s Receiving objects: 62% (41151/66372), 33.90 MiB | 33.89 MiB/s Receiving objects: 63% (41815/66372), 33.90 MiB | 33.89 MiB/s Receiving objects: 64% (42479/66372), 50.42 MiB | 33.50 MiB/s Receiving objects: 65% (43142/66372), 50.42 MiB | 33.50 MiB/s Receiving objects: 66% (43806/66372), 50.42 MiB | 33.50 MiB/s Receiving objects: 67% (44470/66372), 50.42 MiB | 33.50 MiB/s Receiving objects: 68% (45133/66372), 50.42 MiB | 33.50 MiB/s Receiving objects: 69% (45797/66372), 50.42 MiB | 33.50 MiB/s Receiving objects: 70% (46461/66372), 50.42 MiB | 33.50 MiB/s Receiving objects: 71% (47125/66372), 50.42 MiB | 33.50 MiB/s Receiving objects: 72% (47788/66372), 50.42 MiB | 33.50 MiB/s Receiving objects: 73% (48452/66372), 50.42 MiB | 33.50 MiB/s Receiving objects: 74% (49116/66372), 50.42 MiB | 33.50 MiB/s Receiving objects: 75% (49779/66372), 50.42 MiB | 33.50 MiB/s Receiving objects: 75% (49944/66372), 68.86 MiB | 34.04 MiB/s Receiving objects: 76% (50443/66372), 68.86 MiB | 34.04 MiB/s Receiving objects: 77% (51107/66372), 68.86 MiB | 34.04 MiB/s Receiving objects: 78% (51771/66372), 68.86 MiB | 34.04 MiB/s Receiving objects: 79% (52434/66372), 68.86 MiB | 34.04 MiB/s Receiving objects: 80% (53098/66372), 68.86 MiB | 34.04 MiB/s Receiving objects: 81% (53762/66372), 68.86 MiB | 34.04 MiB/s Receiving objects: 82% (54426/66372), 68.86 MiB | 34.04 MiB/s Receiving objects: 83% (55089/66372), 68.86 MiB | 34.04 MiB/s Receiving objects: 84% (55753/66372), 68.86 MiB | 34.04 MiB/s Receiving objects: 85% (56417/66372), 68.86 MiB | 34.04 MiB/s Receiving objects: 86% (57080/66372), 68.86 MiB | 34.04 MiB/s Receiving objects: 87% (57744/66372), 68.86 MiB | 34.04 MiB/s Receiving objects: 88% (58408/66372), 68.86 MiB | 34.04 MiB/s Receiving objects: 89% (59072/66372), 68.86 MiB | 34.04 MiB/s Receiving objects: 90% (59735/66372), 68.86 MiB | 34.04 MiB/s Receiving objects: 91% (60399/66372), 68.86 MiB | 34.04 MiB/s Receiving objects: 92% (61063/66372), 68.86 MiB | 34.04 MiB/s Receiving objects: 93% (61726/66372), 68.86 MiB | 34.04 MiB/s Receiving objects: 94% (62390/66372), 68.86 MiB | 34.04 MiB/s Receiving objects: 95% (63054/66372), 68.86 MiB | 34.04 MiB/s Receiving objects: 96% (63718/66372), 68.86 MiB | 34.04 MiB/s Receiving objects: 97% (64381/66372), 68.86 MiB | 34.04 MiB/s Receiving objects: 98% (65045/66372), 68.86 MiB | 34.04 MiB/s Receiving objects: 99% (65709/66372), 86.95 MiB | 34.48 MiB/s remote: Total 66372 (delta 7293), reused 7260 (delta 6608), pack-reused 57349 (from 1)
  7. 7.15 s Receiving objects: 100% (66372/66372), 86.95 MiB | 34.48 MiB/s Receiving objects: 100% (66372/66372), 98.65 MiB | 34.59 MiB/s, done.
  8. 7.80 s Resolving deltas: 0% (0/46411) Resolving deltas: 1% (466/46411) Resolving deltas: 2% (930/46411) Resolving deltas: 3% (1393/46411) Resolving deltas: 4% (1857/46411) Resolving deltas: 5% (2323/46411) Resolving deltas: 6% (2785/46411) Resolving deltas: 7% (3249/46411) Resolving deltas: 8% (3713/46411) Resolving deltas: 9% (4177/46411) Resolving deltas: 10% (4642/46411) Resolving deltas: 11% (5106/46411) Resolving deltas: 12% (5570/46411) Resolving deltas: 13% (6034/46411) Resolving deltas: 14% (6499/46411) Resolving deltas: 15% (6962/46411) Resolving deltas: 16% (7426/46411) Resolving deltas: 17% (7890/46411) Resolving deltas: 18% (8354/46411) Resolving deltas: 19% (8819/46411) Resolving deltas: 20% (9283/46411) Resolving deltas: 21% (9747/46411) Resolving deltas: 22% (10213/46411) Resolving deltas: 23% (10675/46411) Resolving deltas: 24% (11139/46411) Resolving deltas: 25% (11605/46411) Resolving deltas: 26% (12067/46411) Resolving deltas: 27% (12531/46411) Resolving deltas: 28% (12996/46411) Resolving deltas: 29% (13460/46411) Resolving deltas: 30% (13924/46411) Resolving deltas: 31% (14388/46411) Resolving deltas: 32% (14852/46411) Resolving deltas: 33% (15316/46411) Resolving deltas: 34% (15780/46411) Resolving deltas: 35% (16244/46411) Resolving deltas: 36% (16709/46411) Resolving deltas: 37% (17174/46411) Resolving deltas: 38% (17637/46411) Resolving deltas: 39% (18101/46411) Resolving deltas: 40% (18565/46411) Resolving deltas: 41% (19029/46411) Resolving deltas: 42% (19493/46411) Resolving deltas: 43% (19957/46411) Resolving deltas: 44% (20421/46411) Resolving deltas: 45% (20885/46411) Resolving deltas: 46% (21350/46411) Resolving deltas: 47% (21816/46411) Resolving deltas: 48% (22279/46411) Resolving deltas: 49% (22742/46411) Resolving deltas: 50% (23206/46411) Resolving deltas: 51% (23670/46411) Resolving deltas: 52% (24134/46411) Resolving deltas: 53% (24598/46411) Resolving deltas: 54% (25062/46411) Resolving deltas: 55% (25527/46411) Resolving deltas: 56% (25991/46411) Resolving deltas: 57% (26458/46411) Resolving deltas: 58% (26919/46411) Resolving deltas: 59% (27383/46411) Resolving deltas: 60% (27847/46411) Resolving deltas: 61% (28312/46411) Resolving deltas: 62% (28776/46411) Resolving deltas: 63% (29239/46411) Resolving deltas: 64% (29704/46411) Resolving deltas: 65% (30168/46411) Resolving deltas: 66% (30632/46411) Resolving deltas: 67% (31096/46411) Resolving deltas: 68% (31560/46411) Resolving deltas: 69% (32024/46411) Resolving deltas: 70% (32488/46411) Resolving deltas: 71% (32952/46411) Resolving deltas: 72% (33416/46411) Resolving deltas: 73% (33881/46411) Resolving deltas: 74% (34346/46411) Resolving deltas: 75% (34809/46411) Resolving deltas: 76% (35274/46411) Resolving deltas: 77% (35737/46411) Resolving deltas: 78% (36201/46411) Resolving deltas: 79% (36665/46411) Resolving deltas: 80% (37129/46411) Resolving deltas: 81% (37593/46411) Resolving deltas: 82% (38058/46411) Resolving deltas: 83% (38524/46411) Resolving deltas: 84% (38986/46411) Resolving deltas: 85% (39451/46411) Resolving deltas: 86% (39914/46411) Resolving deltas: 87% (40378/46411) Resolving deltas: 88% (40842/46411) Resolving deltas: 89% (41307/46411) Resolving deltas: 90% (41770/46411) Resolving deltas: 91% (42235/46411) Resolving deltas: 92% (42699/46411) Resolving deltas: 93% (43163/46411) Resolving deltas: 94% (43627/46411) Resolving deltas: 95% (44092/46411) Resolving deltas: 96% (44555/46411) Resolving deltas: 97% (45019/46411) Resolving deltas: 98% (45484/46411) Resolving deltas: 99% (45950/46411) Resolving deltas: 100% (46411/46411) Resolving deltas: 100% (46411/46411), done.
  9. 8.10 s Fetching commit 63073375d37e632f4b7021a2cf030b3a85d47360 for feynkit ...
  10. 8.10 s $ /nix/store/bcnisk3ydfgv26v2gw3zlky24g00yww2-git-2.54.0/bin/git fetch origin 63073375d37e632f4b7021a2cf030b3a85d47360
  11. 8.50 s From https://github.com/alphal00p/gammaloop
  12. 8.50 s * branch 63073375d37e632f4b7021a2cf030b3a85d47360 -> FETCH_HEAD
  13. 8.51 s $ /nix/store/9ypz3flqsrl5xl495mm8h645gadjsxi1-coreutils-9.11/bin/timeout --kill-after=15s 7200s /nix/store/bcnisk3ydfgv26v2gw3zlky24g00yww2-git-2.54.0/bin/git -c advice.detachedHead=false checkout 63073375d37e632f4b7021a2cf030b3a85d47360
  14. 8.69 s HEAD is now at 63073375d make feynkit tensor reduction default
  15. 8.70 s $ /nix/store/9ypz3flqsrl5xl495mm8h645gadjsxi1-coreutils-9.11/bin/timeout --kill-after=15s 7200s /nix/store/23zk8sgzamrbmj1fday15szf7f2279s8-nix-2.34.7/bin/nix --extra-experimental-features nix-command --extra-experimental-features flakes --log-format internal-json run .#packages.x86_64-linux.nix-ci-check-gammaloop-nextest-python-api --print-build-logs
  16. 18.27 s
  17. 18.60 s Downloading cached gammaloop-nextest-binaries-python-api-gammaloop-integration-tests from https://cache.nix-ci.com
  18. 19.20 s Downloaded cached gammaloop-nextest-binaries-python-api-gammaloop-integration-tests (8.5 MiB) in 607ms
  19. 19.20 s Progress: 0 of 1 built, 1 of 3 downloaded from cache
  20. 19.20 s Downloading cached gammaloop-nextest-binaries-python-api from https://cache.nix-ci.com
  21. 19.21 s Downloaded cached gammaloop-nextest-binaries-python-api (520 B) in 2ms
  22. 19.21 s Progress: 0 of 1 built, 2 of 3 downloaded from cache
  23. 19.21 s Downloading cached nix-ci-check-gammaloop-nextest-python-api from https://cache.nix-ci.com
  24. 19.21 s Downloaded cached nix-ci-check-gammaloop-nextest-python-api (1104 B) in 2ms
  25. 19.21 s Progress: 0 of 1 built, 3 of 3 downloaded from cache
  26. 29.54 s evaluating derivation 'g copying '/nix/store/hphc evaluating derivation 'g copying '/nix/store/hphc evaluating derivation 'g copying '/nix/store/hphc evaluating derivation 'g copying '/nix/store/hphc evaluating derivation 'g copying '/nix/store/hphc evaluating derivation 'g copying '/nix/store/hphc evaluating derivation 'g copying '/nix/store/hphc evaluating derivation 'g copying '/nix/store/hphc evaluating derivation 'g copying '/nix/store/hphc evaluating derivation 'g copying '/nix/store/hphc evaluating derivation 'g copying '/nix/store/hphc evaluating derivation 'g copying '/nix/store/hphc evaluating derivation 'g querying gammaloop-nexte querying info about miss querying gammaloop-nexte [0/1 built, 0.0 KiB DL] [1/0/1 built, 0.0 KiB DLgammaloop-nextest-python-api> Extracting 1 binary, 1 build script output directory, and 3 linked paths to /build/nextest-archive-q2wEwv
  27. 29.59 s gammaloop-nextest-python-api> Extracted 18 files to /build/nextest-archive-q2wEwv in 0.06s
  28. 29.60 s gammaloop-nextest-python-api> ------------
  29. 29.60 s gammaloop-nextest-python-api> Nextest run ID adce777b-012b-47a5-8a29-5196eeae1db1 with nextest profile: ci_gammaloop
  30. 29.60 s gammaloop-nextest-python-api> Starting 5 tests across 1 binary
  31. 29.71 s gammaloop-nextest-python-api> FAIL [ 0.111s] (1/5) gammaloop-integration-tests::test_python_api python_evaluate_samples_batch_and_momentum_space_have_expected_shape
  32. 29.71 s gammaloop-nextest-python-api> stdout ---
  33. 29.71 s gammaloop-nextest-python-api>
  34. 29.71 s gammaloop-nextest-python-api> running 1 test
  35. 29.71 s gammaloop-nextest-python-api> test python_evaluate_samples_batch_and_momentum_space_have_expected_shape ... FAILED
  36. 29.71 s gammaloop-nextest-python-api>
  37. 29.71 s gammaloop-nextest-python-api> failures:
  38. 29.71 s gammaloop-nextest-python-api>
  39. 29.71 s gammaloop-nextest-python-api> failures:
  40. 29.71 s gammaloop-nextest-python-api> python_evaluate_samples_batch_and_momentum_space_have_expected_shape
  41. 29.71 s gammaloop-nextest-python-api>
  42. 29.71 s gammaloop-nextest-python-api> test result: FAILED. 0 passed; 1 failed; 0 ignored; 0 measured; 4 filtered out; finished in 0.11s
  43. 29.71 s gammaloop-nextest-python-api>
  44. 29.71 s gammaloop-nextest-python-api> stderr ---
  45. 29.71 s gammaloop-nextest-python-api> Error: Python API test subprocess failed.
  46. 29.71 s gammaloop-nextest-python-api> stdout:
  47. 29.71 s gammaloop-nextest-python-api> ┌────────────────────────────────────────────────────────┐
  48. 29.71 s gammaloop-nextest-python-api> │ You are running a restricted Symbolica instance. │
  49. 29.71 s gammaloop-nextest-python-api> │ │
  50. 29.71 s gammaloop-nextest-python-api> │ This mode is only permitted for non-commercial use and │
  51. 29.71 s gammaloop-nextest-python-api> │ is limited to one instance and core per machine. │
  52. 29.71 s gammaloop-nextest-python-api> │ │
  53. 29.71 s gammaloop-nextest-python-api> │ Hobbyists can easily acquire a free license key │
  54. 29.71 s gammaloop-nextest-python-api> │ that unlocks all cores and removes this banner: │
  55. 29.71 s gammaloop-nextest-python-api> │ │
  56. 29.71 s gammaloop-nextest-python-api> │ from symbolica import * │
  57. 29.71 s gammaloop-nextest-python-api> │ request_hobbyist_license('YOUR_NAME', 'YOUR_EMAIL') │
  58. 29.71 s gammaloop-nextest-python-api> │ │
  59. 29.71 s gammaloop-nextest-python-api> │ All other users can obtain a free 30-day trial key: │
  60. 29.71 s gammaloop-nextest-python-api> │ │
  61. 29.71 s gammaloop-nextest-python-api> │ from symbolica import * │
  62. 29.71 s gammaloop-nextest-python-api> │ request_trial_license('NAME', 'EMAIL', 'EMPLOYER') │
  63. 29.71 s gammaloop-nextest-python-api> │ │
  64. 29.71 s gammaloop-nextest-python-api> │ See https://symbolica.io/docs/get_started.html#license │
  65. 29.71 s gammaloop-nextest-python-api> └────────────────────────────────────────────────────────┘
  66. 29.71 s gammaloop-nextest-python-api> ┌───────────────────────────────────────────────────────────────────────────────────────────────────────────┐
  67. 29.71 s gammaloop-nextest-python-api> │ Cannot start new unlicensed Symbolica instance since there is already another one running on the machine. │
  68. 29.71 s gammaloop-nextest-python-api> └───────────────────────────────────────────────────────────────────────────────────────────────────────────┘
  69. 29.71 s gammaloop-nextest-python-api>
  70. 29.71 s gammaloop-nextest-python-api> stderr:
  71. 29.71 s gammaloop-nextest-python-api> ┌───────────────────────────────────┐
  72. 29.71 s gammaloop-nextest-python-api> │ The Symbolica license has expired │
  73. 29.71 s gammaloop-nextest-python-api> └───────────────────────────────────┘
  74. 29.71 s gammaloop-nextest-python-api>
  75. 29.71 s gammaloop-nextest-python-api>
  76. 29.71 s gammaloop-nextest-python-api> Location:
  77. 29.71 s gammaloop-nextest-python-api> tests/tests/test_python_api.rs:157:20
  78. 29.71 s gammaloop-nextest-python-api>
  79. 29.73 s gammaloop-nextest-python-api> FAIL [ 0.121s] (2/5) gammaloop-integration-tests::test_python_api python_session_getters_return_live_toml_and_command_blocks
  80. 29.73 s gammaloop-nextest-python-api> stdout ---
  81. 29.73 s gammaloop-nextest-python-api>
  82. 29.73 s gammaloop-nextest-python-api> running 1 test
  83. 29.73 s gammaloop-nextest-python-api> test python_session_getters_return_live_toml_and_command_blocks ... FAILED
  84. 29.73 s gammaloop-nextest-python-api>
  85. 29.73 s gammaloop-nextest-python-api> failures:
  86. 29.73 s gammaloop-nextest-python-api>
  87. 29.73 s gammaloop-nextest-python-api> failures:
  88. 29.73 s gammaloop-nextest-python-api> python_session_getters_return_live_toml_and_command_blocks
  89. 29.73 s gammaloop-nextest-python-api>
  90. 29.73 s gammaloop-nextest-python-api> test result: FAILED. 0 passed; 1 failed; 0 ignored; 0 measured; 4 filtered out; finished in 0.12s
  91. 29.73 s gammaloop-nextest-python-api>
  92. 29.73 s gammaloop-nextest-python-api> stderr ---
  93. 29.73 s gammaloop-nextest-python-api> Error: Python API test subprocess failed.
  94. 29.73 s gammaloop-nextest-python-api> stdout:
  95. 29.73 s gammaloop-nextest-python-api> ┌────────────────────────────────────────────────────────┐
  96. 29.73 s gammaloop-nextest-python-api> │ You are running a restricted Symbolica instance. │
  97. 29.73 s gammaloop-nextest-python-api> │ │
  98. 29.73 s gammaloop-nextest-python-api> │ This mode is only permitted for non-commercial use and │
  99. 29.73 s gammaloop-nextest-python-api> │ is limited to one instance and core per machine. │
  100. 29.73 s gammaloop-nextest-python-api> │ │
  101. 29.73 s gammaloop-nextest-python-api> │ Hobbyists can easily acquire a free license key │
  102. 29.73 s gammaloop-nextest-python-api> │ that unlocks all cores and removes this banner: │
  103. 29.73 s gammaloop-nextest-python-api> │ │
  104. 29.73 s gammaloop-nextest-python-api> │ from symbolica import * │
  105. 29.73 s gammaloop-nextest-python-api> │ request_hobbyist_license('YOUR_NAME', 'YOUR_EMAIL') │
  106. 29.73 s gammaloop-nextest-python-api> │ │
  107. 29.73 s gammaloop-nextest-python-api> │ All other users can obtain a free 30-day trial key: │
  108. 29.73 s gammaloop-nextest-python-api> │ │
  109. 29.73 s gammaloop-nextest-python-api> │ from symbolica import * │
  110. 29.73 s gammaloop-nextest-python-api> │ request_trial_license('NAME', 'EMAIL', 'EMPLOYER') │
  111. 29.73 s gammaloop-nextest-python-api> │ │
  112. 29.73 s gammaloop-nextest-python-api> │ See https://symbolica.io/docs/get_started.html#license │
  113. 29.73 s gammaloop-nextest-python-api> └────────────────────────────────────────────────────────┘
  114. 29.73 s gammaloop-nextest-python-api> ┌───────────────────────────────────────────────────────────────────────────────────────────────────────────┐
  115. 29.73 s gammaloop-nextest-python-api> │ Cannot start new unlicensed Symbolica instance since there is already another one running on the machine. │
  116. 29.73 s gammaloop-nextest-python-api> └───────────────────────────────────────────────────────────────────────────────────────────────────────────┘
  117. 29.73 s gammaloop-nextest-python-api>
  118. 29.73 s gammaloop-nextest-python-api> stderr:
  119. 29.73 s gammaloop-nextest-python-api> ┌───────────────────────────────────┐
  120. 29.73 s gammaloop-nextest-python-api> │ The Symbolica license has expired │
  121. 29.73 s gammaloop-nextest-python-api> └───────────────────────────────────┘
  122. 29.73 s gammaloop-nextest-python-api>
  123. 29.73 s gammaloop-nextest-python-api>
  124. 29.73 s gammaloop-nextest-python-api> Location:
  125. 29.73 s gammaloop-nextest-python-api> tests/tests/test_python_api.rs:157:20
  126. 29.73 s gammaloop-nextest-python-api>
  127. 29.73 s gammaloop-nextest-python-api> FAIL [ 0.121s] (3/5) gammaloop-integration-tests::test_python_api python_evaluate_sample_honors_generate_events_and_observable_snapshots
  128. 29.73 s gammaloop-nextest-python-api> stdout ---
  129. 29.73 s gammaloop-nextest-python-api>
  130. 29.73 s gammaloop-nextest-python-api> running 1 test
  131. 29.73 s gammaloop-nextest-python-api> test python_evaluate_sample_honors_generate_events_and_observable_snapshots ... FAILED
  132. 29.73 s gammaloop-nextest-python-api>
  133. 29.73 s gammaloop-nextest-python-api> failures:
  134. 29.73 s gammaloop-nextest-python-api>
  135. 29.73 s gammaloop-nextest-python-api> failures:
  136. 29.73 s gammaloop-nextest-python-api> python_evaluate_sample_honors_generate_events_and_observable_snapshots
  137. 29.73 s gammaloop-nextest-python-api>
  138. 29.73 s gammaloop-nextest-python-api> test result: FAILED. 0 passed; 1 failed; 0 ignored; 0 measured; 4 filtered out; finished in 0.12s
  139. 29.73 s gammaloop-nextest-python-api>
  140. 29.73 s gammaloop-nextest-python-api> stderr ---
  141. 29.73 s gammaloop-nextest-python-api> Error: Python API test subprocess failed.
  142. 29.73 s gammaloop-nextest-python-api> stdout:
  143. 29.73 s gammaloop-nextest-python-api> ┌────────────────────────────────────────────────────────┐
  144. 29.73 s gammaloop-nextest-python-api> │ You are running a restricted Symbolica instance. │
  145. 29.73 s gammaloop-nextest-python-api> │ │
  146. 29.73 s gammaloop-nextest-python-api> │ This mode is only permitted for non-commercial use and │
  147. 29.73 s gammaloop-nextest-python-api> │ is limited to one instance and core per machine. │
  148. 29.73 s gammaloop-nextest-python-api> │ │
  149. 29.73 s gammaloop-nextest-python-api> │ Hobbyists can easily acquire a free license key │
  150. 29.73 s gammaloop-nextest-python-api> │ that unlocks all cores and removes this banner: │
  151. 29.73 s gammaloop-nextest-python-api> │ │
  152. 29.73 s gammaloop-nextest-python-api> │ from symbolica import * │
  153. 29.73 s gammaloop-nextest-python-api> │ request_hobbyist_license('YOUR_NAME', 'YOUR_EMAIL') │
  154. 29.73 s gammaloop-nextest-python-api> │ │
  155. 29.73 s gammaloop-nextest-python-api> │ All other users can obtain a free 30-day trial key: │
  156. 29.73 s gammaloop-nextest-python-api> │ │
  157. 29.73 s gammaloop-nextest-python-api> │ from symbolica import * │
  158. 29.73 s gammaloop-nextest-python-api> │ request_trial_license('NAME', 'EMAIL', 'EMPLOYER') │
  159. 29.73 s gammaloop-nextest-python-api> │ │
  160. 29.73 s gammaloop-nextest-python-api> │ See https://symbolica.io/docs/get_started.html#license │
  161. 29.73 s gammaloop-nextest-python-api> └────────────────────────────────────────────────────────┘
  162. 29.73 s gammaloop-nextest-python-api> ┌───────────────────────────────────────────────────────────────────────────────────────────────────────────┐
  163. 29.73 s gammaloop-nextest-python-api> │ Cannot start new unlicensed Symbolica instance since there is already another one running on the machine. │
  164. 29.73 s gammaloop-nextest-python-api> └───────────────────────────────────────────────────────────────────────────────────────────────────────────┘
  165. 29.73 s gammaloop-nextest-python-api>
  166. 29.73 s gammaloop-nextest-python-api> stderr:
  167. 29.73 s gammaloop-nextest-python-api> ┌───────────────────────────────────┐
  168. 29.73 s gammaloop-nextest-python-api> │ The Symbolica license has expired │
  169. 29.73 s gammaloop-nextest-python-api> └───────────────────────────────────┘
  170. 29.73 s gammaloop-nextest-python-api>
  171. 29.73 s gammaloop-nextest-python-api>
  172. 29.73 s gammaloop-nextest-python-api> Location:
  173. 29.73 s gammaloop-nextest-python-api> tests/tests/test_python_api.rs:157:20
  174. 29.73 s gammaloop-nextest-python-api>
  175. 29.81 s gammaloop-nextest-python-api> FAIL [ 0.212s] (4/5) gammaloop-integration-tests::test_python_api python_settings_wrappers_expose_nested_runtime_and_global_settings
  176. 29.81 s gammaloop-nextest-python-api> stdout ---
  177. 29.81 s gammaloop-nextest-python-api>
  178. 29.81 s gammaloop-nextest-python-api> running 1 test
  179. 29.81 s gammaloop-nextest-python-api> test python_settings_wrappers_expose_nested_runtime_and_global_settings ... FAILED
  180. 29.81 s gammaloop-nextest-python-api>
  181. 29.81 s gammaloop-nextest-python-api> failures:
  182. 29.81 s gammaloop-nextest-python-api>
  183. 29.81 s gammaloop-nextest-python-api> failures:
  184. 29.81 s gammaloop-nextest-python-api> python_settings_wrappers_expose_nested_runtime_and_global_settings
  185. 29.81 s gammaloop-nextest-python-api>
  186. 29.81 s gammaloop-nextest-python-api> test result: FAILED. 0 passed; 1 failed; 0 ignored; 0 measured; 4 filtered out; finished in 0.21s
  187. 29.81 s gammaloop-nextest-python-api>
  188. 29.81 s gammaloop-nextest-python-api> stderr ---
  189. 29.81 s gammaloop-nextest-python-api> Error: Python API test subprocess failed.
  190. 29.81 s gammaloop-nextest-python-api> stdout:
  191. 29.81 s gammaloop-nextest-python-api> ┌────────────────────────────────────────────────────────┐
  192. 29.81 s gammaloop-nextest-python-api> │ You are running a restricted Symbolica instance. │
  193. 29.81 s gammaloop-nextest-python-api> │ │
  194. 29.81 s gammaloop-nextest-python-api> │ This mode is only permitted for non-commercial use and │
  195. 29.81 s gammaloop-nextest-python-api> │ is limited to one instance and core per machine. │
  196. 29.81 s gammaloop-nextest-python-api> │ │
  197. 29.81 s gammaloop-nextest-python-api> │ Hobbyists can easily acquire a free license key │
  198. 29.81 s gammaloop-nextest-python-api> │ that unlocks all cores and removes this banner: │
  199. 29.81 s gammaloop-nextest-python-api> │ │
  200. 29.81 s gammaloop-nextest-python-api> │ from symbolica import * │
  201. 29.81 s gammaloop-nextest-python-api> │ request_hobbyist_license('YOUR_NAME', 'YOUR_EMAIL') │
  202. 29.81 s gammaloop-nextest-python-api> │ │
  203. 29.81 s gammaloop-nextest-python-api> │ All other users can obtain a free 30-day trial key: │
  204. 29.81 s gammaloop-nextest-python-api> │ │
  205. 29.81 s gammaloop-nextest-python-api> │ from symbolica import * │
  206. 29.81 s gammaloop-nextest-python-api> │ request_trial_license('NAME', 'EMAIL', 'EMPLOYER') │
  207. 29.81 s gammaloop-nextest-python-api> │ │
  208. 29.81 s gammaloop-nextest-python-api> │ See https://symbolica.io/docs/get_started.html#license │
  209. 29.81 s gammaloop-nextest-python-api> └────────────────────────────────────────────────────────┘
  210. 29.81 s gammaloop-nextest-python-api> ┌───────────────────────────────────────────────────────────────────────────────────────────────────────────┐
  211. 29.81 s gammaloop-nextest-python-api> │ Cannot start new unlicensed Symbolica instance since there is already another one running on the machine. │
  212. 29.81 s gammaloop-nextest-python-api> └───────────────────────────────────────────────────────────────────────────────────────────────────────────┘
  213. 29.81 s gammaloop-nextest-python-api>
  214. 29.81 s gammaloop-nextest-python-api> stderr:
  215. 29.81 s gammaloop-nextest-python-api> ┌───────────────────────────────────┐
  216. 29.81 s gammaloop-nextest-python-api> │ The Symbolica license has expired │
  217. 29.81 s gammaloop-nextest-python-api> └───────────────────────────────────┘
  218. 29.81 s gammaloop-nextest-python-api>
  219. 29.81 s gammaloop-nextest-python-api>
  220. 29.81 s gammaloop-nextest-python-api> Location:
  221. 29.81 s gammaloop-nextest-python-api> tests/tests/test_python_api.rs:157:20
  222. 29.81 s gammaloop-nextest-python-api>
  223. 29.90 s gammaloop-nextest-python-api> FAIL [ 0.295s] (5/5) gammaloop-integration-tests::test_python_api python_evaluate_sample_preserves_graph_grouping_and_incoming_pdgs
  224. 29.90 s gammaloop-nextest-python-api> stdout ---
  225. 29.90 s gammaloop-nextest-python-api>
  226. 29.90 s gammaloop-nextest-python-api> running 1 test
  227. 29.90 s gammaloop-nextest-python-api> test python_evaluate_sample_preserves_graph_grouping_and_incoming_pdgs ... FAILED
  228. 29.90 s gammaloop-nextest-python-api>
  229. 29.90 s gammaloop-nextest-python-api> failures:
  230. 29.90 s gammaloop-nextest-python-api>
  231. 29.90 s gammaloop-nextest-python-api> failures:
  232. 29.90 s gammaloop-nextest-python-api> python_evaluate_sample_preserves_graph_grouping_and_incoming_pdgs
  233. 29.90 s gammaloop-nextest-python-api>
  234. 29.90 s gammaloop-nextest-python-api> test result: FAILED. 0 passed; 1 failed; 0 ignored; 0 measured; 4 filtered out; finished in 0.29s
  235. 29.90 s gammaloop-nextest-python-api>
  236. 29.90 s gammaloop-nextest-python-api> stderr ---
  237. 29.90 s gammaloop-nextest-python-api> Error: Python API test subprocess failed.
  238. 29.90 s gammaloop-nextest-python-api> stdout:
  239. 29.90 s gammaloop-nextest-python-api> ┌────────────────────────────────────────────────────────┐
  240. 29.90 s gammaloop-nextest-python-api> │ You are running a restricted Symbolica instance. │
  241. 29.90 s gammaloop-nextest-python-api> │ │
  242. 29.90 s gammaloop-nextest-python-api> │ This mode is only permitted for non-commercial use and │
  243. 29.90 s gammaloop-nextest-python-api> │ is limited to one instance and core per machine. │
  244. 29.90 s gammaloop-nextest-python-api> │ │
  245. 29.90 s gammaloop-nextest-python-api> │ Hobbyists can easily acquire a free license key │
  246. 29.90 s gammaloop-nextest-python-api> │ that unlocks all cores and removes this banner: │
  247. 29.90 s gammaloop-nextest-python-api> │ │
  248. 29.90 s gammaloop-nextest-python-api> │ from symbolica import * │
  249. 29.90 s gammaloop-nextest-python-api> │ request_hobbyist_license('YOUR_NAME', 'YOUR_EMAIL') │
  250. 29.90 s gammaloop-nextest-python-api> │ │
  251. 29.90 s gammaloop-nextest-python-api> │ All other users can obtain a free 30-day trial key: │
  252. 29.90 s gammaloop-nextest-python-api> │ │
  253. 29.90 s gammaloop-nextest-python-api> │ from symbolica import * │
  254. 29.90 s gammaloop-nextest-python-api> │ request_trial_license('NAME', 'EMAIL', 'EMPLOYER') │
  255. 29.90 s gammaloop-nextest-python-api> │ │
  256. 29.90 s gammaloop-nextest-python-api> │ See https://symbolica.io/docs/get_started.html#license │
  257. 29.90 s gammaloop-nextest-python-api> └────────────────────────────────────────────────────────┘
  258. 29.90 s gammaloop-nextest-python-api> ┌───────────────────────────────────────────────────────────────────────────────────────────────────────────┐
  259. 29.90 s gammaloop-nextest-python-api> │ Cannot start new unlicensed Symbolica instance since there is already another one running on the machine. │
  260. 29.90 s gammaloop-nextest-python-api> └───────────────────────────────────────────────────────────────────────────────────────────────────────────┘
  261. 29.90 s gammaloop-nextest-python-api>
  262. 29.90 s gammaloop-nextest-python-api> stderr:
  263. 29.90 s gammaloop-nextest-python-api> ┌───────────────────────────────────┐
  264. 29.90 s gammaloop-nextest-python-api> │ The Symbolica license has expired │
  265. 29.90 s gammaloop-nextest-python-api> └───────────────────────────────────┘
  266. 29.90 s gammaloop-nextest-python-api> [2026-09-01 22:08:48.097] @gammaloop_api::se... INFO : Running command import model sm-default
  267. 29.90 s gammaloop-nextest-python-api> [2026-09-01 22:08:48.097] @import::model INFO : Loading built-in JSON model sm-default
  268. 29.90 s gammaloop-nextest-python-api> [2026-09-01 22:08:48.108] @gammaloop_api::se... INFO : Running command set default-runtime kv kinematics.externals='{"type":"constant","data":{"momenta":[[32.0,0.0,0.0,32.0],[32.0,0.0,0.0,-32.0]],"helicities":[1,1]}}'
  269. 29.90 s gammaloop-nextest-python-api> [2026-09-01 22:08:48.109] @gammaloop_api::se... INFO : Running command set default-runtime kv subtraction.disable_threshold_subtraction=true
  270. 29.90 s gammaloop-nextest-python-api> [2026-09-01 22:08:48.110] @gammaloop_api::se... INFO : Running command generate xs e+ e- > d d~ g | e- a d g QED^2==4 [{{2}} QCD=0] --numerator-grouping group_identical_graphs_up_to_sign --clear-existing-processes --only-diagrams
  271. 29.90 s gammaloop-nextest-python-api> [2026-09-01 22:08:48.252] @commands::generate INFO : Generated cross-section 2 graphs.
  272. 29.90 s gammaloop-nextest-python-api> [2026-09-01 22:08:48.253] @commands::generate INFO : Only diagram generation was requested, skipping integrand generation. You can generate integrands later using the 'generate existing <options>' command.
  273. 29.90 s gammaloop-nextest-python-api> [2026-09-01 22:08:48.253] @gammaloop_api::se... INFO : Running command generate
  274. 29.90 s gammaloop-nextest-python-api>
  275. 29.90 s gammaloop-nextest-python-api>
  276. 29.90 s gammaloop-nextest-python-api> Location:
  277. 29.90 s gammaloop-nextest-python-api> tests/tests/test_python_api.rs:157:20
  278. 29.90 s gammaloop-nextest-python-api>
  279. 29.90 s gammaloop-nextest-python-api> ------------
  280. 29.90 s gammaloop-nextest-python-api> Summary [ 0.296s] 5 tests run: 0 passed, 5 failed, 0 skipped
  281. 29.90 s gammaloop-nextest-python-api> FAIL [ 0.111s] (1/5) gammaloop-integration-tests::test_python_api python_evaluate_samples_batch_and_momentum_space_have_expected_shape
  282. 29.90 s gammaloop-nextest-python-api> stdout ---
  283. 29.90 s gammaloop-nextest-python-api>
  284. 29.90 s gammaloop-nextest-python-api> running 1 test
  285. 29.90 s gammaloop-nextest-python-api> test python_evaluate_samples_batch_and_momentum_space_have_expected_shape ... FAILED
  286. 29.90 s gammaloop-nextest-python-api>
  287. 29.90 s gammaloop-nextest-python-api> failures:
  288. 29.90 s gammaloop-nextest-python-api>
  289. 29.90 s gammaloop-nextest-python-api> failures:
  290. 29.90 s gammaloop-nextest-python-api> python_evaluate_samples_batch_and_momentum_space_have_expected_shape
  291. 29.90 s gammaloop-nextest-python-api>
  292. 29.90 s gammaloop-nextest-python-api> test result: FAILED. 0 passed; 1 failed; 0 ignored; 0 measured; 4 filtered out; finished in 0.11s
  293. 29.90 s gammaloop-nextest-python-api>
  294. 29.90 s gammaloop-nextest-python-api> stderr ---
  295. 29.90 s gammaloop-nextest-python-api> Error: Python API test subprocess failed.
  296. 29.90 s gammaloop-nextest-python-api> stdout:
  297. 29.90 s gammaloop-nextest-python-api> ┌────────────────────────────────────────────────────────┐
  298. 29.90 s gammaloop-nextest-python-api> │ You are running a restricted Symbolica instance. │
  299. 29.90 s gammaloop-nextest-python-api> │ │
  300. 29.90 s gammaloop-nextest-python-api> │ This mode is only permitted for non-commercial use and │
  301. 29.90 s gammaloop-nextest-python-api> │ is limited to one instance and core per machine. │
  302. 29.90 s gammaloop-nextest-python-api> │ │
  303. 29.90 s gammaloop-nextest-python-api> │ Hobbyists can easily acquire a free license key │
  304. 29.90 s gammaloop-nextest-python-api> │ that unlocks all cores and removes this banner: │
  305. 29.90 s gammaloop-nextest-python-api> │ │
  306. 29.90 s gammaloop-nextest-python-api> │ from symbolica import * │
  307. 29.90 s gammaloop-nextest-python-api> │ request_hobbyist_license('YOUR_NAME', 'YOUR_EMAIL') │
  308. 29.90 s gammaloop-nextest-python-api> │ │
  309. 29.90 s gammaloop-nextest-python-api> │ All other users can obtain a free 30-day trial key: │
  310. 29.90 s gammaloop-nextest-python-api> │ │
  311. 29.90 s gammaloop-nextest-python-api> │ from symbolica import * │
  312. 29.90 s gammaloop-nextest-python-api> │ request_trial_license('NAME', 'EMAIL', 'EMPLOYER') │
  313. 29.90 s gammaloop-nextest-python-api> │ │
  314. 29.90 s gammaloop-nextest-python-api> │ See https://symbolica.io/docs/get_started.html#license │
  315. 29.90 s gammaloop-nextest-python-api> └────────────────────────────────────────────────────────┘
  316. 29.90 s gammaloop-nextest-python-api> ┌───────────────────────────────────────────────────────────────────────────────────────────────────────────┐
  317. 29.90 s gammaloop-nextest-python-api> │ Cannot start new unlicensed Symbolica instance since there is already another one running on the machine. │
  318. 29.90 s gammaloop-nextest-python-api> └───────────────────────────────────────────────────────────────────────────────────────────────────────────┘
  319. 29.90 s gammaloop-nextest-python-api>
  320. 29.90 s gammaloop-nextest-python-api> stderr:
  321. 29.90 s gammaloop-nextest-python-api> ┌───────────────────────────────────┐
  322. 29.90 s gammaloop-nextest-python-api> │ The Symbolica license has expired │
  323. 29.90 s gammaloop-nextest-python-api> └───────────────────────────────────┘
  324. 29.90 s gammaloop-nextest-python-api>
  325. 29.90 s gammaloop-nextest-python-api>
  326. 29.90 s gammaloop-nextest-python-api> Location:
  327. 29.90 s gammaloop-nextest-python-api> tests/tests/test_python_api.rs:157:20
  328. 29.90 s gammaloop-nextest-python-api>
  329. 29.90 s gammaloop-nextest-python-api> FAIL [ 0.121s] (2/5) gammaloop-integration-tests::test_python_api python_session_getters_return_live_toml_and_command_blocks
  330. 29.90 s gammaloop-nextest-python-api> stdout ---
  331. 29.90 s gammaloop-nextest-python-api>
  332. 29.90 s gammaloop-nextest-python-api> running 1 test
  333. 29.90 s gammaloop-nextest-python-api> test python_session_getters_return_live_toml_and_command_blocks ... FAILED
  334. 29.90 s gammaloop-nextest-python-api>
  335. 29.90 s gammaloop-nextest-python-api> failures:
  336. 29.90 s gammaloop-nextest-python-api>
  337. 29.90 s gammaloop-nextest-python-api> failures:
  338. 29.90 s gammaloop-nextest-python-api> python_session_getters_return_live_toml_and_command_blocks
  339. 29.90 s gammaloop-nextest-python-api>
  340. 29.90 s gammaloop-nextest-python-api> test result: FAILED. 0 passed; 1 failed; 0 ignored; 0 measured; 4 filtered out; finished in 0.12s
  341. 29.90 s gammaloop-nextest-python-api>
  342. 29.90 s gammaloop-nextest-python-api> stderr ---
  343. 29.90 s gammaloop-nextest-python-api> Error: Python API test subprocess failed.
  344. 29.90 s gammaloop-nextest-python-api> stdout:
  345. 29.90 s gammaloop-nextest-python-api> ┌────────────────────────────────────────────────────────┐
  346. 29.90 s gammaloop-nextest-python-api> │ You are running a restricted Symbolica instance. │
  347. 29.90 s gammaloop-nextest-python-api> │ │
  348. 29.90 s gammaloop-nextest-python-api> │ This mode is only permitted for non-commercial use and │
  349. 29.90 s gammaloop-nextest-python-api> │ is limited to one instance and core per machine. │
  350. 29.90 s gammaloop-nextest-python-api> │ │
  351. 29.90 s gammaloop-nextest-python-api> │ Hobbyists can easily acquire a free license key │
  352. 29.90 s gammaloop-nextest-python-api> │ that unlocks all cores and removes this banner: │
  353. 29.90 s gammaloop-nextest-python-api> │ │
  354. 29.90 s gammaloop-nextest-python-api> │ from symbolica import * │
  355. 29.90 s gammaloop-nextest-python-api> │ request_hobbyist_license('YOUR_NAME', 'YOUR_EMAIL') │
  356. 29.90 s gammaloop-nextest-python-api> │ │
  357. 29.90 s gammaloop-nextest-python-api> │ All other users can obtain a free 30-day trial key: │
  358. 29.90 s gammaloop-nextest-python-api> │ │
  359. 29.90 s gammaloop-nextest-python-api> │ from symbolica import * │
  360. 29.90 s gammaloop-nextest-python-api> │ request_trial_license('NAME', 'EMAIL', 'EMPLOYER') │
  361. 29.90 s gammaloop-nextest-python-api> │ │
  362. 29.90 s gammaloop-nextest-python-api> │ See https://symbolica.io/docs/get_started.html#license │
  363. 29.90 s gammaloop-nextest-python-api> └────────────────────────────────────────────────────────┘
  364. 29.90 s gammaloop-nextest-python-api> ┌───────────────────────────────────────────────────────────────────────────────────────────────────────────┐
  365. 29.90 s gammaloop-nextest-python-api> │ Cannot start new unlicensed Symbolica instance since there is already another one running on the machine. │
  366. 29.90 s gammaloop-nextest-python-api> └───────────────────────────────────────────────────────────────────────────────────────────────────────────┘
  367. 29.90 s gammaloop-nextest-python-api>
  368. 29.90 s gammaloop-nextest-python-api> stderr:
  369. 29.90 s gammaloop-nextest-python-api> ┌───────────────────────────────────┐
  370. 29.90 s gammaloop-nextest-python-api> │ The Symbolica license has expired │
  371. 29.90 s gammaloop-nextest-python-api> └───────────────────────────────────┘
  372. 29.90 s gammaloop-nextest-python-api>
  373. 29.90 s gammaloop-nextest-python-api>
  374. 29.90 s gammaloop-nextest-python-api> Location:
  375. 29.90 s gammaloop-nextest-python-api> tests/tests/test_python_api.rs:157:20
  376. 29.90 s gammaloop-nextest-python-api>
  377. 29.90 s gammaloop-nextest-python-api> FAIL [ 0.121s] (3/5) gammaloop-integration-tests::test_python_api python_evaluate_sample_honors_generate_events_and_observable_snapshots
  378. 29.90 s gammaloop-nextest-python-api> stdout ---
  379. 29.90 s gammaloop-nextest-python-api>
  380. 29.90 s gammaloop-nextest-python-api> running 1 test
  381. 29.90 s gammaloop-nextest-python-api> test python_evaluate_sample_honors_generate_events_and_observable_snapshots ... FAILED
  382. 29.90 s gammaloop-nextest-python-api>
  383. 29.90 s gammaloop-nextest-python-api> failures:
  384. 29.90 s gammaloop-nextest-python-api>
  385. 29.90 s gammaloop-nextest-python-api> failures:
  386. 29.90 s gammaloop-nextest-python-api> python_evaluate_sample_honors_generate_events_and_observable_snapshots
  387. 29.90 s gammaloop-nextest-python-api>
  388. 29.90 s gammaloop-nextest-python-api> test result: FAILED. 0 passed; 1 failed; 0 ignored; 0 measured; 4 filtered out; finished in 0.12s
  389. 29.90 s gammaloop-nextest-python-api>
  390. 29.90 s gammaloop-nextest-python-api> stderr ---
  391. 29.90 s gammaloop-nextest-python-api> Error: Python API test subprocess failed.
  392. 29.90 s gammaloop-nextest-python-api> stdout:
  393. 29.90 s gammaloop-nextest-python-api> ┌────────────────────────────────────────────────────────┐
  394. 29.90 s gammaloop-nextest-python-api> │ You are running a restricted Symbolica instance. │
  395. 29.90 s gammaloop-nextest-python-api> │ │
  396. 29.90 s gammaloop-nextest-python-api> │ This mode is only permitted for non-commercial use and │
  397. 29.90 s gammaloop-nextest-python-api> │ is limited to one instance and core per machine. │
  398. 29.90 s gammaloop-nextest-python-api> │ │
  399. 29.90 s gammaloop-nextest-python-api> │ Hobbyists can easily acquire a free license key │
  400. 29.90 s gammaloop-nextest-python-api> │ that unlocks all cores and removes this banner: │
  401. 29.90 s gammaloop-nextest-python-api> │ │
  402. 29.90 s gammaloop-nextest-python-api> │ from symbolica import * │
  403. 29.90 s gammaloop-nextest-python-api> │ request_hobbyist_license('YOUR_NAME', 'YOUR_EMAIL') │
  404. 29.90 s gammaloop-nextest-python-api> │ │
  405. 29.90 s gammaloop-nextest-python-api> │ All other users can obtain a free 30-day trial key: │
  406. 29.90 s gammaloop-nextest-python-api> │ │
  407. 29.90 s gammaloop-nextest-python-api> │ from symbolica import * │
  408. 29.90 s gammaloop-nextest-python-api> │ request_trial_license('NAME', 'EMAIL', 'EMPLOYER') │
  409. 29.90 s gammaloop-nextest-python-api> │ │
  410. 29.90 s gammaloop-nextest-python-api> │ See https://symbolica.io/docs/get_started.html#license │
  411. 29.90 s gammaloop-nextest-python-api> └────────────────────────────────────────────────────────┘
  412. 29.90 s gammaloop-nextest-python-api> ┌───────────────────────────────────────────────────────────────────────────────────────────────────────────┐
  413. 29.90 s gammaloop-nextest-python-api> │ Cannot start new unlicensed Symbolica instance since there is already another one running on the machine. │
  414. 29.90 s gammaloop-nextest-python-api> └───────────────────────────────────────────────────────────────────────────────────────────────────────────┘
  415. 29.90 s gammaloop-nextest-python-api>
  416. 29.90 s gammaloop-nextest-python-api> stderr:
  417. 29.90 s gammaloop-nextest-python-api> ┌───────────────────────────────────┐
  418. 29.90 s gammaloop-nextest-python-api> │ The Symbolica license has expired │
  419. 29.90 s gammaloop-nextest-python-api> └───────────────────────────────────┘
  420. 29.90 s gammaloop-nextest-python-api>
  421. 29.90 s gammaloop-nextest-python-api>
  422. 29.90 s gammaloop-nextest-python-api> Location:
  423. 29.90 s gammaloop-nextest-python-api> tests/tests/test_python_api.rs:157:20
  424. 29.90 s gammaloop-nextest-python-api>
  425. 29.90 s gammaloop-nextest-python-api> FAIL [ 0.212s] (4/5) gammaloop-integration-tests::test_python_api python_settings_wrappers_expose_nested_runtime_and_global_settings
  426. 29.90 s gammaloop-nextest-python-api> stdout ---
  427. 29.90 s gammaloop-nextest-python-api>
  428. 29.90 s gammaloop-nextest-python-api> running 1 test
  429. 29.90 s gammaloop-nextest-python-api> test python_settings_wrappers_expose_nested_runtime_and_global_settings ... FAILED
  430. 29.90 s gammaloop-nextest-python-api>
  431. 29.90 s gammaloop-nextest-python-api> failures:
  432. 29.90 s gammaloop-nextest-python-api>
  433. 29.90 s gammaloop-nextest-python-api> failures:
  434. 29.90 s gammaloop-nextest-python-api> python_settings_wrappers_expose_nested_runtime_and_global_settings
  435. 29.90 s gammaloop-nextest-python-api>
  436. 29.90 s gammaloop-nextest-python-api> test result: FAILED. 0 passed; 1 failed; 0 ignored; 0 measured; 4 filtered out; finished in 0.21s
  437. 29.90 s gammaloop-nextest-python-api>
  438. 29.90 s gammaloop-nextest-python-api> stderr ---
  439. 29.90 s gammaloop-nextest-python-api> Error: Python API test subprocess failed.
  440. 29.90 s gammaloop-nextest-python-api> stdout:
  441. 29.90 s gammaloop-nextest-python-api> ┌────────────────────────────────────────────────────────┐
  442. 29.90 s gammaloop-nextest-python-api> │ You are running a restricted Symbolica instance. │
  443. 29.90 s gammaloop-nextest-python-api> │ │
  444. 29.90 s gammaloop-nextest-python-api> │ This mode is only permitted for non-commercial use and │
  445. 29.90 s gammaloop-nextest-python-api> │ is limited to one instance and core per machine. │
  446. 29.90 s gammaloop-nextest-python-api> │ │
  447. 29.90 s gammaloop-nextest-python-api> │ Hobbyists can easily acquire a free license key │
  448. 29.90 s gammaloop-nextest-python-api> │ that unlocks all cores and removes this banner: │
  449. 29.90 s gammaloop-nextest-python-api> │ │
  450. 29.90 s gammaloop-nextest-python-api> │ from symbolica import * │
  451. 29.90 s gammaloop-nextest-python-api> │ request_hobbyist_license('YOUR_NAME', 'YOUR_EMAIL') │
  452. 29.90 s gammaloop-nextest-python-api> │ │
  453. 29.90 s gammaloop-nextest-python-api> │ All other users can obtain a free 30-day trial key: │
  454. 29.90 s gammaloop-nextest-python-api> │ │
  455. 29.90 s gammaloop-nextest-python-api> │ from symbolica import * │
  456. 29.90 s gammaloop-nextest-python-api> │ request_trial_license('NAME', 'EMAIL', 'EMPLOYER') │
  457. 29.90 s gammaloop-nextest-python-api> │ │
  458. 29.90 s gammaloop-nextest-python-api> │ See https://symbolica.io/docs/get_started.html#license │
  459. 29.90 s gammaloop-nextest-python-api> └────────────────────────────────────────────────────────┘
  460. 29.90 s gammaloop-nextest-python-api> ┌───────────────────────────────────────────────────────────────────────────────────────────────────────────┐
  461. 29.90 s gammaloop-nextest-python-api> │ Cannot start new unlicensed Symbolica instance since there is already another one running on the machine. │
  462. 29.90 s gammaloop-nextest-python-api> └───────────────────────────────────────────────────────────────────────────────────────────────────────────┘
  463. 29.90 s gammaloop-nextest-python-api>
  464. 29.90 s gammaloop-nextest-python-api> stderr:
  465. 29.90 s gammaloop-nextest-python-api> ┌───────────────────────────────────┐
  466. 29.90 s gammaloop-nextest-python-api> │ The Symbolica license has expired │
  467. 29.90 s gammaloop-nextest-python-api> └───────────────────────────────────┘
  468. 29.90 s gammaloop-nextest-python-api>
  469. 29.90 s gammaloop-nextest-python-api>
  470. 29.90 s gammaloop-nextest-python-api> Location:
  471. 29.90 s gammaloop-nextest-python-api> tests/tests/test_python_api.rs:157:20
  472. 29.90 s gammaloop-nextest-python-api>
  473. 29.90 s gammaloop-nextest-python-api> FAIL [ 0.295s] (5/5) gammaloop-integration-tests::test_python_api python_evaluate_sample_preserves_graph_grouping_and_incoming_pdgs
  474. 29.90 s gammaloop-nextest-python-api> stdout ---
  475. 29.90 s gammaloop-nextest-python-api>
  476. 29.90 s gammaloop-nextest-python-api> running 1 test
  477. 29.90 s gammaloop-nextest-python-api> test python_evaluate_sample_preserves_graph_grouping_and_incoming_pdgs ... FAILED
  478. 29.90 s gammaloop-nextest-python-api>
  479. 29.90 s gammaloop-nextest-python-api> failures:
  480. 29.90 s gammaloop-nextest-python-api>
  481. 29.90 s gammaloop-nextest-python-api> failures:
  482. 29.90 s gammaloop-nextest-python-api> python_evaluate_sample_preserves_graph_grouping_and_incoming_pdgs
  483. 29.90 s gammaloop-nextest-python-api>
  484. 29.90 s gammaloop-nextest-python-api> test result: FAILED. 0 passed; 1 failed; 0 ignored; 0 measured; 4 filtered out; finished in 0.29s
  485. 29.90 s gammaloop-nextest-python-api>
  486. 29.90 s gammaloop-nextest-python-api> stderr ---
  487. 29.90 s gammaloop-nextest-python-api> Error: Python API test subprocess failed.
  488. 29.90 s gammaloop-nextest-python-api> stdout:
  489. 29.90 s gammaloop-nextest-python-api> ┌────────────────────────────────────────────────────────┐
  490. 29.90 s gammaloop-nextest-python-api> │ You are running a restricted Symbolica instance. │
  491. 29.90 s gammaloop-nextest-python-api> │ │
  492. 29.90 s gammaloop-nextest-python-api> │ This mode is only permitted for non-commercial use and │
  493. 29.90 s gammaloop-nextest-python-api> │ is limited to one instance and core per machine. │
  494. 29.90 s gammaloop-nextest-python-api> │ │
  495. 29.90 s gammaloop-nextest-python-api> │ Hobbyists can easily acquire a free license key │
  496. 29.90 s gammaloop-nextest-python-api> │ that unlocks all cores and removes this banner: │
  497. 29.90 s gammaloop-nextest-python-api> │ │
  498. 29.90 s gammaloop-nextest-python-api> │ from symbolica import * │
  499. 29.90 s gammaloop-nextest-python-api> │ request_hobbyist_license('YOUR_NAME', 'YOUR_EMAIL') │
  500. 29.90 s gammaloop-nextest-python-api> │ │
  501. 29.90 s gammaloop-nextest-python-api> │ All other users can obtain a free 30-day trial key: │
  502. 29.90 s gammaloop-nextest-python-api> │ │
  503. 29.90 s gammaloop-nextest-python-api> │ from symbolica import * │
  504. 29.90 s gammaloop-nextest-python-api> │ request_trial_license('NAME', 'EMAIL', 'EMPLOYER') │
  505. 29.90 s gammaloop-nextest-python-api> │ │
  506. 29.90 s gammaloop-nextest-python-api> │ See https://symbolica.io/docs/get_started.html#license │
  507. 29.90 s gammaloop-nextest-python-api> └────────────────────────────────────────────────────────┘
  508. 29.90 s gammaloop-nextest-python-api> ┌───────────────────────────────────────────────────────────────────────────────────────────────────────────┐
  509. 29.90 s gammaloop-nextest-python-api> │ Cannot start new unlicensed Symbolica instance since there is already another one running on the machine. │
  510. 29.90 s gammaloop-nextest-python-api> └───────────────────────────────────────────────────────────────────────────────────────────────────────────┘
  511. 29.90 s gammaloop-nextest-python-api>
  512. 29.90 s gammaloop-nextest-python-api> stderr:
  513. 29.90 s gammaloop-nextest-python-api> ┌───────────────────────────────────┐
  514. 29.90 s gammaloop-nextest-python-api> │ The Symbolica license has expired │
  515. 29.90 s gammaloop-nextest-python-api> └───────────────────────────────────┘
  516. 29.90 s gammaloop-nextest-python-api> [2026-09-01 22:08:48.097] @gammaloop_api::se... INFO : Running command import model sm-default
  517. 29.90 s gammaloop-nextest-python-api> [2026-09-01 22:08:48.097] @import::model INFO : Loading built-in JSON model sm-default
  518. 29.90 s gammaloop-nextest-python-api> [2026-09-01 22:08:48.108] @gammaloop_api::se... INFO : Running command set default-runtime kv kinematics.externals='{"type":"constant","data":{"momenta":[[32.0,0.0,0.0,32.0],[32.0,0.0,0.0,-32.0]],"helicities":[1,1]}}'
  519. 29.90 s gammaloop-nextest-python-api> [2026-09-01 22:08:48.109] @gammaloop_api::se... INFO : Running command set default-runtime kv subtraction.disable_threshold_subtraction=true
  520. 29.90 s gammaloop-nextest-python-api> [2026-09-01 22:08:48.110] @gammaloop_api::se... INFO : Running command generate xs e+ e- > d d~ g | e- a d g QED^2==4 [{{2}} QCD=0] --numerator-grouping group_identical_graphs_up_to_sign --clear-existing-processes --only-diagrams
  521. 29.90 s gammaloop-nextest-python-api> [2026-09-01 22:08:48.252] @commands::generate INFO : Generated cross-section 2 graphs.
  522. 29.90 s gammaloop-nextest-python-api> [2026-09-01 22:08:48.253] @commands::generate INFO : Only diagram generation was requested, skipping integrand generation. You can generate integrands later using the 'generate existing <options>' command.
  523. 29.90 s gammaloop-nextest-python-api> [2026-09-01 22:08:48.253] @gammaloop_api::se... INFO : Running command generate
  524. 29.90 s gammaloop-nextest-python-api>
  525. 29.90 s gammaloop-nextest-python-api>
  526. 29.90 s gammaloop-nextest-python-api> Location:
  527. 29.90 s gammaloop-nextest-python-api> tests/tests/test_python_api.rs:157:20
  528. 29.90 s gammaloop-nextest-python-api>
  529. 29.91 s gammaloop-nextest-python-api> error: test run failed
  530. 29.93 s gammaloop-nextest-python-api>
  531. 29.93 s gammaloop-nextest-python-api> ========== nextest test summary ==========
  532. 29.93 s gammaloop-nextest-python-api> report: target/nextest/ci_gammaloop/junit.xml
  533. 29.93 s gammaloop-nextest-python-api> tests: 5, failures: 5, errors: 0
  534. 29.93 s gammaloop-nextest-python-api>
  535. 29.93 s gammaloop-nextest-python-api> 1. gammaloop-integration-tests::test_python_api::python_evaluate_samples_batch_and_momentum_space_have_expected_shape
  536. 29.93 s gammaloop-nextest-python-api> failure: test failure with exit code 101
  537. 29.93 s gammaloop-nextest-python-api> Error: Python API test subprocess failed.
  538. 29.93 s gammaloop-nextest-python-api> stdout:
  539. 29.93 s gammaloop-nextest-python-api> ┌────────────────────────────────────────────────────────┐
  540. 29.93 s gammaloop-nextest-python-api> │ You are running a restricted Symbolica instance. │
  541. 29.93 s gammaloop-nextest-python-api> │ │
  542. 29.93 s gammaloop-nextest-python-api> │ This mode is only permitted for non-commercial use and │
  543. 29.93 s gammaloop-nextest-python-api> │ is limited to one instance and core per machine. │
  544. 29.93 s gammaloop-nextest-python-api> │ │
  545. 29.93 s gammaloop-nextest-python-api> │ Hobbyists can easily acquire a free license key │
  546. 29.93 s gammaloop-nextest-python-api> │ that unlocks all cores and removes this banner: │
  547. 29.93 s gammaloop-nextest-python-api> │ │
  548. 29.93 s gammaloop-nextest-python-api> │ from symbolica import * │
  549. 29.93 s gammaloop-nextest-python-api> │ request_hobbyist_license('YOUR_NAME', 'YOUR_EMAIL') │
  550. 29.93 s gammaloop-nextest-python-api> │ │
  551. 29.93 s gammaloop-nextest-python-api> │ All other users can obtain a free 30-day trial key: │
  552. 29.93 s gammaloop-nextest-python-api> │ │
  553. 29.93 s gammaloop-nextest-python-api> │ from symbolica import * │
  554. 29.93 s gammaloop-nextest-python-api> │ request_trial_license('NAME', 'EMAIL', 'EMPLOYER') │
  555. 29.93 s gammaloop-nextest-python-api> │ │
  556. 29.93 s gammaloop-nextest-python-api> │ See https://symbolica.io/docs/get_started.html#license │
  557. 29.93 s gammaloop-nextest-python-api> └────────────────────────────────────────────────────────┘
  558. 29.93 s gammaloop-nextest-python-api> ┌───────────────────────────────────────────────────────────────────────────────────────────────────────────┐
  559. 29.93 s gammaloop-nextest-python-api> │ Cannot start new unlicensed Symbolica instance since there is already another one running on the machine. │
  560. 29.93 s gammaloop-nextest-python-api> └───────────────────────────────────────────────────────────────────────────────────────────────────────────┘
  561. 29.93 s gammaloop-nextest-python-api>
  562. 29.93 s gammaloop-nextest-python-api> stderr:
  563. 29.93 s gammaloop-nextest-python-api> ┌───────────────────────────────────┐
  564. 29.93 s gammaloop-nextest-python-api> │ The Symbolica license has expired │
  565. 29.93 s gammaloop-nextest-python-api> └───────────────────────────────────┘
  566. 29.93 s gammaloop-nextest-python-api>
  567. 29.93 s gammaloop-nextest-python-api>
  568. 29.93 s gammaloop-nextest-python-api> Location:
  569. 29.93 s gammaloop-nextest-python-api> tests/tests/test_python_api.rs:157:20
  570. 29.93 s gammaloop-nextest-python-api> system-out
  571. 29.93 s gammaloop-nextest-python-api> running 1 test
  572. 29.93 s gammaloop-nextest-python-api> test python_evaluate_samples_batch_and_momentum_space_have_expected_shape ... FAILED
  573. 29.93 s gammaloop-nextest-python-api>
  574. 29.93 s gammaloop-nextest-python-api> failures:
  575. 29.93 s gammaloop-nextest-python-api>
  576. 29.93 s gammaloop-nextest-python-api> failures:
  577. 29.93 s gammaloop-nextest-python-api> python_evaluate_samples_batch_and_momentum_space_have_expected_shape
  578. 29.93 s gammaloop-nextest-python-api>
  579. 29.93 s gammaloop-nextest-python-api> test result: FAILED. 0 passed; 1 failed; 0 ignored; 0 measured; 4 filtered out; finished in 0.11s
  580. 29.93 s gammaloop-nextest-python-api> system-err
  581. 29.93 s gammaloop-nextest-python-api> Error: Python API test subprocess failed.
  582. 29.93 s gammaloop-nextest-python-api> stdout:
  583. 29.93 s gammaloop-nextest-python-api> ┌────────────────────────────────────────────────────────┐
  584. 29.93 s gammaloop-nextest-python-api> │ You are running a restricted Symbolica instance. │
  585. 29.93 s gammaloop-nextest-python-api> │ │
  586. 29.93 s gammaloop-nextest-python-api> │ This mode is only permitted for non-commercial use and │
  587. 29.93 s gammaloop-nextest-python-api> │ is limited to one instance and core per machine. │
  588. 29.93 s gammaloop-nextest-python-api> │ │
  589. 29.93 s gammaloop-nextest-python-api> │ Hobbyists can easily acquire a free license key │
  590. 29.93 s gammaloop-nextest-python-api> │ that unlocks all cores and removes this banner: │
  591. 29.93 s gammaloop-nextest-python-api> │ │
  592. 29.93 s gammaloop-nextest-python-api> │ from symbolica import * │
  593. 29.93 s gammaloop-nextest-python-api> │ request_hobbyist_license('YOUR_NAME', 'YOUR_EMAIL') │
  594. 29.93 s gammaloop-nextest-python-api> │ │
  595. 29.93 s gammaloop-nextest-python-api> │ All other users can obtain a free 30-day trial key: │
  596. 29.93 s gammaloop-nextest-python-api> │ │
  597. 29.93 s gammaloop-nextest-python-api> │ from symbolica import * │
  598. 29.93 s gammaloop-nextest-python-api> │ request_trial_license('NAME', 'EMAIL', 'EMPLOYER') │
  599. 29.93 s gammaloop-nextest-python-api> │ │
  600. 29.93 s gammaloop-nextest-python-api> │ See https://symbolica.io/docs/get_started.html#license │
  601. 29.93 s gammaloop-nextest-python-api> └────────────────────────────────────────────────────────┘
  602. 29.93 s gammaloop-nextest-python-api> ┌───────────────────────────────────────────────────────────────────────────────────────────────────────────┐
  603. 29.93 s gammaloop-nextest-python-api> │ Cannot start new unlicensed Symbolica instance since there is already another one running on the machine. │
  604. 29.93 s gammaloop-nextest-python-api> └───────────────────────────────────────────────────────────────────────────────────────────────────────────┘
  605. 29.93 s gammaloop-nextest-python-api>
  606. 29.93 s gammaloop-nextest-python-api> stderr:
  607. 29.93 s gammaloop-nextest-python-api> ┌───────────────────────────────────┐
  608. 29.93 s gammaloop-nextest-python-api> │ The Symbolica license has expired │
  609. 29.93 s gammaloop-nextest-python-api> └───────────────────────────────────┘
  610. 29.93 s gammaloop-nextest-python-api>
  611. 29.93 s gammaloop-nextest-python-api>
  612. 29.93 s gammaloop-nextest-python-api> Location:
  613. 29.93 s gammaloop-nextest-python-api> tests/tests/test_python_api.rs:157:20
  614. 29.93 s gammaloop-nextest-python-api>
  615. 29.93 s gammaloop-nextest-python-api> 2. gammaloop-integration-tests::test_python_api::python_session_getters_return_live_toml_and_command_blocks
  616. 29.93 s gammaloop-nextest-python-api> failure: test failure with exit code 101
  617. 29.93 s gammaloop-nextest-python-api> Error: Python API test subprocess failed.
  618. 29.93 s gammaloop-nextest-python-api> stdout:
  619. 29.93 s gammaloop-nextest-python-api> ┌────────────────────────────────────────────────────────┐
  620. 29.93 s gammaloop-nextest-python-api> │ You are running a restricted Symbolica instance. │
  621. 29.93 s gammaloop-nextest-python-api> │ │
  622. 29.93 s gammaloop-nextest-python-api> │ This mode is only permitted for non-commercial use and │
  623. 29.93 s gammaloop-nextest-python-api> │ is limited to one instance and core per machine. │
  624. 29.93 s gammaloop-nextest-python-api> │ │
  625. 29.93 s gammaloop-nextest-python-api> │ Hobbyists can easily acquire a free license key │
  626. 29.93 s gammaloop-nextest-python-api> │ that unlocks all cores and removes this banner: │
  627. 29.93 s gammaloop-nextest-python-api> │ │
  628. 29.93 s gammaloop-nextest-python-api> │ from symbolica import * │
  629. 29.93 s gammaloop-nextest-python-api> │ request_hobbyist_license('YOUR_NAME', 'YOUR_EMAIL') │
  630. 29.93 s gammaloop-nextest-python-api> │ │
  631. 29.93 s gammaloop-nextest-python-api> │ All other users can obtain a free 30-day trial key: │
  632. 29.93 s gammaloop-nextest-python-api> │ │
  633. 29.93 s gammaloop-nextest-python-api> │ from symbolica import * │
  634. 29.93 s gammaloop-nextest-python-api> │ request_trial_license('NAME', 'EMAIL', 'EMPLOYER') │
  635. 29.93 s gammaloop-nextest-python-api> │ │
  636. 29.93 s gammaloop-nextest-python-api> │ See https://symbolica.io/docs/get_started.html#license │
  637. 29.93 s gammaloop-nextest-python-api> └────────────────────────────────────────────────────────┘
  638. 29.93 s gammaloop-nextest-python-api> ┌───────────────────────────────────────────────────────────────────────────────────────────────────────────┐
  639. 29.93 s gammaloop-nextest-python-api> │ Cannot start new unlicensed Symbolica instance since there is already another one running on the machine. │
  640. 29.93 s gammaloop-nextest-python-api> └───────────────────────────────────────────────────────────────────────────────────────────────────────────┘
  641. 29.93 s gammaloop-nextest-python-api>
  642. 29.93 s gammaloop-nextest-python-api> stderr:
  643. 29.93 s gammaloop-nextest-python-api> ┌───────────────────────────────────┐
  644. 29.93 s gammaloop-nextest-python-api> │ The Symbolica license has expired │
  645. 29.93 s gammaloop-nextest-python-api> └───────────────────────────────────┘
  646. 29.93 s gammaloop-nextest-python-api>
  647. 29.93 s gammaloop-nextest-python-api>
  648. 29.93 s gammaloop-nextest-python-api> Location:
  649. 29.93 s gammaloop-nextest-python-api> tests/tests/test_python_api.rs:157:20
  650. 29.93 s gammaloop-nextest-python-api> system-out
  651. 29.93 s gammaloop-nextest-python-api> running 1 test
  652. 29.93 s gammaloop-nextest-python-api> test python_session_getters_return_live_toml_and_command_blocks ... FAILED
  653. 29.93 s gammaloop-nextest-python-api>
  654. 29.93 s gammaloop-nextest-python-api> failures:
  655. 29.93 s gammaloop-nextest-python-api>
  656. 29.93 s gammaloop-nextest-python-api> failures:
  657. 29.93 s gammaloop-nextest-python-api> python_session_getters_return_live_toml_and_command_blocks
  658. 29.93 s gammaloop-nextest-python-api>
  659. 29.93 s gammaloop-nextest-python-api> test result: FAILED. 0 passed; 1 failed; 0 ignored; 0 measured; 4 filtered out; finished in 0.12s
  660. 29.93 s gammaloop-nextest-python-api> system-err
  661. 29.93 s gammaloop-nextest-python-api> Error: Python API test subprocess failed.
  662. 29.93 s gammaloop-nextest-python-api> stdout:
  663. 29.93 s gammaloop-nextest-python-api> ┌────────────────────────────────────────────────────────┐
  664. 29.93 s gammaloop-nextest-python-api> │ You are running a restricted Symbolica instance. │
  665. 29.93 s gammaloop-nextest-python-api> │ │
  666. 29.93 s gammaloop-nextest-python-api> │ This mode is only permitted for non-commercial use and │
  667. 29.93 s gammaloop-nextest-python-api> │ is limited to one instance and core per machine. │
  668. 29.93 s gammaloop-nextest-python-api> │ │
  669. 29.93 s gammaloop-nextest-python-api> │ Hobbyists can easily acquire a free license key │
  670. 29.93 s gammaloop-nextest-python-api> │ that unlocks all cores and removes this banner: │
  671. 29.93 s gammaloop-nextest-python-api> │ │
  672. 29.93 s gammaloop-nextest-python-api> │ from symbolica import * │
  673. 29.93 s gammaloop-nextest-python-api> │ request_hobbyist_license('YOUR_NAME', 'YOUR_EMAIL') │
  674. 29.93 s gammaloop-nextest-python-api> │ │
  675. 29.93 s gammaloop-nextest-python-api> │ All other users can obtain a free 30-day trial key: │
  676. 29.93 s gammaloop-nextest-python-api> │ │
  677. 29.93 s gammaloop-nextest-python-api> │ from symbolica import * │
  678. 29.93 s gammaloop-nextest-python-api> │ request_trial_license('NAME', 'EMAIL', 'EMPLOYER') │
  679. 29.93 s gammaloop-nextest-python-api> │ │
  680. 29.93 s gammaloop-nextest-python-api> │ See https://symbolica.io/docs/get_started.html#license │
  681. 29.93 s gammaloop-nextest-python-api> └────────────────────────────────────────────────────────┘
  682. 29.94 s gammaloop-nextest-python-api> ┌───────────────────────────────────────────────────────────────────────────────────────────────────────────┐
  683. 29.94 s gammaloop-nextest-python-api> │ Cannot start new unlicensed Symbolica instance since there is already another one running on the machine. │
  684. 29.94 s gammaloop-nextest-python-api> └───────────────────────────────────────────────────────────────────────────────────────────────────────────┘
  685. 29.94 s gammaloop-nextest-python-api>
  686. 29.94 s gammaloop-nextest-python-api> stderr:
  687. 29.94 s gammaloop-nextest-python-api> ┌───────────────────────────────────┐
  688. 29.94 s gammaloop-nextest-python-api> │ The Symbolica license has expired │
  689. 29.94 s gammaloop-nextest-python-api> └───────────────────────────────────┘
  690. 29.94 s gammaloop-nextest-python-api>
  691. 29.94 s gammaloop-nextest-python-api>
  692. 29.94 s gammaloop-nextest-python-api> Location:
  693. 29.94 s gammaloop-nextest-python-api> tests/tests/test_python_api.rs:157:20
  694. 29.94 s gammaloop-nextest-python-api>
  695. 29.94 s gammaloop-nextest-python-api> 3. gammaloop-integration-tests::test_python_api::python_evaluate_sample_honors_generate_events_and_observable_snapshots
  696. 29.94 s gammaloop-nextest-python-api> failure: test failure with exit code 101
  697. 29.94 s gammaloop-nextest-python-api> Error: Python API test subprocess failed.
  698. 29.94 s gammaloop-nextest-python-api> stdout:
  699. 29.94 s gammaloop-nextest-python-api> ┌────────────────────────────────────────────────────────┐
  700. 29.94 s gammaloop-nextest-python-api> │ You are running a restricted Symbolica instance. │
  701. 29.94 s gammaloop-nextest-python-api> │ │
  702. 29.94 s gammaloop-nextest-python-api> │ This mode is only permitted for non-commercial use and │
  703. 29.94 s gammaloop-nextest-python-api> │ is limited to one instance and core per machine. │
  704. 29.94 s gammaloop-nextest-python-api> │ │
  705. 29.94 s gammaloop-nextest-python-api> │ Hobbyists can easily acquire a free license key │
  706. 29.94 s gammaloop-nextest-python-api> │ that unlocks all cores and removes this banner: │
  707. 29.94 s gammaloop-nextest-python-api> │ │
  708. 29.94 s gammaloop-nextest-python-api> │ from symbolica import * │
  709. 29.94 s gammaloop-nextest-python-api> │ request_hobbyist_license('YOUR_NAME', 'YOUR_EMAIL') │
  710. 29.94 s gammaloop-nextest-python-api> │ │
  711. 29.94 s gammaloop-nextest-python-api> │ All other users can obtain a free 30-day trial key: │
  712. 29.94 s gammaloop-nextest-python-api> │ │
  713. 29.94 s gammaloop-nextest-python-api> │ from symbolica import * │
  714. 29.94 s gammaloop-nextest-python-api> │ request_trial_license('NAME', 'EMAIL', 'EMPLOYER') │
  715. 29.94 s gammaloop-nextest-python-api> │ │
  716. 29.94 s gammaloop-nextest-python-api> │ See https://symbolica.io/docs/get_started.html#license │
  717. 29.94 s gammaloop-nextest-python-api> └────────────────────────────────────────────────────────┘
  718. 29.94 s gammaloop-nextest-python-api> ┌───────────────────────────────────────────────────────────────────────────────────────────────────────────┐
  719. 29.94 s gammaloop-nextest-python-api> │ Cannot start new unlicensed Symbolica instance since there is already another one running on the machine. │
  720. 29.94 s gammaloop-nextest-python-api> └───────────────────────────────────────────────────────────────────────────────────────────────────────────┘
  721. 29.94 s gammaloop-nextest-python-api>
  722. 29.94 s gammaloop-nextest-python-api> stderr:
  723. 29.94 s gammaloop-nextest-python-api> ┌───────────────────────────────────┐
  724. 29.94 s gammaloop-nextest-python-api> │ The Symbolica license has expired │
  725. 29.94 s gammaloop-nextest-python-api> └───────────────────────────────────┘
  726. 29.94 s gammaloop-nextest-python-api>
  727. 29.94 s gammaloop-nextest-python-api>
  728. 29.94 s gammaloop-nextest-python-api> Location:
  729. 29.94 s gammaloop-nextest-python-api> tests/tests/test_python_api.rs:157:20
  730. 29.94 s gammaloop-nextest-python-api> system-out
  731. 29.94 s gammaloop-nextest-python-api> running 1 test
  732. 29.94 s gammaloop-nextest-python-api> test python_evaluate_sample_honors_generate_events_and_observable_snapshots ... FAILED
  733. 29.94 s gammaloop-nextest-python-api>
  734. 29.94 s gammaloop-nextest-python-api> failures:
  735. 29.94 s gammaloop-nextest-python-api>
  736. 29.94 s gammaloop-nextest-python-api> failures:
  737. 29.94 s gammaloop-nextest-python-api> python_evaluate_sample_honors_generate_events_and_observable_snapshots
  738. 29.94 s gammaloop-nextest-python-api>
  739. 29.94 s gammaloop-nextest-python-api> test result: FAILED. 0 passed; 1 failed; 0 ignored; 0 measured; 4 filtered out; finished in 0.12s
  740. 29.94 s gammaloop-nextest-python-api> system-err
  741. 29.94 s gammaloop-nextest-python-api> Error: Python API test subprocess failed.
  742. 29.94 s gammaloop-nextest-python-api> stdout:
  743. 29.94 s gammaloop-nextest-python-api> ┌────────────────────────────────────────────────────────┐
  744. 29.94 s gammaloop-nextest-python-api> │ You are running a restricted Symbolica instance. │
  745. 29.94 s gammaloop-nextest-python-api> │ │
  746. 29.94 s gammaloop-nextest-python-api> │ This mode is only permitted for non-commercial use and │
  747. 29.94 s gammaloop-nextest-python-api> │ is limited to one instance and core per machine. │
  748. 29.94 s gammaloop-nextest-python-api> │ │
  749. 29.94 s gammaloop-nextest-python-api> │ Hobbyists can easily acquire a free license key │
  750. 29.94 s gammaloop-nextest-python-api> │ that unlocks all cores and removes this banner: │
  751. 29.94 s gammaloop-nextest-python-api> │ │
  752. 29.94 s gammaloop-nextest-python-api> │ from symbolica import * │
  753. 29.94 s gammaloop-nextest-python-api> │ request_hobbyist_license('YOUR_NAME', 'YOUR_EMAIL') │
  754. 29.94 s gammaloop-nextest-python-api> │ │
  755. 29.94 s gammaloop-nextest-python-api> │ All other users can obtain a free 30-day trial key: │
  756. 29.94 s gammaloop-nextest-python-api> │ │
  757. 29.94 s gammaloop-nextest-python-api> │ from symbolica import * │
  758. 29.94 s gammaloop-nextest-python-api> │ request_trial_license('NAME', 'EMAIL', 'EMPLOYER') │
  759. 29.94 s gammaloop-nextest-python-api> │ │
  760. 29.94 s gammaloop-nextest-python-api> │ See https://symbolica.io/docs/get_started.html#license │
  761. 29.94 s gammaloop-nextest-python-api> └────────────────────────────────────────────────────────┘
  762. 29.94 s gammaloop-nextest-python-api> ┌───────────────────────────────────────────────────────────────────────────────────────────────────────────┐
  763. 29.94 s gammaloop-nextest-python-api> │ Cannot start new unlicensed Symbolica instance since there is already another one running on the machine. │
  764. 29.94 s gammaloop-nextest-python-api> └───────────────────────────────────────────────────────────────────────────────────────────────────────────┘
  765. 29.94 s gammaloop-nextest-python-api>
  766. 29.94 s gammaloop-nextest-python-api> stderr:
  767. 29.94 s gammaloop-nextest-python-api> ┌───────────────────────────────────┐
  768. 29.94 s gammaloop-nextest-python-api> │ The Symbolica license has expired │
  769. 29.94 s gammaloop-nextest-python-api> └───────────────────────────────────┘
  770. 29.94 s gammaloop-nextest-python-api>
  771. 29.94 s gammaloop-nextest-python-api>
  772. 29.94 s gammaloop-nextest-python-api> Location:
  773. 29.94 s gammaloop-nextest-python-api> tests/tests/test_python_api.rs:157:20
  774. 29.94 s gammaloop-nextest-python-api>
  775. 29.94 s gammaloop-nextest-python-api> 4. gammaloop-integration-tests::test_python_api::python_settings_wrappers_expose_nested_runtime_and_global_settings
  776. 29.94 s gammaloop-nextest-python-api> failure: test failure with exit code 101
  777. 29.94 s gammaloop-nextest-python-api> Error: Python API test subprocess failed.
  778. 29.94 s gammaloop-nextest-python-api> stdout:
  779. 29.94 s gammaloop-nextest-python-api> ┌────────────────────────────────────────────────────────┐
  780. 29.94 s gammaloop-nextest-python-api> │ You are running a restricted Symbolica instance. │
  781. 29.94 s gammaloop-nextest-python-api> │ │
  782. 29.94 s gammaloop-nextest-python-api> │ This mode is only permitted for non-commercial use and │
  783. 29.94 s gammaloop-nextest-python-api> │ is limited to one instance and core per machine. │
  784. 29.94 s gammaloop-nextest-python-api> │ │
  785. 29.94 s gammaloop-nextest-python-api> │ Hobbyists can easily acquire a free license key │
  786. 29.94 s gammaloop-nextest-python-api> │ that unlocks all cores and removes this banner: │
  787. 29.94 s gammaloop-nextest-python-api> │ │
  788. 29.94 s gammaloop-nextest-python-api> │ from symbolica import * │
  789. 29.94 s gammaloop-nextest-python-api> │ request_hobbyist_license('YOUR_NAME', 'YOUR_EMAIL') │
  790. 29.94 s gammaloop-nextest-python-api> │ │
  791. 29.94 s gammaloop-nextest-python-api> │ All other users can obtain a free 30-day trial key: │
  792. 29.94 s gammaloop-nextest-python-api> │ │
  793. 29.94 s gammaloop-nextest-python-api> │ from symbolica import * │
  794. 29.94 s gammaloop-nextest-python-api> │ request_trial_license('NAME', 'EMAIL', 'EMPLOYER') │
  795. 29.94 s gammaloop-nextest-python-api> │ │
  796. 29.94 s gammaloop-nextest-python-api> │ See https://symbolica.io/docs/get_started.html#license │
  797. 29.94 s gammaloop-nextest-python-api> └────────────────────────────────────────────────────────┘
  798. 29.94 s gammaloop-nextest-python-api> ┌───────────────────────────────────────────────────────────────────────────────────────────────────────────┐
  799. 29.94 s gammaloop-nextest-python-api> │ Cannot start new unlicensed Symbolica instance since there is already another one running on the machine. │
  800. 29.94 s gammaloop-nextest-python-api> └───────────────────────────────────────────────────────────────────────────────────────────────────────────┘
  801. 29.94 s gammaloop-nextest-python-api>
  802. 29.94 s gammaloop-nextest-python-api> stderr:
  803. 29.94 s gammaloop-nextest-python-api> ┌───────────────────────────────────┐
  804. 29.94 s gammaloop-nextest-python-api> │ The Symbolica license has expired │
  805. 29.94 s gammaloop-nextest-python-api> └───────────────────────────────────┘
  806. 29.94 s gammaloop-nextest-python-api>
  807. 29.94 s gammaloop-nextest-python-api>
  808. 29.94 s gammaloop-nextest-python-api> Location:
  809. 29.94 s gammaloop-nextest-python-api> tests/tests/test_python_api.rs:157:20
  810. 29.94 s gammaloop-nextest-python-api> system-out
  811. 29.94 s gammaloop-nextest-python-api> running 1 test
  812. 29.94 s gammaloop-nextest-python-api> test python_settings_wrappers_expose_nested_runtime_and_global_settings ... FAILED
  813. 29.94 s gammaloop-nextest-python-api>
  814. 29.94 s gammaloop-nextest-python-api> failures:
  815. 29.94 s gammaloop-nextest-python-api>
  816. 29.94 s gammaloop-nextest-python-api> failures:
  817. 29.94 s gammaloop-nextest-python-api> python_settings_wrappers_expose_nested_runtime_and_global_settings
  818. 29.94 s gammaloop-nextest-python-api>
  819. 29.94 s gammaloop-nextest-python-api> test result: FAILED. 0 passed; 1 failed; 0 ignored; 0 measured; 4 filtered out; finished in 0.21s
  820. 29.94 s gammaloop-nextest-python-api> system-err
  821. 29.94 s gammaloop-nextest-python-api> Error: Python API test subprocess failed.
  822. 29.94 s gammaloop-nextest-python-api> stdout:
  823. 29.94 s gammaloop-nextest-python-api> ┌────────────────────────────────────────────────────────┐
  824. 29.94 s gammaloop-nextest-python-api> │ You are running a restricted Symbolica instance. │
  825. 29.94 s gammaloop-nextest-python-api> │ │
  826. 29.94 s gammaloop-nextest-python-api> │ This mode is only permitted for non-commercial use and │
  827. 29.94 s gammaloop-nextest-python-api> │ is limited to one instance and core per machine. │
  828. 29.94 s gammaloop-nextest-python-api> │ │
  829. 29.94 s gammaloop-nextest-python-api> │ Hobbyists can easily acquire a free license key │
  830. 29.94 s gammaloop-nextest-python-api> │ that unlocks all cores and removes this banner: │
  831. 29.94 s gammaloop-nextest-python-api> │ │
  832. 29.94 s gammaloop-nextest-python-api> │ from symbolica import * │
  833. 29.94 s gammaloop-nextest-python-api> │ request_hobbyist_license('YOUR_NAME', 'YOUR_EMAIL') │
  834. 29.94 s gammaloop-nextest-python-api> │ │
  835. 29.94 s gammaloop-nextest-python-api> │ All other users can obtain a free 30-day trial key: │
  836. 29.94 s gammaloop-nextest-python-api> │ │
  837. 29.94 s gammaloop-nextest-python-api> │ from symbolica import * │
  838. 29.94 s gammaloop-nextest-python-api> │ request_trial_license('NAME', 'EMAIL', 'EMPLOYER') │
  839. 29.94 s gammaloop-nextest-python-api> │ │
  840. 29.94 s gammaloop-nextest-python-api> │ See https://symbolica.io/docs/get_started.html#license │
  841. 29.94 s gammaloop-nextest-python-api> └────────────────────────────────────────────────────────┘
  842. 29.94 s gammaloop-nextest-python-api> ┌───────────────────────────────────────────────────────────────────────────────────────────────────────────┐
  843. 29.94 s gammaloop-nextest-python-api> │ Cannot start new unlicensed Symbolica instance since there is already another one running on the machine. │
  844. 29.94 s gammaloop-nextest-python-api> └───────────────────────────────────────────────────────────────────────────────────────────────────────────┘
  845. 29.94 s gammaloop-nextest-python-api>
  846. 29.94 s gammaloop-nextest-python-api> stderr:
  847. 29.94 s gammaloop-nextest-python-api> ┌───────────────────────────────────┐
  848. 29.94 s gammaloop-nextest-python-api> │ The Symbolica license has expired │
  849. 29.94 s gammaloop-nextest-python-api> └───────────────────────────────────┘
  850. 29.94 s gammaloop-nextest-python-api>
  851. 29.94 s gammaloop-nextest-python-api>
  852. 29.94 s gammaloop-nextest-python-api> Location:
  853. 29.94 s gammaloop-nextest-python-api> tests/tests/test_python_api.rs:157:20
  854. 29.94 s gammaloop-nextest-python-api>
  855. 29.94 s gammaloop-nextest-python-api> 5. gammaloop-integration-tests::test_python_api::python_evaluate_sample_preserves_graph_grouping_and_incoming_pdgs
  856. 29.94 s gammaloop-nextest-python-api> failure: test failure with exit code 101
  857. 29.94 s gammaloop-nextest-python-api> Error: Python API test subprocess failed.
  858. 29.94 s gammaloop-nextest-python-api> stdout:
  859. 29.94 s gammaloop-nextest-python-api> ┌────────────────────────────────────────────────────────┐
  860. 29.94 s gammaloop-nextest-python-api> │ You are running a restricted Symbolica instance. │
  861. 29.94 s gammaloop-nextest-python-api> │ │
  862. 29.94 s gammaloop-nextest-python-api> │ This mode is only permitted for non-commercial use and │
  863. 29.94 s gammaloop-nextest-python-api> │ is limited to one instance and core per machine. │
  864. 29.94 s gammaloop-nextest-python-api> │ │
  865. 29.94 s gammaloop-nextest-python-api> │ Hobbyists can easily acquire a free license key │
  866. 29.94 s gammaloop-nextest-python-api> │ that unlocks all cores and removes this banner: │
  867. 29.94 s gammaloop-nextest-python-api> │ │
  868. 29.94 s gammaloop-nextest-python-api> │ from symbolica import * │
  869. 29.94 s gammaloop-nextest-python-api> │ request_hobbyist_license('YOUR_NAME', 'YOUR_EMAIL') │
  870. 29.94 s gammaloop-nextest-python-api> │ │
  871. 29.94 s gammaloop-nextest-python-api> │ All other users can obtain a free 30-day trial key: │
  872. 29.94 s gammaloop-nextest-python-api> │ │
  873. 29.94 s gammaloop-nextest-python-api> │ from symbolica import * │
  874. 29.94 s gammaloop-nextest-python-api> │ request_trial_license('NAME', 'EMAIL', 'EMPLOYER') │
  875. 29.94 s gammaloop-nextest-python-api> │ │
  876. 29.94 s gammaloop-nextest-python-api> │ See https://symbolica.io/docs/get_started.html#license │
  877. 29.94 s gammaloop-nextest-python-api> └────────────────────────────────────────────────────────┘
  878. 29.94 s gammaloop-nextest-python-api> ┌───────────────────────────────────────────────────────────────────────────────────────────────────────────┐
  879. 29.94 s gammaloop-nextest-python-api> │ Cannot start new unlicensed Symbolica instance since there is already another one running on the machine. │
  880. 29.94 s gammaloop-nextest-python-api> └───────────────────────────────────────────────────────────────────────────────────────────────────────────┘
  881. 29.94 s gammaloop-nextest-python-api>
  882. 29.94 s gammaloop-nextest-python-api> stderr:
  883. 29.94 s gammaloop-nextest-python-api> ┌───────────────────────────────────┐
  884. 29.94 s gammaloop-nextest-python-api> │ The Symbolica license has expired │
  885. 29.94 s gammaloop-nextest-python-api> └───────────────────────────────────┘
  886. 29.94 s gammaloop-nextest-python-api> [2026-09-01 22:08:48.097] @gammaloop_api::se... INFO : Running command import model sm-default
  887. 29.94 s gammaloop-nextest-python-api> [2026-09-01 22:08:48.097] @import::model INFO : Loading built-in JSON model sm-default
  888. 29.94 s gammaloop-nextest-python-api> [2026-09-01 22:08:48.108] @gammaloop_api::se... INFO : Running command set default-runtime kv kinematics.externals='{"type":"constant","data":{"momenta":[[32.0,0.0,0.0,32.0],[32.0,0.0,0.0,-32.0]],"helicities":[1,1]}}'
  889. 29.94 s gammaloop-nextest-python-api> [2026-09-01 22:08:48.109] @gammaloop_api::se... INFO : Running command set default-runtime kv subtraction.disable_threshold_subtraction=true
  890. 29.94 s gammaloop-nextest-python-api> [2026-09-01 22:08:48.110] @gammaloop_api::se... INFO : Running command generate xs e+ e- > d d~ g | e- a d g QED^2==4 [{{2}} QCD=0] --numerator-grouping group_identical_graphs_up_to_sign --clear-existing-processes --only-diagrams
  891. 29.94 s gammaloop-nextest-python-api> [2026-09-01 22:08:48.252] @commands::generate INFO : Generated cross-section 2 graphs.
  892. 29.94 s gammaloop-nextest-python-api> [2026-09-01 22:08:48.253] @commands::generate INFO : Only diagram generation was requested, skipping integrand generation. You can generate integrands later using the 'generate existing <options>' command.
  893. 29.94 s gammaloop-nextest-python-api> [2026-09-01 22:08:48.253] @gammaloop_api::se... INFO : Running command generate
  894. 29.94 s gammaloop-nextest-python-api>
  895. 29.94 s gammaloop-nextest-python-api>
  896. 29.94 s gammaloop-nextest-python-api> Location:
  897. 29.94 s gammaloop-nextest-python-api> tests/tests/test_python_api.rs:157:20
  898. 29.94 s gammaloop-nextest-python-api> system-out
  899. 29.94 s gammaloop-nextest-python-api> running 1 test
  900. 29.94 s gammaloop-nextest-python-api> test python_evaluate_sample_preserves_graph_grouping_and_incoming_pdgs ... FAILED
  901. 29.94 s gammaloop-nextest-python-api>
  902. 29.94 s gammaloop-nextest-python-api> failures:
  903. 29.94 s gammaloop-nextest-python-api>
  904. 29.94 s gammaloop-nextest-python-api> failures:
  905. 29.94 s gammaloop-nextest-python-api> python_evaluate_sample_preserves_graph_grouping_and_incoming_pdgs
  906. 29.94 s gammaloop-nextest-python-api>
  907. 29.94 s gammaloop-nextest-python-api> test result: FAILED. 0 passed; 1 failed; 0 ignored; 0 measured; 4 filtered out; finished in 0.29s
  908. 29.94 s gammaloop-nextest-python-api> system-err
  909. 29.94 s gammaloop-nextest-python-api> Error: Python API test subprocess failed.
  910. 29.94 s gammaloop-nextest-python-api> stdout:
  911. 29.94 s gammaloop-nextest-python-api> ┌────────────────────────────────────────────────────────┐
  912. 29.94 s gammaloop-nextest-python-api> │ You are running a restricted Symbolica instance. │
  913. 29.94 s gammaloop-nextest-python-api> │ │
  914. 29.94 s gammaloop-nextest-python-api> │ This mode is only permitted for non-commercial use and │
  915. 29.94 s gammaloop-nextest-python-api> │ is limited to one instance and core per machine. │
  916. 29.94 s gammaloop-nextest-python-api> │ │
  917. 29.94 s gammaloop-nextest-python-api> │ Hobbyists can easily acquire a free license key │
  918. 29.94 s gammaloop-nextest-python-api> │ that unlocks all cores and removes this banner: │
  919. 29.94 s gammaloop-nextest-python-api> │ │
  920. 29.94 s gammaloop-nextest-python-api> │ from symbolica import * │
  921. 29.94 s gammaloop-nextest-python-api> │ request_hobbyist_license('YOUR_NAME', 'YOUR_EMAIL') │
  922. 29.94 s gammaloop-nextest-python-api> │ │
  923. 29.94 s gammaloop-nextest-python-api> │ All other users can obtain a free 30-day trial key: │
  924. 29.94 s gammaloop-nextest-python-api> │ │
  925. 29.94 s gammaloop-nextest-python-api> │ from symbolica import * │
  926. 29.94 s gammaloop-nextest-python-api> │ request_trial_license('NAME', 'EMAIL', 'EMPLOYER') │
  927. 29.94 s gammaloop-nextest-python-api> │ │
  928. 29.94 s gammaloop-nextest-python-api> │ See https://symbolica.io/docs/get_started.html#license │
  929. 29.94 s gammaloop-nextest-python-api> └────────────────────────────────────────────────────────┘
  930. 29.94 s gammaloop-nextest-python-api> ┌───────────────────────────────────────────────────────────────────────────────────────────────────────────┐
  931. 29.94 s gammaloop-nextest-python-api> │ Cannot start new unlicensed Symbolica instance since there is already another one running on the machine. │
  932. 29.94 s gammaloop-nextest-python-api> └───────────────────────────────────────────────────────────────────────────────────────────────────────────┘
  933. 29.94 s gammaloop-nextest-python-api>
  934. 29.94 s gammaloop-nextest-python-api> stderr:
  935. 29.94 s gammaloop-nextest-python-api> ┌───────────────────────────────────┐
  936. 29.94 s gammaloop-nextest-python-api> │ The Symbolica license has expired │
  937. 29.94 s gammaloop-nextest-python-api> └───────────────────────────────────┘
  938. 29.94 s gammaloop-nextest-python-api> [2026-09-01 22:08:48.097] @gammaloop_api::se... INFO : Running command import model sm-default
  939. 29.94 s gammaloop-nextest-python-api> [2026-09-01 22:08:48.097] @import::model INFO : Loading built-in JSON model sm-default
  940. 29.94 s gammaloop-nextest-python-api> [2026-09-01 22:08:48.108] @gammaloop_api::se... INFO : Running command set default-runtime kv kinematics.externals='{"type":"constant","data":{"momenta":[[32.0,0.0,0.0,32.0],[32.0,0.0,0.0,-32.0]],"helicities":[1,1]}}'
  941. 29.94 s gammaloop-nextest-python-api> [2026-09-01 22:08:48.109] @gammaloop_api::se... INFO : Running command set default-runtime kv subtraction.disable_threshold_subtraction=true
  942. 29.94 s gammaloop-nextest-python-api> [2026-09-01 22:08:48.110] @gammaloop_api::se... INFO : Running command generate xs e+ e- > d d~ g | e- a d g QED^2==4 [{{2}} QCD=0] --numerator-grouping group_identical_graphs_up_to_sign --clear-existing-processes --only-diagrams
  943. 29.94 s gammaloop-nextest-python-api> [2026-09-01 22:08:48.252] @commands::generate INFO : Generated cross-section 2 graphs.
  944. 29.94 s gammaloop-nextest-python-api> [2026-09-01 22:08:48.253] @commands::generate INFO : Only diagram generation was requested, skipping integrand generation. You can generate integrands later using the 'generate existing <options>' command.
  945. 29.94 s gammaloop-nextest-python-api> [2026-09-01 22:08:48.253] @gammaloop_api::se... INFO : Running command generate
  946. 29.94 s gammaloop-nextest-python-api>
  947. 29.94 s gammaloop-nextest-python-api>
  948. 29.94 s gammaloop-nextest-python-api> Location:
  949. 29.94 s gammaloop-nextest-python-api> tests/tests/test_python_api.rs:157:20
  950. 29.94 s gammaloop-nextest-python-api> =========================================
  951. 29.98 s error: Cannot build '/nix/store/271q8fjm505dyqck3n8ihm4f8zacvzmd-gammaloop-nextest-python-api.drv'.
  952. 29.98 s Reason: builder failed with exit code 100.
  953. 29.98 s Output paths:
  954. 29.98 s /nix/store/6s7gh3jbpmvcgzp68k39cvm0g23p6wcs-gammaloop-nextest-python-api
  955. 29.98 s Last 925 log lines:
  956. 29.98 s > Extracting 1 binary, 1 build script output directory, and 3 linked paths to /build/nextest-archive-q2wEwv
  957. 29.98 s > Extracted 18 files to /build/nextest-archive-q2wEwv in 0.06s
  958. 29.98 s > ------------
  959. 29.98 s > Nextest run ID adce777b-012b-47a5-8a29-5196eeae1db1 with nextest profile: ci_gammaloop
  960. 29.98 s > Starting 5 tests across 1 binary
  961. 29.98 s > FAIL [ 0.111s] (1/5) gammaloop-integration-tests::test_python_api python_evaluate_samples_batch_and_momentum_space_have_expected_shape
  962. 29.98 s > stdout ---
  963. 29.98 s >
  964. 29.98 s > running 1 test
  965. 29.98 s > test python_evaluate_samples_batch_and_momentum_space_have_expected_shape ... FAILED
  966. 29.98 s >
  967. 29.98 s > failures:
  968. 29.98 s >
  969. 29.98 s > failures:
  970. 29.98 s > python_evaluate_samples_batch_and_momentum_space_have_expected_shape
  971. 29.98 s >
  972. 29.98 s > test result: FAILED. 0 passed; 1 failed; 0 ignored; 0 measured; 4 filtered out; finished in 0.11s
  973. 29.98 s >
  974. 29.98 s > stderr ---
  975. 29.98 s > Error: Python API test subprocess failed.
  976. 29.98 s > stdout:
  977. 29.98 s > ┌────────────────────────────────────────────────────────┐
  978. 29.98 s > │ You are running a restricted Symbolica instance. │
  979. 29.98 s > │ │
  980. 29.98 s > │ This mode is only permitted for non-commercial use and │
  981. 29.98 s > │ is limited to one instance and core per machine. │
  982. 29.98 s > │ │
  983. 29.98 s > │ Hobbyists can easily acquire a free license key │
  984. 29.98 s > │ that unlocks all cores and removes this banner: │
  985. 29.98 s > │ │
  986. 29.98 s > │ from symbolica import * │
  987. 29.98 s > │ request_hobbyist_license('YOUR_NAME', 'YOUR_EMAIL') │
  988. 29.98 s > │ │
  989. 29.98 s > │ All other users can obtain a free 30-day trial key: │
  990. 29.98 s > │ │
  991. 29.98 s > │ from symbolica import * │
  992. 29.98 s > │ request_trial_license('NAME', 'EMAIL', 'EMPLOYER') │
  993. 29.98 s > │ │
  994. 29.98 s > │ See https://symbolica.io/docs/get_started.html#license │
  995. 29.98 s > └────────────────────────────────────────────────────────┘
  996. 29.98 s > ┌───────────────────────────────────────────────────────────────────────────────────────────────────────────┐
  997. 29.98 s > │ Cannot start new unlicensed Symbolica instance since there is already another one running on the machine. │
  998. 29.98 s > └───────────────────────────────────────────────────────────────────────────────────────────────────────────┘
  999. 29.98 s >
  1000. 29.98 s > stderr:
  1001. 29.98 s > ┌───────────────────────────────────┐
  1002. 29.98 s > │ The Symbolica license has expired │
  1003. 29.98 s > └───────────────────────────────────┘
  1004. 29.98 s >
  1005. 29.98 s >
  1006. 29.98 s > Location:
  1007. 29.98 s > tests/tests/test_python_api.rs:157:20
  1008. 29.98 s >
  1009. 29.98 s > FAIL [ 0.121s] (2/5) gammaloop-integration-tests::test_python_api python_session_getters_return_live_toml_and_command_blocks
  1010. 29.98 s > stdout ---
  1011. 29.98 s >
  1012. 29.98 s > running 1 test
  1013. 29.98 s > test python_session_getters_return_live_toml_and_command_blocks ... FAILED
  1014. 29.98 s >
  1015. 29.98 s > failures:
  1016. 29.98 s >
  1017. 29.98 s > failures:
  1018. 29.98 s > python_session_getters_return_live_toml_and_command_blocks
  1019. 29.98 s >
  1020. 29.98 s > test result: FAILED. 0 passed; 1 failed; 0 ignored; 0 measured; 4 filtered out; finished in 0.12s
  1021. 29.98 s >
  1022. 29.98 s > stderr ---
  1023. 29.98 s > Error: Python API test subprocess failed.
  1024. 29.98 s > stdout:
  1025. 29.98 s > ┌────────────────────────────────────────────────────────┐
  1026. 29.98 s > │ You are running a restricted Symbolica instance. │
  1027. 29.98 s > │ │
  1028. 29.98 s > │ This mode is only permitted for non-commercial use and │
  1029. 29.98 s > │ is limited to one instance and core per machine. │
  1030. 29.98 s > │ │
  1031. 29.98 s > │ Hobbyists can easily acquire a free license key │
  1032. 29.98 s > │ that unlocks all cores and removes this banner: │
  1033. 29.98 s > │ │
  1034. 29.98 s > │ from symbolica import * │
  1035. 29.98 s > │ request_hobbyist_license('YOUR_NAME', 'YOUR_EMAIL') │
  1036. 29.98 s > │ │
  1037. 29.98 s > │ All other users can obtain a free 30-day trial key: │
  1038. 29.98 s > │ │
  1039. 29.98 s > │ from symbolica import * │
  1040. 29.98 s > │ request_trial_license('NAME', 'EMAIL', 'EMPLOYER') │
  1041. 29.98 s > │ │
  1042. 29.98 s > │ See https://symbolica.io/docs/get_started.html#license │
  1043. 29.98 s > └────────────────────────────────────────────────────────┘
  1044. 29.98 s > ┌───────────────────────────────────────────────────────────────────────────────────────────────────────────┐
  1045. 29.98 s > │ Cannot start new unlicensed Symbolica instance since there is already another one running on the machine. │
  1046. 29.98 s > └───────────────────────────────────────────────────────────────────────────────────────────────────────────┘
  1047. 29.98 s >
  1048. 29.98 s > stderr:
  1049. 29.98 s > ┌───────────────────────────────────┐
  1050. 29.98 s > │ The Symbolica license has expired │
  1051. 29.98 s > └───────────────────────────────────┘
  1052. 29.98 s >
  1053. 29.98 s >
  1054. 29.98 s > Location:
  1055. 29.98 s > tests/tests/test_python_api.rs:157:20
  1056. 29.98 s >
  1057. 29.98 s > FAIL [ 0.121s] (3/5) gammaloop-integration-tests::test_python_api python_evaluate_sample_honors_generate_events_and_observable_snapshots
  1058. 29.98 s > stdout ---
  1059. 29.98 s >
  1060. 29.98 s > running 1 test
  1061. 29.98 s > test python_evaluate_sample_honors_generate_events_and_observable_snapshots ... FAILED
  1062. 29.98 s >
  1063. 29.98 s > failures:
  1064. 29.98 s >
  1065. 29.98 s > failures:
  1066. 29.98 s > python_evaluate_sample_honors_generate_events_and_observable_snapshots
  1067. 29.98 s >
  1068. 29.98 s > test result: FAILED. 0 passed; 1 failed; 0 ignored; 0 measured; 4 filtered out; finished in 0.12s
  1069. 29.98 s >
  1070. 29.98 s > stderr ---
  1071. 29.98 s > Error: Python API test subprocess failed.
  1072. 29.98 s > stdout:
  1073. 29.98 s > ┌────────────────────────────────────────────────────────┐
  1074. 29.98 s > │ You are running a restricted Symbolica instance. │
  1075. 29.98 s > │ │
  1076. 29.98 s > │ This mode is only permitted for non-commercial use and │
  1077. 29.98 s > │ is limited to one instance and core per machine. │
  1078. 29.98 s > │ │
  1079. 29.98 s > │ Hobbyists can easily acquire a free license key │
  1080. 29.98 s > │ that unlocks all cores and removes this banner: │
  1081. 29.98 s > │ │
  1082. 29.98 s > │ from symbolica import * │
  1083. 29.98 s > │ request_hobbyist_license('YOUR_NAME', 'YOUR_EMAIL') │
  1084. 29.98 s > │ │
  1085. 29.98 s > │ All other users can obtain a free 30-day trial key: │
  1086. 29.98 s > │ │
  1087. 29.98 s > │ from symbolica import * │
  1088. 29.98 s > │ request_trial_license('NAME', 'EMAIL', 'EMPLOYER') │
  1089. 29.98 s > │ │
  1090. 29.98 s > │ See https://symbolica.io/docs/get_started.html#license │
  1091. 29.98 s > └────────────────────────────────────────────────────────┘
  1092. 29.98 s > ┌───────────────────────────────────────────────────────────────────────────────────────────────────────────┐
  1093. 29.98 s > │ Cannot start new unlicensed Symbolica instance since there is already another one running on the machine. │
  1094. 29.98 s > └───────────────────────────────────────────────────────────────────────────────────────────────────────────┘
  1095. 29.98 s >
  1096. 29.98 s > stderr:
  1097. 29.98 s > ┌───────────────────────────────────┐
  1098. 29.98 s > │ The Symbolica license has expired │
  1099. 29.98 s > └───────────────────────────────────┘
  1100. 29.98 s >
  1101. 29.98 s >
  1102. 29.98 s > Location:
  1103. 29.98 s > tests/tests/test_python_api.rs:157:20
  1104. 29.98 s >
  1105. 29.98 s > FAIL [ 0.212s] (4/5) gammaloop-integration-tests::test_python_api python_settings_wrappers_expose_nested_runtime_and_global_settings
  1106. 29.98 s > stdout ---
  1107. 29.98 s >
  1108. 29.98 s > running 1 test
  1109. 29.98 s > test python_settings_wrappers_expose_nested_runtime_and_global_settings ... FAILED
  1110. 29.98 s >
  1111. 29.98 s > failures:
  1112. 29.98 s >
  1113. 29.98 s > failures:
  1114. 29.98 s > python_settings_wrappers_expose_nested_runtime_and_global_settings
  1115. 29.98 s >
  1116. 29.98 s > test result: FAILED. 0 passed; 1 failed; 0 ignored; 0 measured; 4 filtered out; finished in 0.21s
  1117. 29.98 s >
  1118. 29.98 s > stderr ---
  1119. 29.98 s > Error: Python API test subprocess failed.
  1120. 29.98 s > stdout:
  1121. 29.98 s > ┌────────────────────────────────────────────────────────┐
  1122. 29.98 s > │ You are running a restricted Symbolica instance. │
  1123. 29.98 s > │ │
  1124. 29.98 s > │ This mode is only permitted for non-commercial use and │
  1125. 29.98 s > │ is limited to one instance and core per machine. │
  1126. 29.98 s > │ │
  1127. 29.98 s > │ Hobbyists can easily acquire a free license key │
  1128. 29.98 s > │ that unlocks all cores and removes this banner: │
  1129. 29.98 s > │ │
  1130. 29.98 s > │ from symbolica import * │
  1131. 29.98 s > │ request_hobbyist_license('YOUR_NAME', 'YOUR_EMAIL') │
  1132. 29.98 s > │ │
  1133. 29.98 s > │ All other users can obtain a free 30-day trial key: │
  1134. 29.98 s > │ │
  1135. 29.98 s > │ from symbolica import * │
  1136. 29.98 s > │ request_trial_license('NAME', 'EMAIL', 'EMPLOYER') │
  1137. 29.98 s > │ │
  1138. 29.98 s > │ See https://symbolica.io/docs/get_started.html#license │
  1139. 29.98 s > └────────────────────────────────────────────────────────┘
  1140. 29.98 s > ┌───────────────────────────────────────────────────────────────────────────────────────────────────────────┐
  1141. 29.98 s > │ Cannot start new unlicensed Symbolica instance since there is already another one running on the machine. │
  1142. 29.98 s > └───────────────────────────────────────────────────────────────────────────────────────────────────────────┘
  1143. 29.98 s >
  1144. 29.98 s > stderr:
  1145. 29.98 s > ┌───────────────────────────────────┐
  1146. 29.98 s > │ The Symbolica license has expired │
  1147. 29.98 s > └───────────────────────────────────┘
  1148. 29.98 s >
  1149. 29.98 s >
  1150. 29.98 s > Location:
  1151. 29.98 s > tests/tests/test_python_api.rs:157:20
  1152. 29.98 s >
  1153. 29.98 s > FAIL [ 0.295s] (5/5) gammaloop-integration-tests::test_python_api python_evaluate_sample_preserves_graph_grouping_and_incoming_pdgs
  1154. 29.98 s > stdout ---
  1155. 29.98 s >
  1156. 29.98 s > running 1 test
  1157. 29.98 s > test python_evaluate_sample_preserves_graph_grouping_and_incoming_pdgs ... FAILED
  1158. 29.98 s >
  1159. 29.98 s > failures:
  1160. 29.98 s >
  1161. 29.98 s > failures:
  1162. 29.98 s > python_evaluate_sample_preserves_graph_grouping_and_incoming_pdgs
  1163. 29.98 s >
  1164. 29.98 s > test result: FAILED. 0 passed; 1 failed; 0 ignored; 0 measured; 4 filtered out; finished in 0.29s
  1165. 29.98 s >
  1166. 29.98 s > stderr ---
  1167. 29.98 s > Error: Python API test subprocess failed.
  1168. 29.98 s > stdout:
  1169. 29.98 s > ┌────────────────────────────────────────────────────────┐
  1170. 29.98 s > │ You are running a restricted Symbolica instance. │
  1171. 29.98 s > │ │
  1172. 29.98 s > │ This mode is only permitted for non-commercial use and │
  1173. 29.98 s > │ is limited to one instance and core per machine. │
  1174. 29.98 s > │ │
  1175. 29.98 s > │ Hobbyists can easily acquire a free license key │
  1176. 29.98 s > │ that unlocks all cores and removes this banner: │
  1177. 29.98 s > │ │
  1178. 29.98 s > │ from symbolica import * │
  1179. 29.98 s > │ request_hobbyist_license('YOUR_NAME', 'YOUR_EMAIL') │
  1180. 29.98 s > │ │
  1181. 29.98 s > │ All other users can obtain a free 30-day trial key: │
  1182. 29.98 s > │ │
  1183. 29.98 s > │ from symbolica import * │
  1184. 29.98 s > │ request_trial_license('NAME', 'EMAIL', 'EMPLOYER') │
  1185. 29.98 s > │ │
  1186. 29.98 s > │ See https://symbolica.io/docs/get_started.html#license │
  1187. 29.98 s > └────────────────────────────────────────────────────────┘
  1188. 29.98 s > ┌───────────────────────────────────────────────────────────────────────────────────────────────────────────┐
  1189. 29.98 s > │ Cannot start new unlicensed Symbolica instance since there is already another one running on the machine. │
  1190. 29.98 s > └───────────────────────────────────────────────────────────────────────────────────────────────────────────┘
  1191. 29.98 s >
  1192. 29.98 s > stderr:
  1193. 29.98 s > ┌───────────────────────────────────┐
  1194. 29.98 s > │ The Symbolica license has expired │
  1195. 29.98 s > └───────────────────────────────────┘
  1196. 29.98 s > [2026-09-01 22:08:48.097] @gammaloop_api::se... INFO : Running command import model sm-default
  1197. 29.98 s > [2026-09-01 22:08:48.097] @import::model INFO : Loading built-in JSON model sm-default
  1198. 29.98 s > [2026-09-01 22:08:48.108] @gammaloop_api::se... INFO : Running command set default-runtime kv kinematics.externals='{"type":"constant","data":{"momenta":[[32.0,0.0,0.0,32.0],[32.0,0.0,0.0,-32.0]],"helicities":[1,1]}}'
  1199. 29.98 s > [2026-09-01 22:08:48.109] @gammaloop_api::se... INFO : Running command set default-runtime kv subtraction.disable_threshold_subtraction=true
  1200. 29.98 s > [2026-09-01 22:08:48.110] @gammaloop_api::se... INFO : Running command generate xs e+ e- > d d~ g | e- a d g QED^2==4 [{{2}} QCD=0] --numerator-grouping group_identical_graphs_up_to_sign --clear-existing-processes --only-diagrams
  1201. 29.98 s > [2026-09-01 22:08:48.252] @commands::generate INFO : Generated cross-section 2 graphs.
  1202. 29.98 s > [2026-09-01 22:08:48.253] @commands::generate INFO : Only diagram generation was requested, skipping integrand generation. You can generate integrands later using the 'generate existing <options>' command.
  1203. 29.98 s > [2026-09-01 22:08:48.253] @gammaloop_api::se... INFO : Running command generate
  1204. 29.98 s >
  1205. 29.98 s >
  1206. 29.98 s > Location:
  1207. 29.98 s > tests/tests/test_python_api.rs:157:20
  1208. 29.98 s >
  1209. 29.98 s > ------------
  1210. 29.98 s > Summary [ 0.296s] 5 tests run: 0 passed, 5 failed, 0 skipped
  1211. 29.98 s > FAIL [ 0.111s] (1/5) gammaloop-integration-tests::test_python_api python_evaluate_samples_batch_and_momentum_space_have_expected_shape
  1212. 29.98 s > stdout ---
  1213. 29.98 s >
  1214. 29.98 s > running 1 test
  1215. 29.98 s > test python_evaluate_samples_batch_and_momentum_space_have_expected_shape ... FAILED
  1216. 29.98 s >
  1217. 29.98 s > failures:
  1218. 29.98 s >
  1219. 29.98 s > failures:
  1220. 29.98 s > python_evaluate_samples_batch_and_momentum_space_have_expected_shape
  1221. 29.98 s >
  1222. 29.98 s > test result: FAILED. 0 passed; 1 failed; 0 ignored; 0 measured; 4 filtered out; finished in 0.11s
  1223. 29.98 s >
  1224. 29.98 s > stderr ---
  1225. 29.98 s > Error: Python API test subprocess failed.
  1226. 29.98 s > stdout:
  1227. 29.98 s > ┌────────────────────────────────────────────────────────┐
  1228. 29.98 s > │ You are running a restricted Symbolica instance. │
  1229. 29.98 s > │ │
  1230. 29.98 s > │ This mode is only permitted for non-commercial use and │
  1231. 29.98 s > │ is limited to one instance and core per machine. │
  1232. 29.98 s > │ │
  1233. 29.98 s > │ Hobbyists can easily acquire a free license key │
  1234. 29.98 s > │ that unlocks all cores and removes this banner: │
  1235. 29.98 s > │ │
  1236. 29.98 s > │ from symbolica import * │
  1237. 29.98 s > │ request_hobbyist_license('YOUR_NAME', 'YOUR_EMAIL') │
  1238. 29.98 s > │ │
  1239. 29.98 s > │ All other users can obtain a free 30-day trial key: │
  1240. 29.98 s > │ │
  1241. 29.98 s > │ from symbolica import * │
  1242. 29.98 s > │ request_trial_license('NAME', 'EMAIL', 'EMPLOYER') │
  1243. 29.98 s > │ │
  1244. 29.98 s > │ See https://symbolica.io/docs/get_started.html#license │
  1245. 29.98 s > └────────────────────────────────────────────────────────┘
  1246. 29.98 s > ┌───────────────────────────────────────────────────────────────────────────────────────────────────────────┐
  1247. 29.98 s > │ Cannot start new unlicensed Symbolica instance since there is already another one running on the machine. │
  1248. 29.98 s > └───────────────────────────────────────────────────────────────────────────────────────────────────────────┘
  1249. 29.98 s >
  1250. 29.98 s > stderr:
  1251. 29.98 s > ┌───────────────────────────────────┐
  1252. 29.98 s > │ The Symbolica license has expired │
  1253. 29.98 s > └───────────────────────────────────┘
  1254. 29.98 s >
  1255. 29.98 s >
  1256. 29.98 s > Location:
  1257. 29.98 s > tests/tests/test_python_api.rs:157:20
  1258. 29.98 s >
  1259. 29.98 s > FAIL [ 0.121s] (2/5) gammaloop-integration-tests::test_python_api python_session_getters_return_live_toml_and_command_blocks
  1260. 29.98 s > stdout ---
  1261. 29.98 s >
  1262. 29.98 s > running 1 test
  1263. 29.98 s > test python_session_getters_return_live_toml_and_command_blocks ... FAILED
  1264. 29.98 s >
  1265. 29.98 s > failures:
  1266. 29.98 s >
  1267. 29.98 s > failures:
  1268. 29.98 s > python_session_getters_return_live_toml_and_command_blocks
  1269. 29.98 s >
  1270. 29.98 s > test result: FAILED. 0 passed; 1 failed; 0 ignored; 0 measured; 4 filtered out; finished in 0.12s
  1271. 29.98 s >
  1272. 29.98 s > stderr ---
  1273. 29.98 s > Error: Python API test subprocess failed.
  1274. 29.98 s > stdout:
  1275. 29.98 s > ┌────────────────────────────────────────────────────────┐
  1276. 29.98 s > │ You are running a restricted Symbolica instance. │
  1277. 29.98 s > │ │
  1278. 29.98 s > │ This mode is only permitted for non-commercial use and │
  1279. 29.98 s > │ is limited to one instance and core per machine. │
  1280. 29.98 s > │ │
  1281. 29.98 s > │ Hobbyists can easily acquire a free license key │
  1282. 29.98 s > │ that unlocks all cores and removes this banner: │
  1283. 29.98 s > │ │
  1284. 29.98 s > │ from symbolica import * │
  1285. 29.98 s > │ request_hobbyist_license('YOUR_NAME', 'YOUR_EMAIL') │
  1286. 29.98 s > │ │
  1287. 29.98 s > │ All other users can obtain a free 30-day trial key: │
  1288. 29.98 s > │ │
  1289. 29.98 s > │ from symbolica import * │
  1290. 29.98 s > │ request_trial_license('NAME', 'EMAIL', 'EMPLOYER') │
  1291. 29.98 s > │ │
  1292. 29.98 s > │ See https://symbolica.io/docs/get_started.html#license │
  1293. 29.98 s > └────────────────────────────────────────────────────────┘
  1294. 29.98 s > ┌───────────────────────────────────────────────────────────────────────────────────────────────────────────┐
  1295. 29.98 s > │ Cannot start new unlicensed Symbolica instance since there is already another one running on the machine. │
  1296. 29.98 s > └───────────────────────────────────────────────────────────────────────────────────────────────────────────┘
  1297. 29.98 s >
  1298. 29.98 s > stderr:
  1299. 29.98 s > ┌───────────────────────────────────┐
  1300. 29.98 s > │ The Symbolica license has expired │
  1301. 29.98 s > └───────────────────────────────────┘
  1302. 29.98 s >
  1303. 29.98 s >
  1304. 29.98 s > Location:
  1305. 29.98 s > tests/tests/test_python_api.rs:157:20
  1306. 29.98 s >
  1307. 29.98 s > FAIL [ 0.121s] (3/5) gammaloop-integration-tests::test_python_api python_evaluate_sample_honors_generate_events_and_observable_snapshots
  1308. 29.98 s > stdout ---
  1309. 29.98 s >
  1310. 29.98 s > running 1 test
  1311. 29.98 s > test python_evaluate_sample_honors_generate_events_and_observable_snapshots ... FAILED
  1312. 29.98 s >
  1313. 29.98 s > failures:
  1314. 29.98 s >
  1315. 29.98 s > failures:
  1316. 29.98 s > python_evaluate_sample_honors_generate_events_and_observable_snapshots
  1317. 29.98 s >
  1318. 29.98 s > test result: FAILED. 0 passed; 1 failed; 0 ignored; 0 measured; 4 filtered out; finished in 0.12s
  1319. 29.98 s >
  1320. 29.98 s > stderr ---
  1321. 29.98 s > Error: Python API test subprocess failed.
  1322. 29.98 s > stdout:
  1323. 29.98 s > ┌────────────────────────────────────────────────────────┐
  1324. 29.98 s > │ You are running a restricted Symbolica instance. │
  1325. 29.98 s > │ │
  1326. 29.98 s > │ This mode is only permitted for non-commercial use and │
  1327. 29.98 s > │ is limited to one instance and core per machine. │
  1328. 29.98 s > │ │
  1329. 29.98 s > │ Hobbyists can easily acquire a free license key │
  1330. 29.98 s > │ that unlocks all cores and removes this banner: │
  1331. 29.98 s > │ │
  1332. 29.98 s > │ from symbolica import * │
  1333. 29.98 s > │ request_hobbyist_license('YOUR_NAME', 'YOUR_EMAIL') │
  1334. 29.98 s > │ │
  1335. 29.98 s > │ All other users can obtain a free 30-day trial key: │
  1336. 29.98 s > │ │
  1337. 29.98 s > │ from symbolica import * │
  1338. 29.98 s > │ request_trial_license('NAME', 'EMAIL', 'EMPLOYER') │
  1339. 29.98 s > │ │
  1340. 29.98 s > │ See https://symbolica.io/docs/get_started.html#license │
  1341. 29.98 s > └────────────────────────────────────────────────────────┘
  1342. 29.98 s > ┌───────────────────────────────────────────────────────────────────────────────────────────────────────────┐
  1343. 29.98 s > │ Cannot start new unlicensed Symbolica instance since there is already another one running on the machine. │
  1344. 29.98 s > └───────────────────────────────────────────────────────────────────────────────────────────────────────────┘
  1345. 29.98 s >
  1346. 29.98 s > stderr:
  1347. 29.98 s > ┌───────────────────────────────────┐
  1348. 29.98 s > │ The Symbolica license has expired │
  1349. 29.98 s > └───────────────────────────────────┘
  1350. 29.98 s >
  1351. 29.98 s >
  1352. 29.98 s > Location:
  1353. 29.98 s > tests/tests/test_python_api.rs:157:20
  1354. 29.98 s >
  1355. 29.98 s > FAIL [ 0.212s] (4/5) gammaloop-integration-tests::test_python_api python_settings_wrappers_expose_nested_runtime_and_global_settings
  1356. 29.98 s > stdout ---
  1357. 29.98 s >
  1358. 29.98 s > running 1 test
  1359. 29.98 s > test python_settings_wrappers_expose_nested_runtime_and_global_settings ... FAILED
  1360. 29.98 s >
  1361. 29.98 s > failures:
  1362. 29.98 s >
  1363. 29.98 s > failures:
  1364. 29.98 s > python_settings_wrappers_expose_nested_runtime_and_global_settings
  1365. 29.98 s >
  1366. 29.98 s > test result: FAILED. 0 passed; 1 failed; 0 ignored; 0 measured; 4 filtered out; finished in 0.21s
  1367. 29.98 s >
  1368. 29.98 s > stderr ---
  1369. 29.98 s > Error: Python API test subprocess failed.
  1370. 29.98 s > stdout:
  1371. 29.98 s > ┌────────────────────────────────────────────────────────┐
  1372. 29.98 s > │ You are running a restricted Symbolica instance. │
  1373. 29.98 s > │ │
  1374. 29.98 s > │ This mode is only permitted for non-commercial use and │
  1375. 29.98 s > │ is limited to one instance and core per machine. │
  1376. 29.98 s > │ │
  1377. 29.98 s > │ Hobbyists can easily acquire a free license key │
  1378. 29.98 s > │ that unlocks all cores and removes this banner: │
  1379. 29.98 s > │ │
  1380. 29.98 s > │ from symbolica import * │
  1381. 29.98 s > │ request_hobbyist_license('YOUR_NAME', 'YOUR_EMAIL') │
  1382. 29.98 s > │ │
  1383. 29.98 s > │ All other users can obtain a free 30-day trial key: │
  1384. 29.98 s > │ │
  1385. 29.98 s > │ from symbolica import * │
  1386. 29.98 s > │ request_trial_license('NAME', 'EMAIL', 'EMPLOYER') │
  1387. 29.98 s > │ │
  1388. 29.98 s > │ See https://symbolica.io/docs/get_started.html#license │
  1389. 29.98 s > └────────────────────────────────────────────────────────┘
  1390. 29.98 s > ┌───────────────────────────────────────────────────────────────────────────────────────────────────────────┐
  1391. 29.98 s > │ Cannot start new unlicensed Symbolica instance since there is already another one running on the machine. │
  1392. 29.98 s > └───────────────────────────────────────────────────────────────────────────────────────────────────────────┘
  1393. 29.98 s >
  1394. 29.98 s > stderr:
  1395. 29.98 s > ┌───────────────────────────────────┐
  1396. 29.98 s > │ The Symbolica license has expired │
  1397. 29.98 s > └───────────────────────────────────┘
  1398. 29.98 s >
  1399. 29.98 s >
  1400. 29.98 s > Location:
  1401. 29.98 s > tests/tests/test_python_api.rs:157:20
  1402. 29.98 s >
  1403. 29.98 s > FAIL [ 0.295s] (5/5) gammaloop-integration-tests::test_python_api python_evaluate_sample_preserves_graph_grouping_and_incoming_pdgs
  1404. 29.98 s > stdout ---
  1405. 29.98 s >
  1406. 29.98 s > running 1 test
  1407. 29.98 s > test python_evaluate_sample_preserves_graph_grouping_and_incoming_pdgs ... FAILED
  1408. 29.98 s >
  1409. 29.98 s > failures:
  1410. 29.98 s >
  1411. 29.98 s > failures:
  1412. 29.98 s > python_evaluate_sample_preserves_graph_grouping_and_incoming_pdgs
  1413. 29.98 s >
  1414. 29.98 s > test result: FAILED. 0 passed; 1 failed; 0 ignored; 0 measured; 4 filtered out; finished in 0.29s
  1415. 29.98 s >
  1416. 29.98 s > stderr ---
  1417. 29.98 s > Error: Python API test subprocess failed.
  1418. 29.98 s > stdout:
  1419. 29.98 s > ┌────────────────────────────────────────────────────────┐
  1420. 29.98 s > │ You are running a restricted Symbolica instance. │
  1421. 29.98 s > │ │
  1422. 29.98 s > │ This mode is only permitted for non-commercial use and │
  1423. 29.98 s > │ is limited to one instance and core per machine. │
  1424. 29.98 s > │ │
  1425. 29.98 s > │ Hobbyists can easily acquire a free license key │
  1426. 29.98 s > │ that unlocks all cores and removes this banner: │
  1427. 29.98 s > │ │
  1428. 29.98 s > │ from symbolica import * │
  1429. 29.98 s > │ request_hobbyist_license('YOUR_NAME', 'YOUR_EMAIL') │
  1430. 29.98 s > │ │
  1431. 29.98 s > │ All other users can obtain a free 30-day trial key: │
  1432. 29.98 s > │ │
  1433. 29.98 s > │ from symbolica import * │
  1434. 29.98 s > │ request_trial_license('NAME', 'EMAIL', 'EMPLOYER') │
  1435. 29.98 s > │ │
  1436. 29.98 s > │ See https://symbolica.io/docs/get_started.html#license │
  1437. 29.98 s > └────────────────────────────────────────────────────────┘
  1438. 29.98 s > ┌───────────────────────────────────────────────────────────────────────────────────────────────────────────┐
  1439. 29.98 s > │ Cannot start new unlicensed Symbolica instance since there is already another one running on the machine. │
  1440. 29.98 s > └───────────────────────────────────────────────────────────────────────────────────────────────────────────┘
  1441. 29.98 s >
  1442. 29.98 s > stderr:
  1443. 29.98 s > ┌───────────────────────────────────┐
  1444. 29.98 s > │ The Symbolica license has expired │
  1445. 29.98 s > └───────────────────────────────────┘
  1446. 29.98 s > [2026-09-01 22:08:48.097] @gammaloop_api::se... INFO : Running command import model sm-default
  1447. 29.98 s > [2026-09-01 22:08:48.097] @import::model INFO : Loading built-in JSON model sm-default
  1448. 29.98 s > [2026-09-01 22:08:48.108] @gammaloop_api::se... INFO : Running command set default-runtime kv kinematics.externals='{"type":"constant","data":{"momenta":[[32.0,0.0,0.0,32.0],[32.0,0.0,0.0,-32.0]],"helicities":[1,1]}}'
  1449. 29.98 s > [2026-09-01 22:08:48.109] @gammaloop_api::se... INFO : Running command set default-runtime kv subtraction.disable_threshold_subtraction=true
  1450. 29.98 s > [2026-09-01 22:08:48.110] @gammaloop_api::se... INFO : Running command generate xs e+ e- > d d~ g | e- a d g QED^2==4 [{{2}} QCD=0] --numerator-grouping group_identical_graphs_up_to_sign --clear-existing-processes --only-diagrams
  1451. 29.98 s > [2026-09-01 22:08:48.252] @commands::generate INFO : Generated cross-section 2 graphs.
  1452. 29.98 s > [2026-09-01 22:08:48.253] @commands::generate INFO : Only diagram generation was requested, skipping integrand generation. You can generate integrands later using the 'generate existing <options>' command.
  1453. 29.98 s > [2026-09-01 22:08:48.253] @gammaloop_api::se... INFO : Running command generate
  1454. 29.98 s >
  1455. 29.98 s >
  1456. 29.98 s > Location:
  1457. 29.98 s > tests/tests/test_python_api.rs:157:20
  1458. 29.98 s >
  1459. 29.98 s > error: test run failed
  1460. 29.98 s >
  1461. 29.98 s > ========== nextest test summary ==========
  1462. 29.98 s > report: target/nextest/ci_gammaloop/junit.xml
  1463. 29.98 s > tests: 5, failures: 5, errors: 0
  1464. 29.98 s >
  1465. 29.98 s > 1. gammaloop-integration-tests::test_python_api::python_evaluate_samples_batch_and_momentum_space_have_expected_shape
  1466. 29.98 s > failure: test failure with exit code 101
  1467. 29.98 s > Error: Python API test subprocess failed.
  1468. 29.98 s > stdout:
  1469. 29.98 s > ┌────────────────────────────────────────────────────────┐
  1470. 29.98 s > │ You are running a restricted Symbolica instance. │
  1471. 29.98 s > │ │
  1472. 29.98 s > │ This mode is only permitted for non-commercial use and │
  1473. 29.98 s > │ is limited to one instance and core per machine. │
  1474. 29.98 s > │ │
  1475. 29.98 s > │ Hobbyists can easily acquire a free license key │
  1476. 29.98 s > │ that unlocks all cores and removes this banner: │
  1477. 29.98 s > │ │
  1478. 29.98 s > │ from symbolica import * │
  1479. 29.98 s > │ request_hobbyist_license('YOUR_NAME', 'YOUR_EMAIL') │
  1480. 29.98 s > │ │
  1481. 29.98 s > │ All other users can obtain a free 30-day trial key: │
  1482. 29.98 s > │ │
  1483. 29.98 s > │ from symbolica import * │
  1484. 29.98 s > │ request_trial_license('NAME', 'EMAIL', 'EMPLOYER') │
  1485. 29.98 s > │ │
  1486. 29.98 s > │ See https://symbolica.io/docs/get_started.html#license │
  1487. 29.98 s > └────────────────────────────────────────────────────────┘
  1488. 29.98 s > ┌───────────────────────────────────────────────────────────────────────────────────────────────────────────┐
  1489. 29.98 s > │ Cannot start new unlicensed Symbolica instance since there is already another one running on the machine. │
  1490. 29.98 s > └───────────────────────────────────────────────────────────────────────────────────────────────────────────┘
  1491. 29.98 s >
  1492. 29.98 s > stderr:
  1493. 29.98 s > ┌───────────────────────────────────┐
  1494. 29.98 s > │ The Symbolica license has expired │
  1495. 29.98 s > └───────────────────────────────────┘
  1496. 29.98 s >
  1497. 29.98 s >
  1498. 29.98 s > Location:
  1499. 29.98 s > tests/tests/test_python_api.rs:157:20
  1500. 29.98 s > system-out
  1501. 29.98 s > running 1 test
  1502. 29.98 s > test python_evaluate_samples_batch_and_momentum_space_have_expected_shape ... FAILED
  1503. 29.98 s >
  1504. 29.98 s > failures:
  1505. 29.98 s >
  1506. 29.98 s > failures:
  1507. 29.98 s > python_evaluate_samples_batch_and_momentum_space_have_expected_shape
  1508. 29.98 s >
  1509. 29.98 s > test result: FAILED. 0 passed; 1 failed; 0 ignored; 0 measured; 4 filtered out; finished in 0.11s
  1510. 29.98 s > system-err
  1511. 29.98 s > Error: Python API test subprocess failed.
  1512. 29.98 s > stdout:
  1513. 29.98 s > ┌────────────────────────────────────────────────────────┐
  1514. 29.98 s > │ You are running a restricted Symbolica instance. │
  1515. 29.98 s > │ │
  1516. 29.98 s > │ This mode is only permitted for non-commercial use and │
  1517. 29.98 s > │ is limited to one instance and core per machine. │
  1518. 29.98 s > │ │
  1519. 29.98 s > │ Hobbyists can easily acquire a free license key │
  1520. 29.98 s > │ that unlocks all cores and removes this banner: │
  1521. 29.98 s > │ │
  1522. 29.98 s > │ from symbolica import * │
  1523. 29.98 s > │ request_hobbyist_license('YOUR_NAME', 'YOUR_EMAIL') │
  1524. 29.98 s > │ │
  1525. 29.98 s > │ All other users can obtain a free 30-day trial key: │
  1526. 29.98 s > │ │
  1527. 29.98 s > │ from symbolica import * │
  1528. 29.98 s > │ request_trial_license('NAME', 'EMAIL', 'EMPLOYER') │
  1529. 29.98 s > │ │
  1530. 29.98 s > │ See https://symbolica.io/docs/get_started.html#license │
  1531. 29.98 s > └────────────────────────────────────────────────────────┘
  1532. 29.98 s > ┌───────────────────────────────────────────────────────────────────────────────────────────────────────────┐
  1533. 29.98 s > │ Cannot start new unlicensed Symbolica instance since there is already another one running on the machine. │
  1534. 29.98 s > └───────────────────────────────────────────────────────────────────────────────────────────────────────────┘
  1535. 29.98 s >
  1536. 29.98 s > stderr:
  1537. 29.98 s > ┌───────────────────────────────────┐
  1538. 29.98 s > │ The Symbolica license has expired │
  1539. 29.98 s > └───────────────────────────────────┘
  1540. 29.98 s >
  1541. 29.98 s >
  1542. 29.98 s > Location:
  1543. 29.98 s > tests/tests/test_python_api.rs:157:20
  1544. 29.98 s >
  1545. 29.98 s > 2. gammaloop-integration-tests::test_python_api::python_session_getters_return_live_toml_and_command_blocks
  1546. 29.98 s > failure: test failure with exit code 101
  1547. 29.98 s > Error: Python API test subprocess failed.
  1548. 29.98 s > stdout:
  1549. 29.98 s > ┌────────────────────────────────────────────────────────┐
  1550. 29.98 s > │ You are running a restricted Symbolica instance. │
  1551. 29.98 s > │ │
  1552. 29.98 s > │ This mode is only permitted for non-commercial use and │
  1553. 29.98 s > │ is limited to one instance and core per machine. │
  1554. 29.98 s > │ │
  1555. 29.98 s > │ Hobbyists can easily acquire a free license key │
  1556. 29.98 s > │ that unlocks all cores and removes this banner: │
  1557. 29.98 s > │ │
  1558. 29.98 s > │ from symbolica import * │
  1559. 29.98 s > │ request_hobbyist_license('YOUR_NAME', 'YOUR_EMAIL') │
  1560. 29.98 s > │ │
  1561. 29.98 s > │ All other users can obtain a free 30-day trial key: │
  1562. 29.98 s > │ │
  1563. 29.98 s > │ from symbolica import * │
  1564. 29.98 s > │ request_trial_license('NAME', 'EMAIL', 'EMPLOYER') │
  1565. 29.98 s > │ │
  1566. 29.98 s > │ See https://symbolica.io/docs/get_started.html#license │
  1567. 29.98 s > └────────────────────────────────────────────────────────┘
  1568. 29.98 s > ┌───────────────────────────────────────────────────────────────────────────────────────────────────────────┐
  1569. 29.98 s > │ Cannot start new unlicensed Symbolica instance since there is already another one running on the machine. │
  1570. 29.98 s > └───────────────────────────────────────────────────────────────────────────────────────────────────────────┘
  1571. 29.98 s >
  1572. 29.98 s > stderr:
  1573. 29.98 s > ┌───────────────────────────────────┐
  1574. 29.98 s > │ The Symbolica license has expired │
  1575. 29.98 s > └───────────────────────────────────┘
  1576. 29.98 s >
  1577. 29.98 s >
  1578. 29.98 s > Location:
  1579. 29.98 s > tests/tests/test_python_api.rs:157:20
  1580. 29.98 s > system-out
  1581. 29.98 s > running 1 test
  1582. 29.98 s > test python_session_getters_return_live_toml_and_command_blocks ... FAILED
  1583. 29.98 s >
  1584. 29.98 s > failures:
  1585. 29.98 s >
  1586. 29.98 s > failures:
  1587. 29.98 s > python_session_getters_return_live_toml_and_command_blocks
  1588. 29.98 s >
  1589. 29.98 s > test result: FAILED. 0 passed; 1 failed; 0 ignored; 0 measured; 4 filtered out; finished in 0.12s
  1590. 29.98 s > system-err
  1591. 29.98 s > Error: Python API test subprocess failed.
  1592. 29.98 s > stdout:
  1593. 29.98 s > ┌────────────────────────────────────────────────────────┐
  1594. 29.98 s > │ You are running a restricted Symbolica instance. │
  1595. 29.98 s > │ │
  1596. 29.98 s > │ This mode is only permitted for non-commercial use and │
  1597. 29.98 s > │ is limited to one instance and core per machine. │
  1598. 29.98 s > │ │
  1599. 29.98 s > │ Hobbyists can easily acquire a free license key │
  1600. 29.98 s > │ that unlocks all cores and removes this banner: │
  1601. 29.98 s > │ │
  1602. 29.98 s > │ from symbolica import * │
  1603. 29.98 s > │ request_hobbyist_license('YOUR_NAME', 'YOUR_EMAIL') │
  1604. 29.98 s > │ │
  1605. 29.98 s > │ All other users can obtain a free 30-day trial key: │
  1606. 29.98 s > │ │
  1607. 29.98 s > │ from symbolica import * │
  1608. 29.98 s > │ request_trial_license('NAME', 'EMAIL', 'EMPLOYER') │
  1609. 29.98 s > │ │
  1610. 29.98 s > │ See https://symbolica.io/docs/get_started.html#license │
  1611. 29.98 s > └────────────────────────────────────────────────────────┘
  1612. 29.98 s > ┌───────────────────────────────────────────────────────────────────────────────────────────────────────────┐
  1613. 29.98 s > │ Cannot start new unlicensed Symbolica instance since there is already another one running on the machine. │
  1614. 29.98 s > └───────────────────────────────────────────────────────────────────────────────────────────────────────────┘
  1615. 29.98 s >
  1616. 29.98 s > stderr:
  1617. 29.98 s > ┌───────────────────────────────────┐
  1618. 29.98 s > │ The Symbolica license has expired │
  1619. 29.98 s > └───────────────────────────────────┘
  1620. 29.98 s >
  1621. 29.98 s >
  1622. 29.98 s > Location:
  1623. 29.98 s > tests/tests/test_python_api.rs:157:20
  1624. 29.98 s >
  1625. 29.98 s > 3. gammaloop-integration-tests::test_python_api::python_evaluate_sample_honors_generate_events_and_observable_snapshots
  1626. 29.98 s > failure: test failure with exit code 101
  1627. 29.98 s > Error: Python API test subprocess failed.
  1628. 29.98 s > stdout:
  1629. 29.98 s > ┌────────────────────────────────────────────────────────┐
  1630. 29.98 s > │ You are running a restricted Symbolica instance. │
  1631. 29.98 s > │ │
  1632. 29.98 s > │ This mode is only permitted for non-commercial use and │
  1633. 29.98 s > │ is limited to one instance and core per machine. │
  1634. 29.98 s > │ │
  1635. 29.98 s > │ Hobbyists can easily acquire a free license key │
  1636. 29.98 s > │ that unlocks all cores and removes this banner: │
  1637. 29.98 s > │ │
  1638. 29.98 s > │ from symbolica import * │
  1639. 29.98 s > │ request_hobbyist_license('YOUR_NAME', 'YOUR_EMAIL') │
  1640. 29.98 s > │ │
  1641. 29.98 s > │ All other users can obtain a free 30-day trial key: │
  1642. 29.98 s > │ │
  1643. 29.98 s > │ from symbolica import * │
  1644. 29.98 s > │ request_trial_license('NAME', 'EMAIL', 'EMPLOYER') │
  1645. 29.98 s > │ │
  1646. 29.98 s > │ See https://symbolica.io/docs/get_started.html#license │
  1647. 29.98 s > └────────────────────────────────────────────────────────┘
  1648. 29.98 s > ┌───────────────────────────────────────────────────────────────────────────────────────────────────────────┐
  1649. 29.98 s > │ Cannot start new unlicensed Symbolica instance since there is already another one running on the machine. │
  1650. 29.98 s > └───────────────────────────────────────────────────────────────────────────────────────────────────────────┘
  1651. 29.98 s >
  1652. 29.98 s > stderr:
  1653. 29.98 s > ┌───────────────────────────────────┐
  1654. 29.98 s > │ The Symbolica license has expired │
  1655. 29.98 s > └───────────────────────────────────┘
  1656. 29.98 s >
  1657. 29.98 s >
  1658. 29.98 s > Location:
  1659. 29.98 s > tests/tests/test_python_api.rs:157:20
  1660. 29.98 s > system-out
  1661. 29.98 s > running 1 test
  1662. 29.98 s > test python_evaluate_sample_honors_generate_events_and_observable_snapshots ... FAILED
  1663. 29.98 s >
  1664. 29.98 s > failures:
  1665. 29.98 s >
  1666. 29.98 s > failures:
  1667. 29.98 s > python_evaluate_sample_honors_generate_events_and_observable_snapshots
  1668. 29.98 s >
  1669. 29.98 s > test result: FAILED. 0 passed; 1 failed; 0 ignored; 0 measured; 4 filtered out; finished in 0.12s
  1670. 29.98 s > system-err
  1671. 29.98 s > Error: Python API test subprocess failed.
  1672. 29.98 s > stdout:
  1673. 29.98 s > ┌────────────────────────────────────────────────────────┐
  1674. 29.98 s > │ You are running a restricted Symbolica instance. │
  1675. 29.98 s > │ │
  1676. 29.98 s > │ This mode is only permitted for non-commercial use and │
  1677. 29.98 s > │ is limited to one instance and core per machine. │
  1678. 29.98 s > │ │
  1679. 29.98 s > │ Hobbyists can easily acquire a free license key │
  1680. 29.98 s > │ that unlocks all cores and removes this banner: │
  1681. 29.98 s > │ │
  1682. 29.98 s > │ from symbolica import * │
  1683. 29.98 s > │ request_hobbyist_license('YOUR_NAME', 'YOUR_EMAIL') │
  1684. 29.98 s > │ │
  1685. 29.98 s > │ All other users can obtain a free 30-day trial key: │
  1686. 29.98 s > │ │
  1687. 29.98 s > │ from symbolica import * │
  1688. 29.98 s > │ request_trial_license('NAME', 'EMAIL', 'EMPLOYER') │
  1689. 29.98 s > │ │
  1690. 29.98 s > │ See https://symbolica.io/docs/get_started.html#license │
  1691. 29.98 s > └────────────────────────────────────────────────────────┘
  1692. 29.98 s > ┌───────────────────────────────────────────────────────────────────────────────────────────────────────────┐
  1693. 29.98 s > │ Cannot start new unlicensed Symbolica instance since there is already another one running on the machine. │
  1694. 29.98 s > └───────────────────────────────────────────────────────────────────────────────────────────────────────────┘
  1695. 29.98 s >
  1696. 29.98 s > stderr:
  1697. 29.98 s > ┌───────────────────────────────────┐
  1698. 29.98 s > │ The Symbolica license has expired │
  1699. 29.98 s > └───────────────────────────────────┘
  1700. 29.98 s >
  1701. 29.98 s >
  1702. 29.98 s > Location:
  1703. 29.98 s > tests/tests/test_python_api.rs:157:20
  1704. 29.98 s >
  1705. 29.98 s > 4. gammaloop-integration-tests::test_python_api::python_settings_wrappers_expose_nested_runtime_and_global_settings
  1706. 29.98 s > failure: test failure with exit code 101
  1707. 29.98 s > Error: Python API test subprocess failed.
  1708. 29.98 s > stdout:
  1709. 29.98 s > ┌────────────────────────────────────────────────────────┐
  1710. 29.98 s > │ You are running a restricted Symbolica instance. │
  1711. 29.98 s > │ │
  1712. 29.98 s > │ This mode is only permitted for non-commercial use and │
  1713. 29.98 s > │ is limited to one instance and core per machine. │
  1714. 29.98 s > │ │
  1715. 29.98 s > │ Hobbyists can easily acquire a free license key │
  1716. 29.98 s > │ that unlocks all cores and removes this banner: │
  1717. 29.98 s > │ │
  1718. 29.98 s > │ from symbolica import * │
  1719. 29.98 s > │ request_hobbyist_license('YOUR_NAME', 'YOUR_EMAIL') │
  1720. 29.98 s > │ │
  1721. 29.98 s > │ All other users can obtain a free 30-day trial key: │
  1722. 29.98 s > │ │
  1723. 29.98 s > │ from symbolica import * │
  1724. 29.98 s > │ request_trial_license('NAME', 'EMAIL', 'EMPLOYER') │
  1725. 29.98 s > │ │
  1726. 29.98 s > │ See https://symbolica.io/docs/get_started.html#license │
  1727. 29.98 s > └────────────────────────────────────────────────────────┘
  1728. 29.98 s > ┌───────────────────────────────────────────────────────────────────────────────────────────────────────────┐
  1729. 29.98 s > │ Cannot start new unlicensed Symbolica instance since there is already another one running on the machine. │
  1730. 29.98 s > └───────────────────────────────────────────────────────────────────────────────────────────────────────────┘
  1731. 29.98 s >
  1732. 29.98 s > stderr:
  1733. 29.98 s > ┌───────────────────────────────────┐
  1734. 29.98 s > │ The Symbolica license has expired │
  1735. 29.98 s > └───────────────────────────────────┘
  1736. 29.98 s >
  1737. 29.98 s >
  1738. 29.98 s > Location:
  1739. 29.98 s > tests/tests/test_python_api.rs:157:20
  1740. 29.98 s > system-out
  1741. 29.98 s > running 1 test
  1742. 29.98 s > test python_settings_wrappers_expose_nested_runtime_and_global_settings ... FAILED
  1743. 29.98 s >
  1744. 29.98 s > failures:
  1745. 29.98 s >
  1746. 29.98 s > failures:
  1747. 29.98 s > python_settings_wrappers_expose_nested_runtime_and_global_settings
  1748. 29.98 s >
  1749. 29.98 s > test result: FAILED. 0 passed; 1 failed; 0 ignored; 0 measured; 4 filtered out; finished in 0.21s
  1750. 29.98 s > system-err
  1751. 29.98 s > Error: Python API test subprocess failed.
  1752. 29.98 s > stdout:
  1753. 29.98 s > ┌────────────────────────────────────────────────────────┐
  1754. 29.98 s > │ You are running a restricted Symbolica instance. │
  1755. 29.98 s > │ │
  1756. 29.98 s > │ This mode is only permitted for non-commercial use and │
  1757. 29.98 s > │ is limited to one instance and core per machine. │
  1758. 29.98 s > │ │
  1759. 29.98 s > │ Hobbyists can easily acquire a free license key │
  1760. 29.98 s > │ that unlocks all cores and removes this banner: │
  1761. 29.98 s > │ │
  1762. 29.98 s > │ from symbolica import * │
  1763. 29.98 s > │ request_hobbyist_license('YOUR_NAME', 'YOUR_EMAIL') │
  1764. 29.98 s > │ │
  1765. 29.98 s > │ All other users can obtain a free 30-day trial key: │
  1766. 29.98 s > │ │
  1767. 29.98 s > │ from symbolica import * │
  1768. 29.98 s > │ request_trial_license('NAME', 'EMAIL', 'EMPLOYER') │
  1769. 29.98 s > │ │
  1770. 29.98 s > │ See https://symbolica.io/docs/get_started.html#license │
  1771. 29.98 s > └────────────────────────────────────────────────────────┘
  1772. 29.98 s > ┌───────────────────────────────────────────────────────────────────────────────────────────────────────────┐
  1773. 29.98 s > │ Cannot start new unlicensed Symbolica instance since there is already another one running on the machine. │
  1774. 29.98 s > └───────────────────────────────────────────────────────────────────────────────────────────────────────────┘
  1775. 29.98 s >
  1776. 29.98 s > stderr:
  1777. 29.98 s > ┌───────────────────────────────────┐
  1778. 29.98 s > │ The Symbolica license has expired │
  1779. 29.98 s > └───────────────────────────────────┘
  1780. 29.98 s >
  1781. 29.98 s >
  1782. 29.98 s > Location:
  1783. 29.98 s > tests/tests/test_python_api.rs:157:20
  1784. 29.98 s >
  1785. 29.98 s > 5. gammaloop-integration-tests::test_python_api::python_evaluate_sample_preserves_graph_grouping_and_incoming_pdgs
  1786. 29.98 s > failure: test failure with exit code 101
  1787. 29.98 s > Error: Python API test subprocess failed.
  1788. 29.98 s > stdout:
  1789. 29.98 s > ┌────────────────────────────────────────────────────────┐
  1790. 29.98 s > │ You are running a restricted Symbolica instance. │
  1791. 29.98 s > │ │
  1792. 29.98 s > │ This mode is only permitted for non-commercial use and │
  1793. 29.98 s > │ is limited to one instance and core per machine. │
  1794. 29.98 s > │ │
  1795. 29.98 s > │ Hobbyists can easily acquire a free license key │
  1796. 29.98 s > │ that unlocks all cores and removes this banner: │
  1797. 29.98 s > │ │
  1798. 29.98 s > │ from symbolica import * │
  1799. 29.98 s > │ request_hobbyist_license('YOUR_NAME', 'YOUR_EMAIL') │
  1800. 29.98 s > │ │
  1801. 29.98 s > │ All other users can obtain a free 30-day trial key: │
  1802. 29.98 s > │ │
  1803. 29.98 s > │ from symbolica import * │
  1804. 29.98 s > │ request_trial_license('NAME', 'EMAIL', 'EMPLOYER') │
  1805. 29.98 s > │ │
  1806. 29.98 s > │ See https://symbolica.io/docs/get_started.html#license │
  1807. 29.98 s > └────────────────────────────────────────────────────────┘
  1808. 29.98 s > ┌───────────────────────────────────────────────────────────────────────────────────────────────────────────┐
  1809. 29.98 s > │ Cannot start new unlicensed Symbolica instance since there is already another one running on the machine. │
  1810. 29.98 s > └───────────────────────────────────────────────────────────────────────────────────────────────────────────┘
  1811. 29.98 s >
  1812. 29.98 s > stderr:
  1813. 29.98 s > ┌───────────────────────────────────┐
  1814. 29.98 s > │ The Symbolica license has expired │
  1815. 29.98 s > └───────────────────────────────────┘
  1816. 29.98 s > [2026-09-01 22:08:48.097] @gammaloop_api::se... INFO : Running command import model sm-default
  1817. 29.98 s > [2026-09-01 22:08:48.097] @import::model INFO : Loading built-in JSON model sm-default
  1818. 29.98 s > [2026-09-01 22:08:48.108] @gammaloop_api::se... INFO : Running command set default-runtime kv kinematics.externals='{"type":"constant","data":{"momenta":[[32.0,0.0,0.0,32.0],[32.0,0.0,0.0,-32.0]],"helicities":[1,1]}}'
  1819. 29.98 s > [2026-09-01 22:08:48.109] @gammaloop_api::se... INFO : Running command set default-runtime kv subtraction.disable_threshold_subtraction=true
  1820. 29.98 s > [2026-09-01 22:08:48.110] @gammaloop_api::se... INFO : Running command generate xs e+ e- > d d~ g | e- a d g QED^2==4 [{{2}} QCD=0] --numerator-grouping group_identical_graphs_up_to_sign --clear-existing-processes --only-diagrams
  1821. 29.98 s > [2026-09-01 22:08:48.252] @commands::generate INFO : Generated cross-section 2 graphs.
  1822. 29.98 s > [2026-09-01 22:08:48.253] @commands::generate INFO : Only diagram generation was requested, skipping integrand generation. You can generate integrands later using the 'generate existing <options>' command.
  1823. 29.98 s > [2026-09-01 22:08:48.253] @gammaloop_api::se... INFO : Running command generate
  1824. 29.98 s >
  1825. 29.98 s >
  1826. 29.98 s > Location:
  1827. 29.98 s > tests/tests/test_python_api.rs:157:20
  1828. 29.98 s > system-out
  1829. 29.98 s > running 1 test
  1830. 29.98 s > test python_evaluate_sample_preserves_graph_grouping_and_incoming_pdgs ... FAILED
  1831. 29.98 s >
  1832. 29.98 s > failures:
  1833. 29.98 s >
  1834. 29.98 s > failures:
  1835. 29.98 s > python_evaluate_sample_preserves_graph_grouping_and_incoming_pdgs
  1836. 29.98 s >
  1837. 29.98 s > test result: FAILED. 0 passed; 1 failed; 0 ignored; 0 measured; 4 filtered out; finished in 0.29s
  1838. 29.98 s > system-err
  1839. 29.98 s > Error: Python API test subprocess failed.
  1840. 29.98 s > stdout:
  1841. 29.98 s > ┌────────────────────────────────────────────────────────┐
  1842. 29.98 s > │ You are running a restricted Symbolica instance. │
  1843. 29.98 s > │ │
  1844. 29.98 s > │ This mode is only permitted for non-commercial use and │
  1845. 29.98 s > │ is limited to one instance and core per machine. │
  1846. 29.98 s > │ │
  1847. 29.98 s > │ Hobbyists can easily acquire a free license key │
  1848. 29.98 s > │ that unlocks all cores and removes this banner: │
  1849. 29.98 s > │ │
  1850. 29.98 s > │ from symbolica import * │
  1851. 29.98 s > │ request_hobbyist_license('YOUR_NAME', 'YOUR_EMAIL') │
  1852. 29.98 s > │ │
  1853. 29.98 s > │ All other users can obtain a free 30-day trial key: │
  1854. 29.98 s > │ │
  1855. 29.98 s > │ from symbolica import * │
  1856. 29.98 s > │ request_trial_license('NAME', 'EMAIL', 'EMPLOYER') │
  1857. 29.98 s > │ │
  1858. 29.98 s > │ See https://symbolica.io/docs/get_started.html#license │
  1859. 29.98 s > └────────────────────────────────────────────────────────┘
  1860. 29.98 s > ┌───────────────────────────────────────────────────────────────────────────────────────────────────────────┐
  1861. 29.98 s > │ Cannot start new unlicensed Symbolica instance since there is already another one running on the machine. │
  1862. 29.98 s > └───────────────────────────────────────────────────────────────────────────────────────────────────────────┘
  1863. 29.98 s >
  1864. 29.98 s > stderr:
  1865. 29.98 s > ┌───────────────────────────────────┐
  1866. 29.98 s > │ The Symbolica license has expired │
  1867. 29.98 s > └───────────────────────────────────┘
  1868. 29.98 s > [2026-09-01 22:08:48.097] @gammaloop_api::se... INFO : Running command import model sm-default
  1869. 29.98 s > [2026-09-01 22:08:48.097] @import::model INFO : Loading built-in JSON model sm-default
  1870. 29.98 s > [2026-09-01 22:08:48.108] @gammaloop_api::se... INFO : Running command set default-runtime kv kinematics.externals='{"type":"constant","data":{"momenta":[[32.0,0.0,0.0,32.0],[32.0,0.0,0.0,-32.0]],"helicities":[1,1]}}'
  1871. 29.98 s > [2026-09-01 22:08:48.109] @gammaloop_api::se... INFO : Running command set default-runtime kv subtraction.disable_threshold_subtraction=true
  1872. 29.98 s > [2026-09-01 22:08:48.110] @gammaloop_api::se... INFO : Running command generate xs e+ e- > d d~ g | e- a d g QED^2==4 [{{2}} QCD=0] --numerator-grouping group_identical_graphs_up_to_sign --clear-existing-processes --only-diagrams
  1873. 29.98 s > [2026-09-01 22:08:48.252] @commands::generate INFO : Generated cross-section 2 graphs.
  1874. 29.98 s > [2026-09-01 22:08:48.253] @commands::generate INFO : Only diagram generation was requested, skipping integrand generation. You can generate integrands later using the 'generate existing <options>' command.
  1875. 29.98 s > [2026-09-01 22:08:48.253] @gammaloop_api::se... INFO : Running command generate
  1876. 29.98 s >
  1877. 29.98 s >
  1878. 29.98 s > Location:
  1879. 29.98 s > tests/tests/test_python_api.rs:157:20
  1880. 29.98 s > =========================================
  1881. 29.98 s For full logs, run:
  1882. 29.98 s nix log /nix/store/271q8fjm505dyqck3n8ihm4f8zacvzmd-gammaloop-nextest-python-api.drv
  1883. 30.09 s [0 built (1 failed), 0.0Run failed.