1. 0.12 s $ /nix/store/9ypz3flqsrl5xl495mm8h645gadjsxi1-coreutils-9.11/bin/timeout --kill-after=15s 7200s /nix/store/23zk8sgzamrbmj1fday15szf7f2279s8-nix-2.34.7/bin/nix --extra-experimental-features nix-command --extra-experimental-features flakes flake clone git+https://github.com/alphal00p/gammaloop --dest /tmp/nix-ci-worker/stable-pwd/repo/
  2. 0.33 s Cloning into '/tmp/nix-ci-worker/stable-pwd/repo'...
  3. 1.88 s remote: Enumerating objects: 66499, done.
  4. 2.10 s remote: Counting objects: 0% (1/9171) remote: Counting objects: 1% (92/9171) remote: Counting objects: 2% (184/9171) remote: Counting objects: 3% (276/9171) remote: Counting objects: 4% (367/9171) remote: Counting objects: 5% (459/9171) remote: Counting objects: 6% (551/9171) remote: Counting objects: 7% (642/9171) remote: Counting objects: 8% (734/9171) remote: Counting objects: 9% (826/9171) remote: Counting objects: 10% (918/9171) remote: Counting objects: 11% (1009/9171) remote: Counting objects: 12% (1101/9171) remote: Counting objects: 13% (1193/9171) remote: Counting objects: 14% (1284/9171) remote: Counting objects: 15% (1376/9171) remote: Counting objects: 16% (1468/9171) remote: Counting objects: 17% (1560/9171) remote: Counting objects: 18% (1651/9171) remote: Counting objects: 19% (1743/9171) remote: Counting objects: 20% (1835/9171) remote: Counting objects: 21% (1926/9171) remote: Counting objects: 22% (2018/9171) remote: Counting objects: 23% (2110/9171) remote: Counting objects: 24% (2202/9171) remote: Counting objects: 25% (2293/9171) remote: Counting objects: 26% (2385/9171) remote: Counting objects: 27% (2477/9171) remote: Counting objects: 28% (2568/9171) remote: Counting objects: 29% (2660/9171) remote: Counting objects: 30% (2752/9171) remote: Counting objects: 31% (2844/9171) remote: Counting objects: 32% (2935/9171) remote: Counting objects: 33% (3027/9171) remote: Counting objects: 34% (3119/9171) remote: Counting objects: 35% (3210/9171) remote: Counting objects: 36% (3302/9171) remote: Counting objects: 37% (3394/9171) remote: Counting objects: 38% (3485/9171) remote: Counting objects: 39% (3577/9171) remote: Counting objects: 40% (3669/9171) remote: Counting objects: 41% (3761/9171) remote: Counting objects: 42% (3852/9171) remote: Counting objects: 43% (3944/9171) remote: Counting objects: 44% (4036/9171) remote: Counting objects: 45% (4127/9171) remote: Counting objects: 46% (4219/9171) remote: Counting objects: 47% (4311/9171) remote: Counting objects: 48% (4403/9171) remote: Counting objects: 49% (4494/9171) remote: Counting objects: 50% (4586/9171) remote: Counting objects: 51% (4678/9171) remote: Counting objects: 52% (4769/9171) remote: Counting objects: 53% (4861/9171) remote: Counting objects: 54% (4953/9171) remote: Counting objects: 55% (5045/9171) remote: Counting objects: 56% (5136/9171) remote: Counting objects: 57% (5228/9171) remote: Counting objects: 58% (5320/9171) remote: Counting objects: 59% (5411/9171) remote: Counting objects: 60% (5503/9171) remote: Counting objects: 61% (5595/9171) remote: Counting objects: 62% (5687/9171) remote: Counting objects: 63% (5778/9171) remote: Counting objects: 64% (5870/9171) remote: Counting objects: 65% (5962/9171) remote: Counting objects: 66% (6053/9171) remote: Counting objects: 67% (6145/9171) remote: Counting objects: 68% (6237/9171) remote: Counting objects: 69% (6328/9171) remote: Counting objects: 70% (6420/9171) remote: Counting objects: 71% (6512/9171) remote: Counting objects: 72% (6604/9171) remote: Counting objects: 73% (6695/9171) remote: Counting objects: 74% (6787/9171) remote: Counting objects: 75% (6879/9171) remote: Counting objects: 76% (6970/9171) remote: Counting objects: 77% (7062/9171) remote: Counting objects: 78% (7154/9171) remote: Counting objects: 79% (7246/9171) remote: Counting objects: 80% (7337/9171) remote: Counting objects: 81% (7429/9171) remote: Counting objects: 82% (7521/9171) remote: Counting objects: 83% (7612/9171) remote: Counting objects: 84% (7704/9171) remote: Counting objects: 85% (7796/9171) remote: Counting objects: 86% (7888/9171) remote: Counting objects: 87% (7979/9171) remote: Counting objects: 88% (8071/9171) remote: Counting objects: 89% (8163/9171) remote: Counting objects: 90% (8254/9171) remote: Counting objects: 91% (8346/9171) remote: Counting objects: 92% (8438/9171) remote: Counting objects: 93% (8530/9171) remote: Counting objects: 94% (8621/9171) remote: Counting objects: 95% (8713/9171) remote: Counting objects: 96% (8805/9171) remote: Counting objects: 97% (8896/9171) remote: Counting objects: 98% (8988/9171) remote: Counting objects: 99% (9080/9171) remote: Counting objects: 100% (9171/9171) remote: Counting objects: 100% (9171/9171), done.
  5. 4.46 s remote: Compressing objects: 0% (1/2233) remote: Compressing objects: 1% (23/2233) remote: Compressing objects: 2% (45/2233) remote: Compressing objects: 3% (67/2233) remote: Compressing objects: 4% (90/2233) remote: Compressing objects: 5% (112/2233) remote: Compressing objects: 6% (134/2233) remote: Compressing objects: 7% (157/2233) remote: Compressing objects: 8% (179/2233) remote: Compressing objects: 9% (201/2233) remote: Compressing objects: 10% (224/2233) remote: Compressing objects: 11% (246/2233) remote: Compressing objects: 12% (268/2233) remote: Compressing objects: 13% (291/2233) remote: Compressing objects: 14% (313/2233) remote: Compressing objects: 15% (335/2233) remote: Compressing objects: 16% (358/2233) remote: Compressing objects: 17% (380/2233) remote: Compressing objects: 18% (402/2233) remote: Compressing objects: 19% (425/2233) remote: Compressing objects: 20% (447/2233) remote: Compressing objects: 21% (469/2233) remote: Compressing objects: 21% (478/2233) remote: Compressing objects: 22% (492/2233) remote: Compressing objects: 23% (514/2233) remote: Compressing objects: 24% (536/2233) remote: Compressing objects: 25% (559/2233) remote: Compressing objects: 26% (581/2233) remote: Compressing objects: 27% (603/2233) remote: Compressing objects: 28% (626/2233) remote: Compressing objects: 28% (646/2233) remote: Compressing objects: 29% (648/2233) remote: Compressing objects: 30% (670/2233) remote: Compressing objects: 31% (693/2233) remote: Compressing objects: 32% (715/2233) remote: Compressing objects: 33% (737/2233) remote: Compressing objects: 34% (760/2233) remote: Compressing objects: 35% (782/2233) remote: Compressing objects: 36% (804/2233) remote: Compressing objects: 37% (827/2233) remote: Compressing objects: 38% (849/2233) remote: Compressing objects: 39% (871/2233) remote: Compressing objects: 40% (894/2233) remote: Compressing objects: 41% (916/2233) remote: Compressing objects: 42% (938/2233) remote: Compressing objects: 43% (961/2233) remote: Compressing objects: 44% (983/2233) remote: Compressing objects: 45% (1005/2233) remote: Compressing objects: 46% (1028/2233) remote: Compressing objects: 47% (1050/2233) remote: Compressing objects: 48% (1072/2233) remote: Compressing objects: 49% (1095/2233) remote: Compressing objects: 50% (1117/2233) remote: Compressing objects: 51% (1139/2233) remote: Compressing objects: 52% (1162/2233) remote: Compressing objects: 53% (1184/2233) remote: Compressing objects: 54% (1206/2233) remote: Compressing objects: 55% (1229/2233) remote: Compressing objects: 56% (1251/2233) remote: Compressing objects: 57% (1273/2233) remote: Compressing objects: 58% (1296/2233) remote: Compressing objects: 59% (1318/2233) remote: Compressing objects: 60% (1340/2233) remote: Compressing objects: 61% (1363/2233) remote: Compressing objects: 62% (1385/2233) remote: Compressing objects: 63% (1407/2233) remote: Compressing objects: 64% (1430/2233) remote: Compressing objects: 65% (1452/2233) remote: Compressing objects: 66% (1474/2233) remote: Compressing objects: 67% (1497/2233) remote: Compressing objects: 68% (1519/2233) remote: Compressing objects: 69% (1541/2233) remote: Compressing objects: 70% (1564/2233) remote: Compressing objects: 71% (1586/2233) remote: Compressing objects: 72% (1608/2233) remote: Compressing objects: 73% (1631/2233) remote: Compressing objects: 74% (1653/2233) remote: Compressing objects: 75% (1675/2233) remote: Compressing objects: 76% (1698/2233) remote: Compressing objects: 77% (1720/2233) remote: Compressing objects: 78% (1742/2233) remote: Compressing objects: 79% (1765/2233) remote: Compressing objects: 80% (1787/2233) remote: Compressing objects: 81% (1809/2233) remote: Compressing objects: 82% (1832/2233) remote: Compressing objects: 83% (1854/2233) remote: Compressing objects: 84% (1876/2233) remote: Compressing objects: 85% (1899/2233) remote: Compressing objects: 86% (1921/2233) remote: Compressing objects: 87% (1943/2233) remote: Compressing objects: 88% (1966/2233) remote: Compressing objects: 89% (1988/2233) remote: Compressing objects: 90% (2010/2233) remote: Compressing objects: 91% (2033/2233) remote: Compressing objects: 92% (2055/2233) remote: Compressing objects: 93% (2077/2233) remote: Compressing objects: 94% (2100/2233) remote: Compressing objects: 95% (2122/2233) remote: Compressing objects: 96% (2144/2233) remote: Compressing objects: 97% (2167/2233) remote: Compressing objects: 98% (2189/2233) remote: Compressing objects: 99% (2211/2233) remote: Compressing objects: 100% (2233/2233) remote: Compressing objects: 100% (2233/2233), done.
  6. 7.62 s Receiving objects: 0% (1/66499) Receiving objects: 1% (665/66499) Receiving objects: 2% (1330/66499) Receiving objects: 3% (1995/66499) Receiving objects: 4% (2660/66499) Receiving objects: 5% (3325/66499) Receiving objects: 6% (3990/66499) Receiving objects: 7% (4655/66499) Receiving objects: 8% (5320/66499), 9.01 MiB | 18.00 MiB/s Receiving objects: 9% (5985/66499), 9.01 MiB | 18.00 MiB/s Receiving objects: 10% (6650/66499), 9.01 MiB | 18.00 MiB/s Receiving objects: 11% (7315/66499), 9.01 MiB | 18.00 MiB/s Receiving objects: 12% (7980/66499), 9.01 MiB | 18.00 MiB/s Receiving objects: 13% (8645/66499), 9.01 MiB | 18.00 MiB/s Receiving objects: 14% (9310/66499), 9.01 MiB | 18.00 MiB/s Receiving objects: 15% (9975/66499), 9.01 MiB | 18.00 MiB/s Receiving objects: 16% (10640/66499), 9.01 MiB | 18.00 MiB/s Receiving objects: 17% (11305/66499), 9.01 MiB | 18.00 MiB/s Receiving objects: 18% (11970/66499), 9.01 MiB | 18.00 MiB/s Receiving objects: 19% (12635/66499), 9.01 MiB | 18.00 MiB/s Receiving objects: 20% (13300/66499), 9.01 MiB | 18.00 MiB/s Receiving objects: 21% (13965/66499), 9.01 MiB | 18.00 MiB/s Receiving objects: 22% (14630/66499), 9.01 MiB | 18.00 MiB/s Receiving objects: 23% (15295/66499), 9.01 MiB | 18.00 MiB/s Receiving objects: 24% (15960/66499), 9.01 MiB | 18.00 MiB/s Receiving objects: 25% (16625/66499), 9.01 MiB | 18.00 MiB/s Receiving objects: 25% (17160/66499), 9.01 MiB | 18.00 MiB/s Receiving objects: 26% (17290/66499), 9.01 MiB | 18.00 MiB/s Receiving objects: 27% (17955/66499), 21.31 MiB | 21.30 MiB/s Receiving objects: 28% (18620/66499), 21.31 MiB | 21.30 MiB/s Receiving objects: 29% (19285/66499), 21.31 MiB | 21.30 MiB/s Receiving objects: 30% (19950/66499), 21.31 MiB | 21.30 MiB/s Receiving objects: 31% (20615/66499), 21.31 MiB | 21.30 MiB/s Receiving objects: 32% (21280/66499), 21.31 MiB | 21.30 MiB/s Receiving objects: 33% (21945/66499), 21.31 MiB | 21.30 MiB/s Receiving objects: 34% (22610/66499), 21.31 MiB | 21.30 MiB/s Receiving objects: 35% (23275/66499), 21.31 MiB | 21.30 MiB/s Receiving objects: 36% (23940/66499), 21.31 MiB | 21.30 MiB/s Receiving objects: 37% (24605/66499), 21.31 MiB | 21.30 MiB/s Receiving objects: 38% (25270/66499), 21.31 MiB | 21.30 MiB/s Receiving objects: 39% (25935/66499), 21.31 MiB | 21.30 MiB/s Receiving objects: 40% (26600/66499), 21.31 MiB | 21.30 MiB/s Receiving objects: 41% (27265/66499), 21.31 MiB | 21.30 MiB/s Receiving objects: 42% (27930/66499), 21.31 MiB | 21.30 MiB/s Receiving objects: 43% (28595/66499), 21.31 MiB | 21.30 MiB/s Receiving objects: 44% (29260/66499), 21.31 MiB | 21.30 MiB/s Receiving objects: 45% (29925/66499), 21.31 MiB | 21.30 MiB/s Receiving objects: 46% (30590/66499), 21.31 MiB | 21.30 MiB/s Receiving objects: 47% (31255/66499), 21.31 MiB | 21.30 MiB/s Receiving objects: 48% (31920/66499), 21.31 MiB | 21.30 MiB/s Receiving objects: 49% (32585/66499), 21.31 MiB | 21.30 MiB/s Receiving objects: 50% (33250/66499), 21.31 MiB | 21.30 MiB/s Receiving objects: 51% (33915/66499), 21.31 MiB | 21.30 MiB/s Receiving objects: 52% (34580/66499), 21.31 MiB | 21.30 MiB/s Receiving objects: 53% (35245/66499), 21.31 MiB | 21.30 MiB/s Receiving objects: 54% (35910/66499), 21.31 MiB | 21.30 MiB/s Receiving objects: 55% (36575/66499), 21.31 MiB | 21.30 MiB/s Receiving objects: 56% (37240/66499), 21.31 MiB | 21.30 MiB/s Receiving objects: 57% (37905/66499), 21.31 MiB | 21.30 MiB/s Receiving objects: 58% (38570/66499), 21.31 MiB | 21.30 MiB/s Receiving objects: 59% (39235/66499), 44.11 MiB | 29.40 MiB/s Receiving objects: 60% (39900/66499), 44.11 MiB | 29.40 MiB/s Receiving objects: 61% (40565/66499), 44.11 MiB | 29.40 MiB/s Receiving objects: 62% (41230/66499), 44.11 MiB | 29.40 MiB/s Receiving objects: 63% (41895/66499), 44.11 MiB | 29.40 MiB/s Receiving objects: 64% (42560/66499), 44.11 MiB | 29.40 MiB/s Receiving objects: 65% (43225/66499), 44.11 MiB | 29.40 MiB/s Receiving objects: 66% (43890/66499), 44.11 MiB | 29.40 MiB/s Receiving objects: 67% (44555/66499), 44.11 MiB | 29.40 MiB/s Receiving objects: 68% (45220/66499), 44.11 MiB | 29.40 MiB/s Receiving objects: 69% (45885/66499), 44.11 MiB | 29.40 MiB/s Receiving objects: 70% (46550/66499), 44.11 MiB | 29.40 MiB/s Receiving objects: 71% (47215/66499), 44.11 MiB | 29.40 MiB/s Receiving objects: 72% (47880/66499), 44.11 MiB | 29.40 MiB/s Receiving objects: 73% (48545/66499), 44.11 MiB | 29.40 MiB/s Receiving objects: 73% (48782/66499), 61.61 MiB | 30.45 MiB/s Receiving objects: 74% (49210/66499), 61.61 MiB | 30.45 MiB/s Receiving objects: 75% (49875/66499), 61.61 MiB | 30.45 MiB/s Receiving objects: 76% (50540/66499), 61.61 MiB | 30.45 MiB/s Receiving objects: 77% (51205/66499), 61.61 MiB | 30.45 MiB/s Receiving objects: 78% (51870/66499), 61.61 MiB | 30.45 MiB/s Receiving objects: 79% (52535/66499), 61.61 MiB | 30.45 MiB/s Receiving objects: 80% (53200/66499), 61.61 MiB | 30.45 MiB/s Receiving objects: 81% (53865/66499), 61.61 MiB | 30.45 MiB/s Receiving objects: 82% (54530/66499), 79.35 MiB | 31.44 MiB/s Receiving objects: 83% (55195/66499), 79.35 MiB | 31.44 MiB/s Receiving objects: 84% (55860/66499), 79.35 MiB | 31.44 MiB/s Receiving objects: 85% (56525/66499), 79.35 MiB | 31.44 MiB/s Receiving objects: 86% (57190/66499), 79.35 MiB | 31.44 MiB/s Receiving objects: 87% (57855/66499), 79.35 MiB | 31.44 MiB/s Receiving objects: 88% (58520/66499), 79.35 MiB | 31.44 MiB/s Receiving objects: 89% (59185/66499), 79.35 MiB | 31.44 MiB/s Receiving objects: 90% (59850/66499), 79.35 MiB | 31.44 MiB/s Receiving objects: 91% (60515/66499), 79.35 MiB | 31.44 MiB/s Receiving objects: 92% (61180/66499), 79.35 MiB | 31.44 MiB/s Receiving objects: 93% (61845/66499), 79.35 MiB | 31.44 MiB/s Receiving objects: 94% (62510/66499), 79.35 MiB | 31.44 MiB/s Receiving objects: 95% (63175/66499), 79.35 MiB | 31.44 MiB/s Receiving objects: 96% (63840/66499), 79.35 MiB | 31.44 MiB/s Receiving objects: 97% (64505/66499), 79.35 MiB | 31.44 MiB/s Receiving objects: 98% (65170/66499), 79.35 MiB | 31.44 MiB/s Receiving objects: 99% (65835/66499), 79.35 MiB | 31.44 MiB/s Receiving objects: 99% (66230/66499), 95.12 MiB | 31.46 MiB/s remote: Total 66499 (delta 7366), reused 7338 (delta 6650), pack-reused 57328 (from 1)
  7. 7.63 s Receiving objects: 100% (66499/66499), 95.12 MiB | 31.46 MiB/s Receiving objects: 100% (66499/66499), 99.34 MiB | 31.45 MiB/s, done.
  8. 9.93 s Resolving deltas: 0% (0/46463) Resolving deltas: 1% (465/46463) Resolving deltas: 2% (930/46463) Resolving deltas: 3% (1394/46463) Resolving deltas: 4% (1859/46463) Resolving deltas: 5% (2325/46463) Resolving deltas: 6% (2788/46463) Resolving deltas: 7% (3253/46463) Resolving deltas: 8% (3718/46463) Resolving deltas: 9% (4182/46463) Resolving deltas: 10% (4647/46463) Resolving deltas: 11% (5111/46463) Resolving deltas: 12% (5576/46463) Resolving deltas: 13% (6041/46463) Resolving deltas: 14% (6505/46463) Resolving deltas: 15% (6970/46463) Resolving deltas: 16% (7435/46463) Resolving deltas: 17% (7899/46463) Resolving deltas: 18% (8364/46463) Resolving deltas: 19% (8828/46463) Resolving deltas: 20% (9293/46463) Resolving deltas: 21% (9758/46463) Resolving deltas: 22% (10222/46463) Resolving deltas: 23% (10687/46463) Resolving deltas: 24% (11152/46463) Resolving deltas: 25% (11616/46463) Resolving deltas: 26% (12081/46463) Resolving deltas: 27% (12546/46463) Resolving deltas: 28% (13010/46463) Resolving deltas: 29% (13475/46463) Resolving deltas: 30% (13939/46463) Resolving deltas: 31% (14404/46463) Resolving deltas: 32% (14869/46463) Resolving deltas: 33% (15333/46463) Resolving deltas: 34% (15798/46463) Resolving deltas: 35% (16263/46463) Resolving deltas: 36% (16727/46463) Resolving deltas: 37% (17192/46463) Resolving deltas: 38% (17656/46463) Resolving deltas: 39% (18121/46463) Resolving deltas: 40% (18587/46463) Resolving deltas: 41% (19050/46463) Resolving deltas: 42% (19515/46463) Resolving deltas: 43% (19980/46463) Resolving deltas: 44% (20445/46463) Resolving deltas: 45% (20909/46463) Resolving deltas: 46% (21373/46463) Resolving deltas: 47% (21838/46463) Resolving deltas: 48% (22303/46463) Resolving deltas: 49% (22767/46463) Resolving deltas: 50% (23232/46463) Resolving deltas: 51% (23697/46463) Resolving deltas: 52% (24161/46463) Resolving deltas: 53% (24626/46463) Resolving deltas: 54% (25091/46463) Resolving deltas: 55% (25555/46463) Resolving deltas: 56% (26020/46463) Resolving deltas: 57% (26484/46463) Resolving deltas: 58% (26950/46463) Resolving deltas: 59% (27414/46463) Resolving deltas: 60% (27878/46463) Resolving deltas: 61% (28343/46463) Resolving deltas: 62% (28808/46463) Resolving deltas: 62% (29265/46463) Resolving deltas: 63% (29272/46463) Resolving deltas: 64% (29737/46463) Resolving deltas: 65% (30201/46463) Resolving deltas: 66% (30666/46463) Resolving deltas: 67% (31131/46463) Resolving deltas: 68% (31595/46463) Resolving deltas: 69% (32061/46463) Resolving deltas: 70% (32525/46463) Resolving deltas: 71% (32989/46463) Resolving deltas: 72% (33454/46463) Resolving deltas: 73% (33918/46463) Resolving deltas: 74% (34384/46463) Resolving deltas: 75% (34848/46463) Resolving deltas: 76% (35312/46463) Resolving deltas: 77% (35777/46463) Resolving deltas: 78% (36242/46463) Resolving deltas: 79% (36706/46463) Resolving deltas: 80% (37171/46463) Resolving deltas: 81% (37636/46463) Resolving deltas: 82% (38100/46463) Resolving deltas: 83% (38565/46463) Resolving deltas: 84% (39029/46463) Resolving deltas: 85% (39494/46463) Resolving deltas: 86% (39959/46463) Resolving deltas: 87% (40423/46463) Resolving deltas: 88% (40890/46463) Resolving deltas: 89% (41353/46463) Resolving deltas: 90% (41817/46463) Resolving deltas: 91% (42282/46463) Resolving deltas: 91% (42557/46463) Resolving deltas: 92% (42746/46463) Resolving deltas: 93% (43211/46463) Resolving deltas: 94% (43676/46463) Resolving deltas: 95% (44140/46463) Resolving deltas: 96% (44605/46463) Resolving deltas: 97% (45070/46463) Resolving deltas: 98% (45534/46463) Resolving deltas: 99% (45999/46463) Resolving deltas: 100% (46463/46463) Resolving deltas: 100% (46463/46463), done.
  9. 10.71 s Fetching commit 6eccc26fe47651addfae2f810918809139129a5c for feynkit ...
  10. 10.71 s $ /nix/store/bcnisk3ydfgv26v2gw3zlky24g00yww2-git-2.54.0/bin/git fetch origin 6eccc26fe47651addfae2f810918809139129a5c
  11. 11.34 s From https://github.com/alphal00p/gammaloop
  12. 11.34 s * branch 6eccc26fe47651addfae2f810918809139129a5c -> FETCH_HEAD
  13. 11.43 s $ /nix/store/9ypz3flqsrl5xl495mm8h645gadjsxi1-coreutils-9.11/bin/timeout --kill-after=15s 7200s /nix/store/bcnisk3ydfgv26v2gw3zlky24g00yww2-git-2.54.0/bin/git -c advice.detachedHead=false checkout 6eccc26fe47651addfae2f810918809139129a5c
  14. 11.85 s HEAD is now at 6eccc26fe fix feynkit tensor bridge integration
  15. 11.89 s $ /nix/store/9ypz3flqsrl5xl495mm8h645gadjsxi1-coreutils-9.11/bin/timeout --kill-after=15s 7200s /nix/store/23zk8sgzamrbmj1fday15szf7f2279s8-nix-2.34.7/bin/nix --extra-experimental-features nix-command --extra-experimental-features flakes --log-format internal-json run .#packages.x86_64-linux.nix-ci-check-gammaloop-nextest-python-api --print-build-logs
  16. 12.43 s
  17. 38.02 s evaluating derivation 'g copying '/nix/store/jirn evaluating derivation 'g copying '/nix/store/jirn evaluating derivation 'g copying '/nix/store/jirn evaluating derivation 'g copying '/nix/store/jirn evaluating derivation 'g copying '/nix/store/jirn evaluating derivation 'g copying '/nix/store/jirn evaluating derivation 'g copying '/nix/store/jirn evaluating derivation 'g copying '/nix/store/jirn evaluating derivation 'g copying '/nix/store/jirn evaluating derivation 'g copying '/nix/store/jirn evaluating derivation 'g copying '/nix/store/jirn evaluating derivation 'g copying '/nix/store/jirn evaluating derivation 'g copying '/nix/store/jirn evaluating derivation 'g copying '/nix/store/jirn evaluating derivation 'g copying '/nix/store/jirn evaluating derivation 'g copying '/nix/store/jirn evaluating derivation 'g copying '/nix/store/jirn evaluating derivation 'g copying '/nix/store/jirn evaluating derivation 'g copying '/nix/store/jirn evaluating derivation 'g copying '/nix/store/jirn evaluating derivation 'g copying '/nix/store/jirn evaluating derivation 'g copying '/nix/store/jirn evaluating derivation 'g copying '/nix/store/jirn evaluating derivation 'g copying '/nix/store/jirn evaluating derivation 'g copying '/nix/store/jirn evaluating derivation 'g copying '/nix/store/jirn evaluating derivation 'g copying '/nix/store/jirn evaluating derivation 'g copying '/nix/store/jirn evaluating derivation 'g copying '/nix/store/jirn evaluating derivation 'g copying '/nix/store/jirn evaluating derivation 'g copying '/nix/store/jirn evaluating derivation 'g copying '/nix/store/jirn evaluating derivation 'g copying '/nix/store/jirn evaluating derivation 'g copying '/nix/store/jirn evaluating derivation 'g copying '/nix/store/jirn evaluating derivation 'g copying '/nix/store/jirn evaluating derivation 'g copying '/nix/store/jirn evaluating derivation 'g copying '/nix/store/jirn evaluating derivation 'g copying '/nix/store/jirn evaluating derivation 'g copying '/nix/store/jirn evaluating derivation 'g [0/1 built] [1/0/1 built] [1/0/1 built] building ggammaloop-nextest-python-api> Extracting 1 binary, 1 build script output directory, and 3 linked paths to /build/nextest-archive-3kCaEP
  18. 38.14 s gammaloop-nextest-python-api> Extracted 18 files to /build/nextest-archive-3kCaEP in 0.12s
  19. 38.17 s gammaloop-nextest-python-api> ------------
  20. 38.17 s gammaloop-nextest-python-api> Nextest run ID cf291be8-6420-49e7-9cf1-a05d79cae94e with nextest profile: ci_gammaloop
  21. 38.17 s gammaloop-nextest-python-api> Starting 5 tests across 1 binary
  22. 38.83 s gammaloop-nextest-python-api> FAIL [ 0.658s] (1/5) gammaloop-integration-tests::test_python_api python_session_getters_return_live_toml_and_command_blocks
  23. 38.83 s gammaloop-nextest-python-api> stdout ---
  24. 38.83 s gammaloop-nextest-python-api>
  25. 38.83 s gammaloop-nextest-python-api> running 1 test
  26. 38.83 s gammaloop-nextest-python-api> test python_session_getters_return_live_toml_and_command_blocks ... FAILED
  27. 38.83 s gammaloop-nextest-python-api>
  28. 38.83 s gammaloop-nextest-python-api> failures:
  29. 38.83 s gammaloop-nextest-python-api>
  30. 38.83 s gammaloop-nextest-python-api> failures:
  31. 38.83 s gammaloop-nextest-python-api> python_session_getters_return_live_toml_and_command_blocks
  32. 38.83 s gammaloop-nextest-python-api>
  33. 38.83 s gammaloop-nextest-python-api> test result: FAILED. 0 passed; 1 failed; 0 ignored; 0 measured; 4 filtered out; finished in 0.64s
  34. 38.83 s gammaloop-nextest-python-api>
  35. 38.83 s gammaloop-nextest-python-api> stderr ---
  36. 38.83 s gammaloop-nextest-python-api> Error: Python API test subprocess failed.
  37. 38.83 s gammaloop-nextest-python-api> stdout:
  38. 38.83 s gammaloop-nextest-python-api> ┌────────────────────────────────────────────────────────┐
  39. 38.83 s gammaloop-nextest-python-api> │ You are running a restricted Symbolica instance. │
  40. 38.83 s gammaloop-nextest-python-api> │ │
  41. 38.83 s gammaloop-nextest-python-api> │ This mode is only permitted for non-commercial use and │
  42. 38.83 s gammaloop-nextest-python-api> │ is limited to one instance and core per machine. │
  43. 38.83 s gammaloop-nextest-python-api> │ │
  44. 38.83 s gammaloop-nextest-python-api> │ Hobbyists can easily acquire a free license key │
  45. 38.83 s gammaloop-nextest-python-api> │ that unlocks all cores and removes this banner: │
  46. 38.83 s gammaloop-nextest-python-api> │ │
  47. 38.83 s gammaloop-nextest-python-api> │ from symbolica import * │
  48. 38.83 s gammaloop-nextest-python-api> │ request_hobbyist_license('YOUR_NAME', 'YOUR_EMAIL') │
  49. 38.83 s gammaloop-nextest-python-api> │ │
  50. 38.83 s gammaloop-nextest-python-api> │ All other users can obtain a free 30-day trial key: │
  51. 38.83 s gammaloop-nextest-python-api> │ │
  52. 38.83 s gammaloop-nextest-python-api> │ from symbolica import * │
  53. 38.83 s gammaloop-nextest-python-api> │ request_trial_license('NAME', 'EMAIL', 'EMPLOYER') │
  54. 38.83 s gammaloop-nextest-python-api> │ │
  55. 38.83 s gammaloop-nextest-python-api> │ See https://symbolica.io/docs/get_started.html#license │
  56. 38.83 s gammaloop-nextest-python-api> └────────────────────────────────────────────────────────┘
  57. 38.83 s gammaloop-nextest-python-api> ┌───────────────────────────────────────────────────────────────────────────────────────────────────────────┐
  58. 38.83 s gammaloop-nextest-python-api> │ Cannot start new unlicensed Symbolica instance since there is already another one running on the machine. │
  59. 38.83 s gammaloop-nextest-python-api> └───────────────────────────────────────────────────────────────────────────────────────────────────────────┘
  60. 38.83 s gammaloop-nextest-python-api>
  61. 38.83 s gammaloop-nextest-python-api> stderr:
  62. 38.83 s gammaloop-nextest-python-api> ┌───────────────────────────────────┐
  63. 38.83 s gammaloop-nextest-python-api> │ The Symbolica license has expired │
  64. 38.83 s gammaloop-nextest-python-api> └───────────────────────────────────┘
  65. 38.83 s gammaloop-nextest-python-api>
  66. 38.83 s gammaloop-nextest-python-api>
  67. 38.83 s gammaloop-nextest-python-api> Location:
  68. 38.83 s gammaloop-nextest-python-api> tests/tests/test_python_api.rs:157:20
  69. 38.83 s gammaloop-nextest-python-api>
  70. 38.85 s gammaloop-nextest-python-api> FAIL [ 0.679s] (2/5) gammaloop-integration-tests::test_python_api python_evaluate_samples_batch_and_momentum_space_have_expected_shape
  71. 38.85 s gammaloop-nextest-python-api> stdout ---
  72. 38.85 s gammaloop-nextest-python-api>
  73. 38.85 s gammaloop-nextest-python-api> running 1 test
  74. 38.85 s gammaloop-nextest-python-api> test python_evaluate_samples_batch_and_momentum_space_have_expected_shape ... FAILED
  75. 38.85 s gammaloop-nextest-python-api>
  76. 38.85 s gammaloop-nextest-python-api> failures:
  77. 38.85 s gammaloop-nextest-python-api>
  78. 38.85 s gammaloop-nextest-python-api> failures:
  79. 38.85 s gammaloop-nextest-python-api> python_evaluate_samples_batch_and_momentum_space_have_expected_shape
  80. 38.85 s gammaloop-nextest-python-api>
  81. 38.85 s gammaloop-nextest-python-api> test result: FAILED. 0 passed; 1 failed; 0 ignored; 0 measured; 4 filtered out; finished in 0.67s
  82. 38.85 s gammaloop-nextest-python-api>
  83. 38.85 s gammaloop-nextest-python-api> stderr ---
  84. 38.85 s gammaloop-nextest-python-api> Error: Python API test subprocess failed.
  85. 38.85 s gammaloop-nextest-python-api> stdout:
  86. 38.85 s gammaloop-nextest-python-api> ┌────────────────────────────────────────────────────────┐
  87. 38.85 s gammaloop-nextest-python-api> │ You are running a restricted Symbolica instance. │
  88. 38.85 s gammaloop-nextest-python-api> │ │
  89. 38.85 s gammaloop-nextest-python-api> │ This mode is only permitted for non-commercial use and │
  90. 38.85 s gammaloop-nextest-python-api> │ is limited to one instance and core per machine. │
  91. 38.85 s gammaloop-nextest-python-api> │ │
  92. 38.85 s gammaloop-nextest-python-api> │ Hobbyists can easily acquire a free license key │
  93. 38.85 s gammaloop-nextest-python-api> │ that unlocks all cores and removes this banner: │
  94. 38.85 s gammaloop-nextest-python-api> │ │
  95. 38.85 s gammaloop-nextest-python-api> │ from symbolica import * │
  96. 38.85 s gammaloop-nextest-python-api> │ request_hobbyist_license('YOUR_NAME', 'YOUR_EMAIL') │
  97. 38.85 s gammaloop-nextest-python-api> │ │
  98. 38.85 s gammaloop-nextest-python-api> │ All other users can obtain a free 30-day trial key: │
  99. 38.85 s gammaloop-nextest-python-api> │ │
  100. 38.85 s gammaloop-nextest-python-api> │ from symbolica import * │
  101. 38.85 s gammaloop-nextest-python-api> │ request_trial_license('NAME', 'EMAIL', 'EMPLOYER') │
  102. 38.85 s gammaloop-nextest-python-api> │ │
  103. 38.85 s gammaloop-nextest-python-api> │ See https://symbolica.io/docs/get_started.html#license │
  104. 38.85 s gammaloop-nextest-python-api> └────────────────────────────────────────────────────────┘
  105. 38.85 s gammaloop-nextest-python-api> ┌───────────────────────────────────────────────────────────────────────────────────────────────────────────┐
  106. 38.85 s gammaloop-nextest-python-api> │ Cannot start new unlicensed Symbolica instance since there is already another one running on the machine. │
  107. 38.85 s gammaloop-nextest-python-api> └───────────────────────────────────────────────────────────────────────────────────────────────────────────┘
  108. 38.85 s gammaloop-nextest-python-api>
  109. 38.85 s gammaloop-nextest-python-api> stderr:
  110. 38.85 s gammaloop-nextest-python-api> ┌───────────────────────────────────┐
  111. 38.85 s gammaloop-nextest-python-api> │ The Symbolica license has expired │
  112. 38.85 s gammaloop-nextest-python-api> └───────────────────────────────────┘
  113. 38.85 s gammaloop-nextest-python-api>
  114. 38.85 s gammaloop-nextest-python-api>
  115. 38.85 s gammaloop-nextest-python-api> Location:
  116. 38.85 s gammaloop-nextest-python-api> tests/tests/test_python_api.rs:157:20
  117. 38.85 s gammaloop-nextest-python-api>
  118. 38.86 s gammaloop-nextest-python-api> FAIL [ 0.691s] (3/5) gammaloop-integration-tests::test_python_api python_evaluate_sample_preserves_graph_grouping_and_incoming_pdgs
  119. 38.86 s gammaloop-nextest-python-api> stdout ---
  120. 38.86 s gammaloop-nextest-python-api>
  121. 38.86 s gammaloop-nextest-python-api> running 1 test
  122. 38.86 s gammaloop-nextest-python-api> test python_evaluate_sample_preserves_graph_grouping_and_incoming_pdgs ... FAILED
  123. 38.86 s gammaloop-nextest-python-api>
  124. 38.86 s gammaloop-nextest-python-api> failures:
  125. 38.86 s gammaloop-nextest-python-api>
  126. 38.86 s gammaloop-nextest-python-api> failures:
  127. 38.86 s gammaloop-nextest-python-api> python_evaluate_sample_preserves_graph_grouping_and_incoming_pdgs
  128. 38.86 s gammaloop-nextest-python-api>
  129. 38.86 s gammaloop-nextest-python-api> test result: FAILED. 0 passed; 1 failed; 0 ignored; 0 measured; 4 filtered out; finished in 0.67s
  130. 38.86 s gammaloop-nextest-python-api>
  131. 38.86 s gammaloop-nextest-python-api> stderr ---
  132. 38.86 s gammaloop-nextest-python-api> Error: Python API test subprocess failed.
  133. 38.86 s gammaloop-nextest-python-api> stdout:
  134. 38.86 s gammaloop-nextest-python-api> ┌────────────────────────────────────────────────────────┐
  135. 38.86 s gammaloop-nextest-python-api> │ You are running a restricted Symbolica instance. │
  136. 38.86 s gammaloop-nextest-python-api> │ │
  137. 38.86 s gammaloop-nextest-python-api> │ This mode is only permitted for non-commercial use and │
  138. 38.86 s gammaloop-nextest-python-api> │ is limited to one instance and core per machine. │
  139. 38.86 s gammaloop-nextest-python-api> │ │
  140. 38.86 s gammaloop-nextest-python-api> │ Hobbyists can easily acquire a free license key │
  141. 38.86 s gammaloop-nextest-python-api> │ that unlocks all cores and removes this banner: │
  142. 38.86 s gammaloop-nextest-python-api> │ │
  143. 38.86 s gammaloop-nextest-python-api> │ from symbolica import * │
  144. 38.86 s gammaloop-nextest-python-api> │ request_hobbyist_license('YOUR_NAME', 'YOUR_EMAIL') │
  145. 38.86 s gammaloop-nextest-python-api> │ │
  146. 38.86 s gammaloop-nextest-python-api> │ All other users can obtain a free 30-day trial key: │
  147. 38.86 s gammaloop-nextest-python-api> │ │
  148. 38.86 s gammaloop-nextest-python-api> │ from symbolica import * │
  149. 38.86 s gammaloop-nextest-python-api> │ request_trial_license('NAME', 'EMAIL', 'EMPLOYER') │
  150. 38.86 s gammaloop-nextest-python-api> │ │
  151. 38.86 s gammaloop-nextest-python-api> │ See https://symbolica.io/docs/get_started.html#license │
  152. 38.86 s gammaloop-nextest-python-api> └────────────────────────────────────────────────────────┘
  153. 38.86 s gammaloop-nextest-python-api> ┌───────────────────────────────────────────────────────────────────────────────────────────────────────────┐
  154. 38.86 s gammaloop-nextest-python-api> │ Cannot start new unlicensed Symbolica instance since there is already another one running on the machine. │
  155. 38.86 s gammaloop-nextest-python-api> └───────────────────────────────────────────────────────────────────────────────────────────────────────────┘
  156. 38.86 s gammaloop-nextest-python-api>
  157. 38.86 s gammaloop-nextest-python-api> stderr:
  158. 38.86 s gammaloop-nextest-python-api> ┌───────────────────────────────────┐
  159. 38.86 s gammaloop-nextest-python-api> │ The Symbolica license has expired │
  160. 38.86 s gammaloop-nextest-python-api> └───────────────────────────────────┘
  161. 38.86 s gammaloop-nextest-python-api>
  162. 38.86 s gammaloop-nextest-python-api>
  163. 38.86 s gammaloop-nextest-python-api> Location:
  164. 38.86 s gammaloop-nextest-python-api> tests/tests/test_python_api.rs:157:20
  165. 38.86 s gammaloop-nextest-python-api>
  166. 39.09 s gammaloop-nextest-python-api> FAIL [ 0.921s] (4/5) gammaloop-integration-tests::test_python_api python_evaluate_sample_honors_generate_events_and_observable_snapshots
  167. 39.09 s gammaloop-nextest-python-api> stdout ---
  168. 39.09 s gammaloop-nextest-python-api>
  169. 39.09 s gammaloop-nextest-python-api> running 1 test
  170. 39.09 s gammaloop-nextest-python-api> test python_evaluate_sample_honors_generate_events_and_observable_snapshots ... FAILED
  171. 39.09 s gammaloop-nextest-python-api>
  172. 39.09 s gammaloop-nextest-python-api> failures:
  173. 39.09 s gammaloop-nextest-python-api>
  174. 39.09 s gammaloop-nextest-python-api> failures:
  175. 39.09 s gammaloop-nextest-python-api> python_evaluate_sample_honors_generate_events_and_observable_snapshots
  176. 39.09 s gammaloop-nextest-python-api>
  177. 39.09 s gammaloop-nextest-python-api> test result: FAILED. 0 passed; 1 failed; 0 ignored; 0 measured; 4 filtered out; finished in 0.91s
  178. 39.09 s gammaloop-nextest-python-api>
  179. 39.09 s gammaloop-nextest-python-api> stderr ---
  180. 39.09 s gammaloop-nextest-python-api> Error: Python API test subprocess failed.
  181. 39.09 s gammaloop-nextest-python-api> stdout:
  182. 39.09 s gammaloop-nextest-python-api> ┌────────────────────────────────────────────────────────┐
  183. 39.09 s gammaloop-nextest-python-api> │ You are running a restricted Symbolica instance. │
  184. 39.09 s gammaloop-nextest-python-api> │ │
  185. 39.09 s gammaloop-nextest-python-api> │ This mode is only permitted for non-commercial use and │
  186. 39.09 s gammaloop-nextest-python-api> │ is limited to one instance and core per machine. │
  187. 39.09 s gammaloop-nextest-python-api> │ │
  188. 39.09 s gammaloop-nextest-python-api> │ Hobbyists can easily acquire a free license key │
  189. 39.09 s gammaloop-nextest-python-api> │ that unlocks all cores and removes this banner: │
  190. 39.09 s gammaloop-nextest-python-api> │ │
  191. 39.09 s gammaloop-nextest-python-api> │ from symbolica import * │
  192. 39.09 s gammaloop-nextest-python-api> │ request_hobbyist_license('YOUR_NAME', 'YOUR_EMAIL') │
  193. 39.09 s gammaloop-nextest-python-api> │ │
  194. 39.09 s gammaloop-nextest-python-api> │ All other users can obtain a free 30-day trial key: │
  195. 39.09 s gammaloop-nextest-python-api> │ │
  196. 39.09 s gammaloop-nextest-python-api> │ from symbolica import * │
  197. 39.09 s gammaloop-nextest-python-api> │ request_trial_license('NAME', 'EMAIL', 'EMPLOYER') │
  198. 39.09 s gammaloop-nextest-python-api> │ │
  199. 39.09 s gammaloop-nextest-python-api> │ See https://symbolica.io/docs/get_started.html#license │
  200. 39.09 s gammaloop-nextest-python-api> └────────────────────────────────────────────────────────┘
  201. 39.09 s gammaloop-nextest-python-api> ┌───────────────────────────────────────────────────────────────────────────────────────────────────────────┐
  202. 39.09 s gammaloop-nextest-python-api> │ Cannot start new unlicensed Symbolica instance since there is already another one running on the machine. │
  203. 39.09 s gammaloop-nextest-python-api> └───────────────────────────────────────────────────────────────────────────────────────────────────────────┘
  204. 39.09 s gammaloop-nextest-python-api>
  205. 39.09 s gammaloop-nextest-python-api> stderr:
  206. 39.09 s gammaloop-nextest-python-api> ┌───────────────────────────────────┐
  207. 39.09 s gammaloop-nextest-python-api> │ The Symbolica license has expired │
  208. 39.09 s gammaloop-nextest-python-api> └───────────────────────────────────┘
  209. 39.09 s gammaloop-nextest-python-api> [2026-09-02 02:19:17.561] @gammaloop_api::se... INFO : Running command import model sm-default
  210. 39.09 s gammaloop-nextest-python-api> [2026-09-02 02:19:17.561] @import::model INFO : Loading built-in JSON model sm-default
  211. 39.09 s gammaloop-nextest-python-api> [2026-09-02 02:19:17.585] @gammaloop_api::se... INFO : Running command set default-runtime kv kinematics.externals='{"type":"constant","data":{"momenta":[[32.0,0.0,0.0,32.0],[32.0,0.0,0.0,-32.0]],"helicities":[1,1]}}'
  212. 39.09 s gammaloop-nextest-python-api> [2026-09-02 02:19:17.586] @gammaloop_api::se... INFO : Running command set default-runtime kv subtraction.disable_threshold_subtraction=true
  213. 39.09 s gammaloop-nextest-python-api> [2026-09-02 02:19:17.587] @gammaloop_api::se... INFO : Running command generate xs e+ e- > d d~ g | e- a d g QED^2==4 [{{2}} QCD=0] --numerator-grouping group_identical_graphs_up_to_sign --clear-existing-processes --only-diagrams
  214. 39.09 s gammaloop-nextest-python-api> [2026-09-02 02:19:17.979] @commands::generate INFO : Generated cross-section 2 graphs.
  215. 39.09 s gammaloop-nextest-python-api> [2026-09-02 02:19:17.979] @commands::generate INFO : Only diagram generation was requested, skipping integrand generation. You can generate integrands later using the 'generate existing <options>' command.
  216. 39.09 s gammaloop-nextest-python-api> [2026-09-02 02:19:17.980] @gammaloop_api::se... INFO : Running command generate
  217. 39.09 s gammaloop-nextest-python-api>
  218. 39.09 s gammaloop-nextest-python-api>
  219. 39.09 s gammaloop-nextest-python-api> Location:
  220. 39.09 s gammaloop-nextest-python-api> tests/tests/test_python_api.rs:157:20
  221. 39.09 s gammaloop-nextest-python-api>
  222. 39.14 s gammaloop-nextest-python-api> FAIL [ 0.965s] (5/5) gammaloop-integration-tests::test_python_api python_settings_wrappers_expose_nested_runtime_and_global_settings
  223. 39.14 s gammaloop-nextest-python-api> stdout ---
  224. 39.14 s gammaloop-nextest-python-api>
  225. 39.14 s gammaloop-nextest-python-api> running 1 test
  226. 39.14 s gammaloop-nextest-python-api> test python_settings_wrappers_expose_nested_runtime_and_global_settings ... FAILED
  227. 39.14 s gammaloop-nextest-python-api>
  228. 39.14 s gammaloop-nextest-python-api> failures:
  229. 39.14 s gammaloop-nextest-python-api>
  230. 39.14 s gammaloop-nextest-python-api> failures:
  231. 39.14 s gammaloop-nextest-python-api> python_settings_wrappers_expose_nested_runtime_and_global_settings
  232. 39.14 s gammaloop-nextest-python-api>
  233. 39.14 s gammaloop-nextest-python-api> test result: FAILED. 0 passed; 1 failed; 0 ignored; 0 measured; 4 filtered out; finished in 0.95s
  234. 39.14 s gammaloop-nextest-python-api>
  235. 39.14 s gammaloop-nextest-python-api> stderr ---
  236. 39.14 s gammaloop-nextest-python-api> Error: Python API test subprocess failed.
  237. 39.14 s gammaloop-nextest-python-api> stdout:
  238. 39.14 s gammaloop-nextest-python-api> ┌────────────────────────────────────────────────────────┐
  239. 39.14 s gammaloop-nextest-python-api> │ You are running a restricted Symbolica instance. │
  240. 39.14 s gammaloop-nextest-python-api> │ │
  241. 39.15 s gammaloop-nextest-python-api> │ This mode is only permitted for non-commercial use and │
  242. 39.15 s gammaloop-nextest-python-api> │ is limited to one instance and core per machine. │
  243. 39.15 s gammaloop-nextest-python-api> │ │
  244. 39.15 s gammaloop-nextest-python-api> │ Hobbyists can easily acquire a free license key │
  245. 39.15 s gammaloop-nextest-python-api> │ that unlocks all cores and removes this banner: │
  246. 39.15 s gammaloop-nextest-python-api> │ │
  247. 39.15 s gammaloop-nextest-python-api> │ from symbolica import * │
  248. 39.15 s gammaloop-nextest-python-api> │ request_hobbyist_license('YOUR_NAME', 'YOUR_EMAIL') │
  249. 39.15 s gammaloop-nextest-python-api> │ │
  250. 39.15 s gammaloop-nextest-python-api> │ All other users can obtain a free 30-day trial key: │
  251. 39.15 s gammaloop-nextest-python-api> │ │
  252. 39.15 s gammaloop-nextest-python-api> │ from symbolica import * │
  253. 39.15 s gammaloop-nextest-python-api> │ request_trial_license('NAME', 'EMAIL', 'EMPLOYER') │
  254. 39.15 s gammaloop-nextest-python-api> │ │
  255. 39.15 s gammaloop-nextest-python-api> │ See https://symbolica.io/docs/get_started.html#license │
  256. 39.15 s gammaloop-nextest-python-api> └────────────────────────────────────────────────────────┘
  257. 39.15 s gammaloop-nextest-python-api> ┌───────────────────────────────────────────────────────────────────────────────────────────────────────────┐
  258. 39.15 s gammaloop-nextest-python-api> │ Cannot start new unlicensed Symbolica instance since there is already another one running on the machine. │
  259. 39.15 s gammaloop-nextest-python-api> └───────────────────────────────────────────────────────────────────────────────────────────────────────────┘
  260. 39.15 s gammaloop-nextest-python-api>
  261. 39.15 s gammaloop-nextest-python-api> stderr:
  262. 39.15 s gammaloop-nextest-python-api> ┌───────────────────────────────────┐
  263. 39.15 s gammaloop-nextest-python-api> │ The Symbolica license has expired │
  264. 39.15 s gammaloop-nextest-python-api> └───────────────────────────────────┘
  265. 39.15 s gammaloop-nextest-python-api>
  266. 39.15 s gammaloop-nextest-python-api>
  267. 39.15 s gammaloop-nextest-python-api> Location:
  268. 39.15 s gammaloop-nextest-python-api> tests/tests/test_python_api.rs:157:20
  269. 39.15 s gammaloop-nextest-python-api>
  270. 39.15 s gammaloop-nextest-python-api> ------------
  271. 39.15 s gammaloop-nextest-python-api> Summary [ 0.972s] 5 tests run: 0 passed, 5 failed, 0 skipped
  272. 39.15 s gammaloop-nextest-python-api> FAIL [ 0.658s] (1/5) gammaloop-integration-tests::test_python_api python_session_getters_return_live_toml_and_command_blocks
  273. 39.15 s gammaloop-nextest-python-api> stdout ---
  274. 39.15 s gammaloop-nextest-python-api>
  275. 39.15 s gammaloop-nextest-python-api> running 1 test
  276. 39.15 s gammaloop-nextest-python-api> test python_session_getters_return_live_toml_and_command_blocks ... FAILED
  277. 39.15 s gammaloop-nextest-python-api>
  278. 39.15 s gammaloop-nextest-python-api> failures:
  279. 39.15 s gammaloop-nextest-python-api>
  280. 39.15 s gammaloop-nextest-python-api> failures:
  281. 39.15 s gammaloop-nextest-python-api> python_session_getters_return_live_toml_and_command_blocks
  282. 39.15 s gammaloop-nextest-python-api>
  283. 39.15 s gammaloop-nextest-python-api> test result: FAILED. 0 passed; 1 failed; 0 ignored; 0 measured; 4 filtered out; finished in 0.64s
  284. 39.15 s gammaloop-nextest-python-api>
  285. 39.15 s gammaloop-nextest-python-api> stderr ---
  286. 39.15 s gammaloop-nextest-python-api> Error: Python API test subprocess failed.
  287. 39.15 s gammaloop-nextest-python-api> stdout:
  288. 39.15 s gammaloop-nextest-python-api> ┌────────────────────────────────────────────────────────┐
  289. 39.15 s gammaloop-nextest-python-api> │ You are running a restricted Symbolica instance. │
  290. 39.15 s gammaloop-nextest-python-api> │ │
  291. 39.15 s gammaloop-nextest-python-api> │ This mode is only permitted for non-commercial use and │
  292. 39.15 s gammaloop-nextest-python-api> │ is limited to one instance and core per machine. │
  293. 39.15 s gammaloop-nextest-python-api> │ │
  294. 39.15 s gammaloop-nextest-python-api> │ Hobbyists can easily acquire a free license key │
  295. 39.15 s gammaloop-nextest-python-api> │ that unlocks all cores and removes this banner: │
  296. 39.15 s gammaloop-nextest-python-api> │ │
  297. 39.15 s gammaloop-nextest-python-api> │ from symbolica import * │
  298. 39.15 s gammaloop-nextest-python-api> │ request_hobbyist_license('YOUR_NAME', 'YOUR_EMAIL') │
  299. 39.15 s gammaloop-nextest-python-api> │ │
  300. 39.15 s gammaloop-nextest-python-api> │ All other users can obtain a free 30-day trial key: │
  301. 39.15 s gammaloop-nextest-python-api> │ │
  302. 39.15 s gammaloop-nextest-python-api> │ from symbolica import * │
  303. 39.15 s gammaloop-nextest-python-api> │ request_trial_license('NAME', 'EMAIL', 'EMPLOYER') │
  304. 39.15 s gammaloop-nextest-python-api> │ │
  305. 39.15 s gammaloop-nextest-python-api> │ See https://symbolica.io/docs/get_started.html#license │
  306. 39.15 s gammaloop-nextest-python-api> └────────────────────────────────────────────────────────┘
  307. 39.15 s gammaloop-nextest-python-api> ┌───────────────────────────────────────────────────────────────────────────────────────────────────────────┐
  308. 39.15 s gammaloop-nextest-python-api> │ Cannot start new unlicensed Symbolica instance since there is already another one running on the machine. │
  309. 39.15 s gammaloop-nextest-python-api> └───────────────────────────────────────────────────────────────────────────────────────────────────────────┘
  310. 39.15 s gammaloop-nextest-python-api>
  311. 39.15 s gammaloop-nextest-python-api> stderr:
  312. 39.15 s gammaloop-nextest-python-api> ┌───────────────────────────────────┐
  313. 39.15 s gammaloop-nextest-python-api> │ The Symbolica license has expired │
  314. 39.15 s gammaloop-nextest-python-api> └───────────────────────────────────┘
  315. 39.15 s gammaloop-nextest-python-api>
  316. 39.15 s gammaloop-nextest-python-api>
  317. 39.15 s gammaloop-nextest-python-api> Location:
  318. 39.15 s gammaloop-nextest-python-api> tests/tests/test_python_api.rs:157:20
  319. 39.15 s gammaloop-nextest-python-api>
  320. 39.15 s gammaloop-nextest-python-api> FAIL [ 0.679s] (2/5) gammaloop-integration-tests::test_python_api python_evaluate_samples_batch_and_momentum_space_have_expected_shape
  321. 39.15 s gammaloop-nextest-python-api> stdout ---
  322. 39.15 s gammaloop-nextest-python-api>
  323. 39.15 s gammaloop-nextest-python-api> running 1 test
  324. 39.15 s gammaloop-nextest-python-api> test python_evaluate_samples_batch_and_momentum_space_have_expected_shape ... FAILED
  325. 39.15 s gammaloop-nextest-python-api>
  326. 39.15 s gammaloop-nextest-python-api> failures:
  327. 39.15 s gammaloop-nextest-python-api>
  328. 39.15 s gammaloop-nextest-python-api> failures:
  329. 39.15 s gammaloop-nextest-python-api> python_evaluate_samples_batch_and_momentum_space_have_expected_shape
  330. 39.15 s gammaloop-nextest-python-api>
  331. 39.15 s gammaloop-nextest-python-api> test result: FAILED. 0 passed; 1 failed; 0 ignored; 0 measured; 4 filtered out; finished in 0.67s
  332. 39.15 s gammaloop-nextest-python-api>
  333. 39.15 s gammaloop-nextest-python-api> stderr ---
  334. 39.15 s gammaloop-nextest-python-api> Error: Python API test subprocess failed.
  335. 39.15 s gammaloop-nextest-python-api> stdout:
  336. 39.15 s gammaloop-nextest-python-api> ┌────────────────────────────────────────────────────────┐
  337. 39.15 s gammaloop-nextest-python-api> │ You are running a restricted Symbolica instance. │
  338. 39.15 s gammaloop-nextest-python-api> │ │
  339. 39.15 s gammaloop-nextest-python-api> │ This mode is only permitted for non-commercial use and │
  340. 39.15 s gammaloop-nextest-python-api> │ is limited to one instance and core per machine. │
  341. 39.15 s gammaloop-nextest-python-api> │ │
  342. 39.15 s gammaloop-nextest-python-api> │ Hobbyists can easily acquire a free license key │
  343. 39.15 s gammaloop-nextest-python-api> │ that unlocks all cores and removes this banner: │
  344. 39.15 s gammaloop-nextest-python-api> │ │
  345. 39.15 s gammaloop-nextest-python-api> │ from symbolica import * │
  346. 39.15 s gammaloop-nextest-python-api> │ request_hobbyist_license('YOUR_NAME', 'YOUR_EMAIL') │
  347. 39.15 s gammaloop-nextest-python-api> │ │
  348. 39.15 s gammaloop-nextest-python-api> │ All other users can obtain a free 30-day trial key: │
  349. 39.15 s gammaloop-nextest-python-api> │ │
  350. 39.15 s gammaloop-nextest-python-api> │ from symbolica import * │
  351. 39.15 s gammaloop-nextest-python-api> │ request_trial_license('NAME', 'EMAIL', 'EMPLOYER') │
  352. 39.15 s gammaloop-nextest-python-api> │ │
  353. 39.15 s gammaloop-nextest-python-api> │ See https://symbolica.io/docs/get_started.html#license │
  354. 39.15 s gammaloop-nextest-python-api> └────────────────────────────────────────────────────────┘
  355. 39.15 s gammaloop-nextest-python-api> ┌───────────────────────────────────────────────────────────────────────────────────────────────────────────┐
  356. 39.15 s gammaloop-nextest-python-api> │ Cannot start new unlicensed Symbolica instance since there is already another one running on the machine. │
  357. 39.15 s gammaloop-nextest-python-api> └───────────────────────────────────────────────────────────────────────────────────────────────────────────┘
  358. 39.15 s gammaloop-nextest-python-api>
  359. 39.15 s gammaloop-nextest-python-api> stderr:
  360. 39.15 s gammaloop-nextest-python-api> ┌───────────────────────────────────┐
  361. 39.15 s gammaloop-nextest-python-api> │ The Symbolica license has expired │
  362. 39.15 s gammaloop-nextest-python-api> └───────────────────────────────────┘
  363. 39.15 s gammaloop-nextest-python-api>
  364. 39.15 s gammaloop-nextest-python-api>
  365. 39.15 s gammaloop-nextest-python-api> Location:
  366. 39.15 s gammaloop-nextest-python-api> tests/tests/test_python_api.rs:157:20
  367. 39.15 s gammaloop-nextest-python-api>
  368. 39.15 s gammaloop-nextest-python-api> FAIL [ 0.691s] (3/5) gammaloop-integration-tests::test_python_api python_evaluate_sample_preserves_graph_grouping_and_incoming_pdgs
  369. 39.15 s gammaloop-nextest-python-api> stdout ---
  370. 39.15 s gammaloop-nextest-python-api>
  371. 39.15 s gammaloop-nextest-python-api> running 1 test
  372. 39.15 s gammaloop-nextest-python-api> test python_evaluate_sample_preserves_graph_grouping_and_incoming_pdgs ... FAILED
  373. 39.15 s gammaloop-nextest-python-api>
  374. 39.15 s gammaloop-nextest-python-api> failures:
  375. 39.15 s gammaloop-nextest-python-api>
  376. 39.15 s gammaloop-nextest-python-api> failures:
  377. 39.15 s gammaloop-nextest-python-api> python_evaluate_sample_preserves_graph_grouping_and_incoming_pdgs
  378. 39.15 s gammaloop-nextest-python-api>
  379. 39.15 s gammaloop-nextest-python-api> test result: FAILED. 0 passed; 1 failed; 0 ignored; 0 measured; 4 filtered out; finished in 0.67s
  380. 39.15 s gammaloop-nextest-python-api>
  381. 39.15 s gammaloop-nextest-python-api> stderr ---
  382. 39.15 s gammaloop-nextest-python-api> Error: Python API test subprocess failed.
  383. 39.15 s gammaloop-nextest-python-api> stdout:
  384. 39.15 s gammaloop-nextest-python-api> ┌────────────────────────────────────────────────────────┐
  385. 39.15 s gammaloop-nextest-python-api> │ You are running a restricted Symbolica instance. │
  386. 39.15 s gammaloop-nextest-python-api> │ │
  387. 39.15 s gammaloop-nextest-python-api> │ This mode is only permitted for non-commercial use and │
  388. 39.15 s gammaloop-nextest-python-api> │ is limited to one instance and core per machine. │
  389. 39.15 s gammaloop-nextest-python-api> │ │
  390. 39.15 s gammaloop-nextest-python-api> │ Hobbyists can easily acquire a free license key │
  391. 39.15 s gammaloop-nextest-python-api> │ that unlocks all cores and removes this banner: │
  392. 39.15 s gammaloop-nextest-python-api> │ │
  393. 39.15 s gammaloop-nextest-python-api> │ from symbolica import * │
  394. 39.15 s gammaloop-nextest-python-api> │ request_hobbyist_license('YOUR_NAME', 'YOUR_EMAIL') │
  395. 39.15 s gammaloop-nextest-python-api> │ │
  396. 39.15 s gammaloop-nextest-python-api> │ All other users can obtain a free 30-day trial key: │
  397. 39.15 s gammaloop-nextest-python-api> │ │
  398. 39.15 s gammaloop-nextest-python-api> │ from symbolica import * │
  399. 39.15 s gammaloop-nextest-python-api> │ request_trial_license('NAME', 'EMAIL', 'EMPLOYER') │
  400. 39.15 s gammaloop-nextest-python-api> │ │
  401. 39.15 s gammaloop-nextest-python-api> │ See https://symbolica.io/docs/get_started.html#license │
  402. 39.15 s gammaloop-nextest-python-api> └────────────────────────────────────────────────────────┘
  403. 39.15 s gammaloop-nextest-python-api> ┌───────────────────────────────────────────────────────────────────────────────────────────────────────────┐
  404. 39.15 s gammaloop-nextest-python-api> │ Cannot start new unlicensed Symbolica instance since there is already another one running on the machine. │
  405. 39.15 s gammaloop-nextest-python-api> └───────────────────────────────────────────────────────────────────────────────────────────────────────────┘
  406. 39.15 s gammaloop-nextest-python-api>
  407. 39.15 s gammaloop-nextest-python-api> stderr:
  408. 39.15 s gammaloop-nextest-python-api> ┌───────────────────────────────────┐
  409. 39.15 s gammaloop-nextest-python-api> │ The Symbolica license has expired │
  410. 39.15 s gammaloop-nextest-python-api> └───────────────────────────────────┘
  411. 39.15 s gammaloop-nextest-python-api>
  412. 39.15 s gammaloop-nextest-python-api>
  413. 39.15 s gammaloop-nextest-python-api> Location:
  414. 39.15 s gammaloop-nextest-python-api> tests/tests/test_python_api.rs:157:20
  415. 39.15 s gammaloop-nextest-python-api>
  416. 39.15 s gammaloop-nextest-python-api> FAIL [ 0.921s] (4/5) gammaloop-integration-tests::test_python_api python_evaluate_sample_honors_generate_events_and_observable_snapshots
  417. 39.15 s gammaloop-nextest-python-api> stdout ---
  418. 39.15 s gammaloop-nextest-python-api>
  419. 39.15 s gammaloop-nextest-python-api> running 1 test
  420. 39.15 s gammaloop-nextest-python-api> test python_evaluate_sample_honors_generate_events_and_observable_snapshots ... FAILED
  421. 39.15 s gammaloop-nextest-python-api>
  422. 39.15 s gammaloop-nextest-python-api> failures:
  423. 39.15 s gammaloop-nextest-python-api>
  424. 39.15 s gammaloop-nextest-python-api> failures:
  425. 39.15 s gammaloop-nextest-python-api> python_evaluate_sample_honors_generate_events_and_observable_snapshots
  426. 39.15 s gammaloop-nextest-python-api>
  427. 39.15 s gammaloop-nextest-python-api> test result: FAILED. 0 passed; 1 failed; 0 ignored; 0 measured; 4 filtered out; finished in 0.91s
  428. 39.15 s gammaloop-nextest-python-api>
  429. 39.15 s gammaloop-nextest-python-api> stderr ---
  430. 39.15 s gammaloop-nextest-python-api> Error: Python API test subprocess failed.
  431. 39.15 s gammaloop-nextest-python-api> stdout:
  432. 39.15 s gammaloop-nextest-python-api> ┌────────────────────────────────────────────────────────┐
  433. 39.15 s gammaloop-nextest-python-api> │ You are running a restricted Symbolica instance. │
  434. 39.15 s gammaloop-nextest-python-api> │ │
  435. 39.15 s gammaloop-nextest-python-api> │ This mode is only permitted for non-commercial use and │
  436. 39.15 s gammaloop-nextest-python-api> │ is limited to one instance and core per machine. │
  437. 39.15 s gammaloop-nextest-python-api> │ │
  438. 39.15 s gammaloop-nextest-python-api> │ Hobbyists can easily acquire a free license key │
  439. 39.15 s gammaloop-nextest-python-api> │ that unlocks all cores and removes this banner: │
  440. 39.15 s gammaloop-nextest-python-api> │ │
  441. 39.15 s gammaloop-nextest-python-api> │ from symbolica import * │
  442. 39.15 s gammaloop-nextest-python-api> │ request_hobbyist_license('YOUR_NAME', 'YOUR_EMAIL') │
  443. 39.15 s gammaloop-nextest-python-api> │ │
  444. 39.15 s gammaloop-nextest-python-api> │ All other users can obtain a free 30-day trial key: │
  445. 39.15 s gammaloop-nextest-python-api> │ │
  446. 39.15 s gammaloop-nextest-python-api> │ from symbolica import * │
  447. 39.15 s gammaloop-nextest-python-api> │ request_trial_license('NAME', 'EMAIL', 'EMPLOYER') │
  448. 39.15 s gammaloop-nextest-python-api> │ │
  449. 39.15 s gammaloop-nextest-python-api> │ See https://symbolica.io/docs/get_started.html#license │
  450. 39.15 s gammaloop-nextest-python-api> └────────────────────────────────────────────────────────┘
  451. 39.15 s gammaloop-nextest-python-api> ┌───────────────────────────────────────────────────────────────────────────────────────────────────────────┐
  452. 39.15 s gammaloop-nextest-python-api> │ Cannot start new unlicensed Symbolica instance since there is already another one running on the machine. │
  453. 39.15 s gammaloop-nextest-python-api> └───────────────────────────────────────────────────────────────────────────────────────────────────────────┘
  454. 39.15 s gammaloop-nextest-python-api>
  455. 39.15 s gammaloop-nextest-python-api> stderr:
  456. 39.15 s gammaloop-nextest-python-api> ┌───────────────────────────────────┐
  457. 39.15 s gammaloop-nextest-python-api> │ The Symbolica license has expired │
  458. 39.15 s gammaloop-nextest-python-api> └───────────────────────────────────┘
  459. 39.15 s gammaloop-nextest-python-api> [2026-09-02 02:19:17.561] @gammaloop_api::se... INFO : Running command import model sm-default
  460. 39.15 s gammaloop-nextest-python-api> [2026-09-02 02:19:17.561] @import::model INFO : Loading built-in JSON model sm-default
  461. 39.15 s gammaloop-nextest-python-api> [2026-09-02 02:19:17.585] @gammaloop_api::se... INFO : Running command set default-runtime kv kinematics.externals='{"type":"constant","data":{"momenta":[[32.0,0.0,0.0,32.0],[32.0,0.0,0.0,-32.0]],"helicities":[1,1]}}'
  462. 39.15 s gammaloop-nextest-python-api> [2026-09-02 02:19:17.586] @gammaloop_api::se... INFO : Running command set default-runtime kv subtraction.disable_threshold_subtraction=true
  463. 39.15 s gammaloop-nextest-python-api> [2026-09-02 02:19:17.587] @gammaloop_api::se... INFO : Running command generate xs e+ e- > d d~ g | e- a d g QED^2==4 [{{2}} QCD=0] --numerator-grouping group_identical_graphs_up_to_sign --clear-existing-processes --only-diagrams
  464. 39.15 s gammaloop-nextest-python-api> [2026-09-02 02:19:17.979] @commands::generate INFO : Generated cross-section 2 graphs.
  465. 39.15 s gammaloop-nextest-python-api> [2026-09-02 02:19:17.979] @commands::generate INFO : Only diagram generation was requested, skipping integrand generation. You can generate integrands later using the 'generate existing <options>' command.
  466. 39.15 s gammaloop-nextest-python-api> [2026-09-02 02:19:17.980] @gammaloop_api::se... INFO : Running command generate
  467. 39.15 s gammaloop-nextest-python-api>
  468. 39.15 s gammaloop-nextest-python-api>
  469. 39.15 s gammaloop-nextest-python-api> Location:
  470. 39.15 s gammaloop-nextest-python-api> tests/tests/test_python_api.rs:157:20
  471. 39.15 s gammaloop-nextest-python-api>
  472. 39.15 s gammaloop-nextest-python-api> FAIL [ 0.965s] (5/5) gammaloop-integration-tests::test_python_api python_settings_wrappers_expose_nested_runtime_and_global_settings
  473. 39.15 s gammaloop-nextest-python-api> stdout ---
  474. 39.15 s gammaloop-nextest-python-api>
  475. 39.15 s gammaloop-nextest-python-api> running 1 test
  476. 39.15 s gammaloop-nextest-python-api> test python_settings_wrappers_expose_nested_runtime_and_global_settings ... FAILED
  477. 39.15 s gammaloop-nextest-python-api>
  478. 39.15 s gammaloop-nextest-python-api> failures:
  479. 39.15 s gammaloop-nextest-python-api>
  480. 39.15 s gammaloop-nextest-python-api> failures:
  481. 39.15 s gammaloop-nextest-python-api> python_settings_wrappers_expose_nested_runtime_and_global_settings
  482. 39.15 s gammaloop-nextest-python-api>
  483. 39.15 s gammaloop-nextest-python-api> test result: FAILED. 0 passed; 1 failed; 0 ignored; 0 measured; 4 filtered out; finished in 0.95s
  484. 39.15 s gammaloop-nextest-python-api>
  485. 39.15 s gammaloop-nextest-python-api> stderr ---
  486. 39.15 s gammaloop-nextest-python-api> Error: Python API test subprocess failed.
  487. 39.15 s gammaloop-nextest-python-api> stdout:
  488. 39.15 s gammaloop-nextest-python-api> ┌────────────────────────────────────────────────────────┐
  489. 39.15 s gammaloop-nextest-python-api> │ You are running a restricted Symbolica instance. │
  490. 39.15 s gammaloop-nextest-python-api> │ │
  491. 39.15 s gammaloop-nextest-python-api> │ This mode is only permitted for non-commercial use and │
  492. 39.15 s gammaloop-nextest-python-api> │ is limited to one instance and core per machine. │
  493. 39.15 s gammaloop-nextest-python-api> │ │
  494. 39.15 s gammaloop-nextest-python-api> │ Hobbyists can easily acquire a free license key │
  495. 39.15 s gammaloop-nextest-python-api> │ that unlocks all cores and removes this banner: │
  496. 39.15 s gammaloop-nextest-python-api> │ │
  497. 39.15 s gammaloop-nextest-python-api> │ from symbolica import * │
  498. 39.15 s gammaloop-nextest-python-api> │ request_hobbyist_license('YOUR_NAME', 'YOUR_EMAIL') │
  499. 39.15 s gammaloop-nextest-python-api> │ │
  500. 39.15 s gammaloop-nextest-python-api> │ All other users can obtain a free 30-day trial key: │
  501. 39.15 s gammaloop-nextest-python-api> │ │
  502. 39.15 s gammaloop-nextest-python-api> │ from symbolica import * │
  503. 39.15 s gammaloop-nextest-python-api> │ request_trial_license('NAME', 'EMAIL', 'EMPLOYER') │
  504. 39.15 s gammaloop-nextest-python-api> │ │
  505. 39.15 s gammaloop-nextest-python-api> │ See https://symbolica.io/docs/get_started.html#license │
  506. 39.15 s gammaloop-nextest-python-api> └────────────────────────────────────────────────────────┘
  507. 39.15 s gammaloop-nextest-python-api> ┌───────────────────────────────────────────────────────────────────────────────────────────────────────────┐
  508. 39.15 s gammaloop-nextest-python-api> │ Cannot start new unlicensed Symbolica instance since there is already another one running on the machine. │
  509. 39.15 s gammaloop-nextest-python-api> └───────────────────────────────────────────────────────────────────────────────────────────────────────────┘
  510. 39.15 s gammaloop-nextest-python-api>
  511. 39.15 s gammaloop-nextest-python-api> stderr:
  512. 39.15 s gammaloop-nextest-python-api> ┌───────────────────────────────────┐
  513. 39.15 s gammaloop-nextest-python-api> │ The Symbolica license has expired │
  514. 39.15 s gammaloop-nextest-python-api> └───────────────────────────────────┘
  515. 39.15 s gammaloop-nextest-python-api>
  516. 39.15 s gammaloop-nextest-python-api>
  517. 39.15 s gammaloop-nextest-python-api> Location:
  518. 39.15 s gammaloop-nextest-python-api> tests/tests/test_python_api.rs:157:20
  519. 39.15 s gammaloop-nextest-python-api>
  520. 39.17 s gammaloop-nextest-python-api> error: test run failed
  521. 39.21 s gammaloop-nextest-python-api>
  522. 39.21 s gammaloop-nextest-python-api> ========== nextest test summary ==========
  523. 39.21 s gammaloop-nextest-python-api> report: target/nextest/ci_gammaloop/junit.xml
  524. 39.21 s gammaloop-nextest-python-api> tests: 5, failures: 5, errors: 0
  525. 39.21 s gammaloop-nextest-python-api>
  526. 39.21 s gammaloop-nextest-python-api> 1. gammaloop-integration-tests::test_python_api::python_session_getters_return_live_toml_and_command_blocks
  527. 39.21 s gammaloop-nextest-python-api> failure: test failure with exit code 101
  528. 39.21 s gammaloop-nextest-python-api> Error: Python API test subprocess failed.
  529. 39.21 s gammaloop-nextest-python-api> stdout:
  530. 39.21 s gammaloop-nextest-python-api> ┌────────────────────────────────────────────────────────┐
  531. 39.21 s gammaloop-nextest-python-api> │ You are running a restricted Symbolica instance. │
  532. 39.21 s gammaloop-nextest-python-api> │ │
  533. 39.21 s gammaloop-nextest-python-api> │ This mode is only permitted for non-commercial use and │
  534. 39.21 s gammaloop-nextest-python-api> │ is limited to one instance and core per machine. │
  535. 39.21 s gammaloop-nextest-python-api> │ │
  536. 39.21 s gammaloop-nextest-python-api> │ Hobbyists can easily acquire a free license key │
  537. 39.21 s gammaloop-nextest-python-api> │ that unlocks all cores and removes this banner: │
  538. 39.21 s gammaloop-nextest-python-api> │ │
  539. 39.21 s gammaloop-nextest-python-api> │ from symbolica import * │
  540. 39.21 s gammaloop-nextest-python-api> │ request_hobbyist_license('YOUR_NAME', 'YOUR_EMAIL') │
  541. 39.21 s gammaloop-nextest-python-api> │ │
  542. 39.21 s gammaloop-nextest-python-api> │ All other users can obtain a free 30-day trial key: │
  543. 39.21 s gammaloop-nextest-python-api> │ │
  544. 39.21 s gammaloop-nextest-python-api> │ from symbolica import * │
  545. 39.21 s gammaloop-nextest-python-api> │ request_trial_license('NAME', 'EMAIL', 'EMPLOYER') │
  546. 39.21 s gammaloop-nextest-python-api> │ │
  547. 39.21 s gammaloop-nextest-python-api> │ See https://symbolica.io/docs/get_started.html#license │
  548. 39.21 s gammaloop-nextest-python-api> └────────────────────────────────────────────────────────┘
  549. 39.21 s gammaloop-nextest-python-api> ┌───────────────────────────────────────────────────────────────────────────────────────────────────────────┐
  550. 39.21 s gammaloop-nextest-python-api> │ Cannot start new unlicensed Symbolica instance since there is already another one running on the machine. │
  551. 39.21 s gammaloop-nextest-python-api> └───────────────────────────────────────────────────────────────────────────────────────────────────────────┘
  552. 39.21 s gammaloop-nextest-python-api>
  553. 39.21 s gammaloop-nextest-python-api> stderr:
  554. 39.21 s gammaloop-nextest-python-api> ┌───────────────────────────────────┐
  555. 39.21 s gammaloop-nextest-python-api> │ The Symbolica license has expired │
  556. 39.21 s gammaloop-nextest-python-api> └───────────────────────────────────┘
  557. 39.21 s gammaloop-nextest-python-api>
  558. 39.21 s gammaloop-nextest-python-api>
  559. 39.21 s gammaloop-nextest-python-api> Location:
  560. 39.21 s gammaloop-nextest-python-api> tests/tests/test_python_api.rs:157:20
  561. 39.21 s gammaloop-nextest-python-api> system-out
  562. 39.21 s gammaloop-nextest-python-api> running 1 test
  563. 39.21 s gammaloop-nextest-python-api> test python_session_getters_return_live_toml_and_command_blocks ... FAILED
  564. 39.21 s gammaloop-nextest-python-api>
  565. 39.21 s gammaloop-nextest-python-api> failures:
  566. 39.21 s gammaloop-nextest-python-api>
  567. 39.22 s gammaloop-nextest-python-api> failures:
  568. 39.22 s gammaloop-nextest-python-api> python_session_getters_return_live_toml_and_command_blocks
  569. 39.22 s gammaloop-nextest-python-api>
  570. 39.22 s gammaloop-nextest-python-api> test result: FAILED. 0 passed; 1 failed; 0 ignored; 0 measured; 4 filtered out; finished in 0.64s
  571. 39.22 s gammaloop-nextest-python-api> system-err
  572. 39.22 s gammaloop-nextest-python-api> Error: Python API test subprocess failed.
  573. 39.22 s gammaloop-nextest-python-api> stdout:
  574. 39.22 s gammaloop-nextest-python-api> ┌────────────────────────────────────────────────────────┐
  575. 39.22 s gammaloop-nextest-python-api> │ You are running a restricted Symbolica instance. │
  576. 39.22 s gammaloop-nextest-python-api> │ │
  577. 39.22 s gammaloop-nextest-python-api> │ This mode is only permitted for non-commercial use and │
  578. 39.22 s gammaloop-nextest-python-api> │ is limited to one instance and core per machine. │
  579. 39.22 s gammaloop-nextest-python-api> │ │
  580. 39.22 s gammaloop-nextest-python-api> │ Hobbyists can easily acquire a free license key │
  581. 39.22 s gammaloop-nextest-python-api> │ that unlocks all cores and removes this banner: │
  582. 39.22 s gammaloop-nextest-python-api> │ │
  583. 39.22 s gammaloop-nextest-python-api> │ from symbolica import * │
  584. 39.22 s gammaloop-nextest-python-api> │ request_hobbyist_license('YOUR_NAME', 'YOUR_EMAIL') │
  585. 39.22 s gammaloop-nextest-python-api> │ │
  586. 39.22 s gammaloop-nextest-python-api> │ All other users can obtain a free 30-day trial key: │
  587. 39.22 s gammaloop-nextest-python-api> │ │
  588. 39.22 s gammaloop-nextest-python-api> │ from symbolica import * │
  589. 39.22 s gammaloop-nextest-python-api> │ request_trial_license('NAME', 'EMAIL', 'EMPLOYER') │
  590. 39.22 s gammaloop-nextest-python-api> │ │
  591. 39.22 s gammaloop-nextest-python-api> │ See https://symbolica.io/docs/get_started.html#license │
  592. 39.22 s gammaloop-nextest-python-api> └────────────────────────────────────────────────────────┘
  593. 39.22 s gammaloop-nextest-python-api> ┌───────────────────────────────────────────────────────────────────────────────────────────────────────────┐
  594. 39.22 s gammaloop-nextest-python-api> │ Cannot start new unlicensed Symbolica instance since there is already another one running on the machine. │
  595. 39.22 s gammaloop-nextest-python-api> └───────────────────────────────────────────────────────────────────────────────────────────────────────────┘
  596. 39.22 s gammaloop-nextest-python-api>
  597. 39.22 s gammaloop-nextest-python-api> stderr:
  598. 39.22 s gammaloop-nextest-python-api> ┌───────────────────────────────────┐
  599. 39.22 s gammaloop-nextest-python-api> │ The Symbolica license has expired │
  600. 39.22 s gammaloop-nextest-python-api> └───────────────────────────────────┘
  601. 39.22 s gammaloop-nextest-python-api>
  602. 39.22 s gammaloop-nextest-python-api>
  603. 39.22 s gammaloop-nextest-python-api> Location:
  604. 39.22 s gammaloop-nextest-python-api> tests/tests/test_python_api.rs:157:20
  605. 39.22 s gammaloop-nextest-python-api>
  606. 39.22 s gammaloop-nextest-python-api> 2. gammaloop-integration-tests::test_python_api::python_evaluate_samples_batch_and_momentum_space_have_expected_shape
  607. 39.22 s gammaloop-nextest-python-api> failure: test failure with exit code 101
  608. 39.22 s gammaloop-nextest-python-api> Error: Python API test subprocess failed.
  609. 39.22 s gammaloop-nextest-python-api> stdout:
  610. 39.22 s gammaloop-nextest-python-api> ┌────────────────────────────────────────────────────────┐
  611. 39.22 s gammaloop-nextest-python-api> │ You are running a restricted Symbolica instance. │
  612. 39.22 s gammaloop-nextest-python-api> │ │
  613. 39.22 s gammaloop-nextest-python-api> │ This mode is only permitted for non-commercial use and │
  614. 39.22 s gammaloop-nextest-python-api> │ is limited to one instance and core per machine. │
  615. 39.22 s gammaloop-nextest-python-api> │ │
  616. 39.22 s gammaloop-nextest-python-api> │ Hobbyists can easily acquire a free license key │
  617. 39.22 s gammaloop-nextest-python-api> │ that unlocks all cores and removes this banner: │
  618. 39.22 s gammaloop-nextest-python-api> │ │
  619. 39.22 s gammaloop-nextest-python-api> │ from symbolica import * │
  620. 39.22 s gammaloop-nextest-python-api> │ request_hobbyist_license('YOUR_NAME', 'YOUR_EMAIL') │
  621. 39.22 s gammaloop-nextest-python-api> │ │
  622. 39.22 s gammaloop-nextest-python-api> │ All other users can obtain a free 30-day trial key: │
  623. 39.22 s gammaloop-nextest-python-api> │ │
  624. 39.22 s gammaloop-nextest-python-api> │ from symbolica import * │
  625. 39.22 s gammaloop-nextest-python-api> │ request_trial_license('NAME', 'EMAIL', 'EMPLOYER') │
  626. 39.22 s gammaloop-nextest-python-api> │ │
  627. 39.22 s gammaloop-nextest-python-api> │ See https://symbolica.io/docs/get_started.html#license │
  628. 39.22 s gammaloop-nextest-python-api> └────────────────────────────────────────────────────────┘
  629. 39.22 s gammaloop-nextest-python-api> ┌───────────────────────────────────────────────────────────────────────────────────────────────────────────┐
  630. 39.22 s gammaloop-nextest-python-api> │ Cannot start new unlicensed Symbolica instance since there is already another one running on the machine. │
  631. 39.22 s gammaloop-nextest-python-api> └───────────────────────────────────────────────────────────────────────────────────────────────────────────┘
  632. 39.22 s gammaloop-nextest-python-api>
  633. 39.22 s gammaloop-nextest-python-api> stderr:
  634. 39.22 s gammaloop-nextest-python-api> ┌───────────────────────────────────┐
  635. 39.22 s gammaloop-nextest-python-api> │ The Symbolica license has expired │
  636. 39.22 s gammaloop-nextest-python-api> └───────────────────────────────────┘
  637. 39.22 s gammaloop-nextest-python-api>
  638. 39.22 s gammaloop-nextest-python-api>
  639. 39.22 s gammaloop-nextest-python-api> Location:
  640. 39.22 s gammaloop-nextest-python-api> tests/tests/test_python_api.rs:157:20
  641. 39.22 s gammaloop-nextest-python-api> system-out
  642. 39.22 s gammaloop-nextest-python-api> running 1 test
  643. 39.22 s gammaloop-nextest-python-api> test python_evaluate_samples_batch_and_momentum_space_have_expected_shape ... FAILED
  644. 39.22 s gammaloop-nextest-python-api>
  645. 39.22 s gammaloop-nextest-python-api> failures:
  646. 39.22 s gammaloop-nextest-python-api>
  647. 39.22 s gammaloop-nextest-python-api> failures:
  648. 39.22 s gammaloop-nextest-python-api> python_evaluate_samples_batch_and_momentum_space_have_expected_shape
  649. 39.22 s gammaloop-nextest-python-api>
  650. 39.22 s gammaloop-nextest-python-api> test result: FAILED. 0 passed; 1 failed; 0 ignored; 0 measured; 4 filtered out; finished in 0.67s
  651. 39.22 s gammaloop-nextest-python-api> system-err
  652. 39.22 s gammaloop-nextest-python-api> Error: Python API test subprocess failed.
  653. 39.22 s gammaloop-nextest-python-api> stdout:
  654. 39.22 s gammaloop-nextest-python-api> ┌────────────────────────────────────────────────────────┐
  655. 39.22 s gammaloop-nextest-python-api> │ You are running a restricted Symbolica instance. │
  656. 39.22 s gammaloop-nextest-python-api> │ │
  657. 39.22 s gammaloop-nextest-python-api> │ This mode is only permitted for non-commercial use and │
  658. 39.22 s gammaloop-nextest-python-api> │ is limited to one instance and core per machine. │
  659. 39.22 s gammaloop-nextest-python-api> │ │
  660. 39.22 s gammaloop-nextest-python-api> │ Hobbyists can easily acquire a free license key │
  661. 39.22 s gammaloop-nextest-python-api> │ that unlocks all cores and removes this banner: │
  662. 39.22 s gammaloop-nextest-python-api> │ │
  663. 39.22 s gammaloop-nextest-python-api> │ from symbolica import * │
  664. 39.22 s gammaloop-nextest-python-api> │ request_hobbyist_license('YOUR_NAME', 'YOUR_EMAIL') │
  665. 39.22 s gammaloop-nextest-python-api> │ │
  666. 39.22 s gammaloop-nextest-python-api> │ All other users can obtain a free 30-day trial key: │
  667. 39.22 s gammaloop-nextest-python-api> │ │
  668. 39.22 s gammaloop-nextest-python-api> │ from symbolica import * │
  669. 39.22 s gammaloop-nextest-python-api> │ request_trial_license('NAME', 'EMAIL', 'EMPLOYER') │
  670. 39.22 s gammaloop-nextest-python-api> │ │
  671. 39.22 s gammaloop-nextest-python-api> │ See https://symbolica.io/docs/get_started.html#license │
  672. 39.22 s gammaloop-nextest-python-api> └────────────────────────────────────────────────────────┘
  673. 39.22 s gammaloop-nextest-python-api> ┌───────────────────────────────────────────────────────────────────────────────────────────────────────────┐
  674. 39.22 s gammaloop-nextest-python-api> │ Cannot start new unlicensed Symbolica instance since there is already another one running on the machine. │
  675. 39.22 s gammaloop-nextest-python-api> └───────────────────────────────────────────────────────────────────────────────────────────────────────────┘
  676. 39.22 s gammaloop-nextest-python-api>
  677. 39.22 s gammaloop-nextest-python-api> stderr:
  678. 39.22 s gammaloop-nextest-python-api> ┌───────────────────────────────────┐
  679. 39.22 s gammaloop-nextest-python-api> │ The Symbolica license has expired │
  680. 39.22 s gammaloop-nextest-python-api> └───────────────────────────────────┘
  681. 39.22 s gammaloop-nextest-python-api>
  682. 39.22 s gammaloop-nextest-python-api>
  683. 39.22 s gammaloop-nextest-python-api> Location:
  684. 39.22 s gammaloop-nextest-python-api> tests/tests/test_python_api.rs:157:20
  685. 39.22 s gammaloop-nextest-python-api>
  686. 39.22 s gammaloop-nextest-python-api> 3. gammaloop-integration-tests::test_python_api::python_evaluate_sample_preserves_graph_grouping_and_incoming_pdgs
  687. 39.22 s gammaloop-nextest-python-api> failure: test failure with exit code 101
  688. 39.22 s gammaloop-nextest-python-api> Error: Python API test subprocess failed.
  689. 39.22 s gammaloop-nextest-python-api> stdout:
  690. 39.22 s gammaloop-nextest-python-api> ┌────────────────────────────────────────────────────────┐
  691. 39.22 s gammaloop-nextest-python-api> │ You are running a restricted Symbolica instance. │
  692. 39.22 s gammaloop-nextest-python-api> │ │
  693. 39.22 s gammaloop-nextest-python-api> │ This mode is only permitted for non-commercial use and │
  694. 39.22 s gammaloop-nextest-python-api> │ is limited to one instance and core per machine. │
  695. 39.22 s gammaloop-nextest-python-api> │ │
  696. 39.22 s gammaloop-nextest-python-api> │ Hobbyists can easily acquire a free license key │
  697. 39.22 s gammaloop-nextest-python-api> │ that unlocks all cores and removes this banner: │
  698. 39.22 s gammaloop-nextest-python-api> │ │
  699. 39.22 s gammaloop-nextest-python-api> │ from symbolica import * │
  700. 39.22 s gammaloop-nextest-python-api> │ request_hobbyist_license('YOUR_NAME', 'YOUR_EMAIL') │
  701. 39.22 s gammaloop-nextest-python-api> │ │
  702. 39.22 s gammaloop-nextest-python-api> │ All other users can obtain a free 30-day trial key: │
  703. 39.22 s gammaloop-nextest-python-api> │ │
  704. 39.22 s gammaloop-nextest-python-api> │ from symbolica import * │
  705. 39.22 s gammaloop-nextest-python-api> │ request_trial_license('NAME', 'EMAIL', 'EMPLOYER') │
  706. 39.22 s gammaloop-nextest-python-api> │ │
  707. 39.22 s gammaloop-nextest-python-api> │ See https://symbolica.io/docs/get_started.html#license │
  708. 39.22 s gammaloop-nextest-python-api> └────────────────────────────────────────────────────────┘
  709. 39.22 s gammaloop-nextest-python-api> ┌───────────────────────────────────────────────────────────────────────────────────────────────────────────┐
  710. 39.22 s gammaloop-nextest-python-api> │ Cannot start new unlicensed Symbolica instance since there is already another one running on the machine. │
  711. 39.22 s gammaloop-nextest-python-api> └───────────────────────────────────────────────────────────────────────────────────────────────────────────┘
  712. 39.22 s gammaloop-nextest-python-api>
  713. 39.22 s gammaloop-nextest-python-api> stderr:
  714. 39.22 s gammaloop-nextest-python-api> ┌───────────────────────────────────┐
  715. 39.22 s gammaloop-nextest-python-api> │ The Symbolica license has expired │
  716. 39.22 s gammaloop-nextest-python-api> └───────────────────────────────────┘
  717. 39.22 s gammaloop-nextest-python-api>
  718. 39.22 s gammaloop-nextest-python-api>
  719. 39.22 s gammaloop-nextest-python-api> Location:
  720. 39.22 s gammaloop-nextest-python-api> tests/tests/test_python_api.rs:157:20
  721. 39.22 s gammaloop-nextest-python-api> system-out
  722. 39.22 s gammaloop-nextest-python-api> running 1 test
  723. 39.22 s gammaloop-nextest-python-api> test python_evaluate_sample_preserves_graph_grouping_and_incoming_pdgs ... FAILED
  724. 39.22 s gammaloop-nextest-python-api>
  725. 39.22 s gammaloop-nextest-python-api> failures:
  726. 39.22 s gammaloop-nextest-python-api>
  727. 39.22 s gammaloop-nextest-python-api> failures:
  728. 39.22 s gammaloop-nextest-python-api> python_evaluate_sample_preserves_graph_grouping_and_incoming_pdgs
  729. 39.22 s gammaloop-nextest-python-api>
  730. 39.22 s gammaloop-nextest-python-api> test result: FAILED. 0 passed; 1 failed; 0 ignored; 0 measured; 4 filtered out; finished in 0.67s
  731. 39.22 s gammaloop-nextest-python-api> system-err
  732. 39.22 s gammaloop-nextest-python-api> Error: Python API test subprocess failed.
  733. 39.22 s gammaloop-nextest-python-api> stdout:
  734. 39.22 s gammaloop-nextest-python-api> ┌────────────────────────────────────────────────────────┐
  735. 39.22 s gammaloop-nextest-python-api> │ You are running a restricted Symbolica instance. │
  736. 39.22 s gammaloop-nextest-python-api> │ │
  737. 39.22 s gammaloop-nextest-python-api> │ This mode is only permitted for non-commercial use and │
  738. 39.22 s gammaloop-nextest-python-api> │ is limited to one instance and core per machine. │
  739. 39.22 s gammaloop-nextest-python-api> │ │
  740. 39.22 s gammaloop-nextest-python-api> │ Hobbyists can easily acquire a free license key │
  741. 39.22 s gammaloop-nextest-python-api> │ that unlocks all cores and removes this banner: │
  742. 39.22 s gammaloop-nextest-python-api> │ │
  743. 39.22 s gammaloop-nextest-python-api> │ from symbolica import * │
  744. 39.22 s gammaloop-nextest-python-api> │ request_hobbyist_license('YOUR_NAME', 'YOUR_EMAIL') │
  745. 39.22 s gammaloop-nextest-python-api> │ │
  746. 39.22 s gammaloop-nextest-python-api> │ All other users can obtain a free 30-day trial key: │
  747. 39.22 s gammaloop-nextest-python-api> │ │
  748. 39.22 s gammaloop-nextest-python-api> │ from symbolica import * │
  749. 39.22 s gammaloop-nextest-python-api> │ request_trial_license('NAME', 'EMAIL', 'EMPLOYER') │
  750. 39.22 s gammaloop-nextest-python-api> │ │
  751. 39.22 s gammaloop-nextest-python-api> │ See https://symbolica.io/docs/get_started.html#license │
  752. 39.23 s gammaloop-nextest-python-api> └────────────────────────────────────────────────────────┘
  753. 39.23 s gammaloop-nextest-python-api> ┌───────────────────────────────────────────────────────────────────────────────────────────────────────────┐
  754. 39.23 s gammaloop-nextest-python-api> │ Cannot start new unlicensed Symbolica instance since there is already another one running on the machine. │
  755. 39.23 s gammaloop-nextest-python-api> └───────────────────────────────────────────────────────────────────────────────────────────────────────────┘
  756. 39.23 s gammaloop-nextest-python-api>
  757. 39.23 s gammaloop-nextest-python-api> stderr:
  758. 39.23 s gammaloop-nextest-python-api> ┌───────────────────────────────────┐
  759. 39.23 s gammaloop-nextest-python-api> │ The Symbolica license has expired │
  760. 39.23 s gammaloop-nextest-python-api> └───────────────────────────────────┘
  761. 39.23 s gammaloop-nextest-python-api>
  762. 39.23 s gammaloop-nextest-python-api>
  763. 39.23 s gammaloop-nextest-python-api> Location:
  764. 39.23 s gammaloop-nextest-python-api> tests/tests/test_python_api.rs:157:20
  765. 39.23 s gammaloop-nextest-python-api>
  766. 39.23 s gammaloop-nextest-python-api> 4. gammaloop-integration-tests::test_python_api::python_evaluate_sample_honors_generate_events_and_observable_snapshots
  767. 39.23 s gammaloop-nextest-python-api> failure: test failure with exit code 101
  768. 39.23 s gammaloop-nextest-python-api> Error: Python API test subprocess failed.
  769. 39.23 s gammaloop-nextest-python-api> stdout:
  770. 39.23 s gammaloop-nextest-python-api> ┌────────────────────────────────────────────────────────┐
  771. 39.23 s gammaloop-nextest-python-api> │ You are running a restricted Symbolica instance. │
  772. 39.23 s gammaloop-nextest-python-api> │ │
  773. 39.23 s gammaloop-nextest-python-api> │ This mode is only permitted for non-commercial use and │
  774. 39.23 s gammaloop-nextest-python-api> │ is limited to one instance and core per machine. │
  775. 39.23 s gammaloop-nextest-python-api> │ │
  776. 39.23 s gammaloop-nextest-python-api> │ Hobbyists can easily acquire a free license key │
  777. 39.23 s gammaloop-nextest-python-api> │ that unlocks all cores and removes this banner: │
  778. 39.23 s gammaloop-nextest-python-api> │ │
  779. 39.23 s gammaloop-nextest-python-api> │ from symbolica import * │
  780. 39.23 s gammaloop-nextest-python-api> │ request_hobbyist_license('YOUR_NAME', 'YOUR_EMAIL') │
  781. 39.23 s gammaloop-nextest-python-api> │ │
  782. 39.23 s gammaloop-nextest-python-api> │ All other users can obtain a free 30-day trial key: │
  783. 39.23 s gammaloop-nextest-python-api> │ │
  784. 39.23 s gammaloop-nextest-python-api> │ from symbolica import * │
  785. 39.23 s gammaloop-nextest-python-api> │ request_trial_license('NAME', 'EMAIL', 'EMPLOYER') │
  786. 39.23 s gammaloop-nextest-python-api> │ │
  787. 39.23 s gammaloop-nextest-python-api> │ See https://symbolica.io/docs/get_started.html#license │
  788. 39.23 s gammaloop-nextest-python-api> └────────────────────────────────────────────────────────┘
  789. 39.23 s gammaloop-nextest-python-api> ┌───────────────────────────────────────────────────────────────────────────────────────────────────────────┐
  790. 39.23 s gammaloop-nextest-python-api> │ Cannot start new unlicensed Symbolica instance since there is already another one running on the machine. │
  791. 39.23 s gammaloop-nextest-python-api> └───────────────────────────────────────────────────────────────────────────────────────────────────────────┘
  792. 39.23 s gammaloop-nextest-python-api>
  793. 39.23 s gammaloop-nextest-python-api> stderr:
  794. 39.23 s gammaloop-nextest-python-api> ┌───────────────────────────────────┐
  795. 39.23 s gammaloop-nextest-python-api> │ The Symbolica license has expired │
  796. 39.23 s gammaloop-nextest-python-api> └───────────────────────────────────┘
  797. 39.23 s gammaloop-nextest-python-api> [2026-09-02 02:19:17.561] @gammaloop_api::se... INFO : Running command import model sm-default
  798. 39.23 s gammaloop-nextest-python-api> [2026-09-02 02:19:17.561] @import::model INFO : Loading built-in JSON model sm-default
  799. 39.23 s gammaloop-nextest-python-api> [2026-09-02 02:19:17.585] @gammaloop_api::se... INFO : Running command set default-runtime kv kinematics.externals='{"type":"constant","data":{"momenta":[[32.0,0.0,0.0,32.0],[32.0,0.0,0.0,-32.0]],"helicities":[1,1]}}'
  800. 39.23 s gammaloop-nextest-python-api> [2026-09-02 02:19:17.586] @gammaloop_api::se... INFO : Running command set default-runtime kv subtraction.disable_threshold_subtraction=true
  801. 39.23 s gammaloop-nextest-python-api> [2026-09-02 02:19:17.587] @gammaloop_api::se... INFO : Running command generate xs e+ e- > d d~ g | e- a d g QED^2==4 [{{2}} QCD=0] --numerator-grouping group_identical_graphs_up_to_sign --clear-existing-processes --only-diagrams
  802. 39.23 s gammaloop-nextest-python-api> [2026-09-02 02:19:17.979] @commands::generate INFO : Generated cross-section 2 graphs.
  803. 39.23 s gammaloop-nextest-python-api> [2026-09-02 02:19:17.979] @commands::generate INFO : Only diagram generation was requested, skipping integrand generation. You can generate integrands later using the 'generate existing <options>' command.
  804. 39.23 s gammaloop-nextest-python-api> [2026-09-02 02:19:17.980] @gammaloop_api::se... INFO : Running command generate
  805. 39.23 s gammaloop-nextest-python-api>
  806. 39.23 s gammaloop-nextest-python-api>
  807. 39.23 s gammaloop-nextest-python-api> Location:
  808. 39.23 s gammaloop-nextest-python-api> tests/tests/test_python_api.rs:157:20
  809. 39.23 s gammaloop-nextest-python-api> system-out
  810. 39.23 s gammaloop-nextest-python-api> running 1 test
  811. 39.23 s gammaloop-nextest-python-api> test python_evaluate_sample_honors_generate_events_and_observable_snapshots ... FAILED
  812. 39.23 s gammaloop-nextest-python-api>
  813. 39.23 s gammaloop-nextest-python-api> failures:
  814. 39.23 s gammaloop-nextest-python-api>
  815. 39.23 s gammaloop-nextest-python-api> failures:
  816. 39.23 s gammaloop-nextest-python-api> python_evaluate_sample_honors_generate_events_and_observable_snapshots
  817. 39.23 s gammaloop-nextest-python-api>
  818. 39.23 s gammaloop-nextest-python-api> test result: FAILED. 0 passed; 1 failed; 0 ignored; 0 measured; 4 filtered out; finished in 0.91s
  819. 39.23 s gammaloop-nextest-python-api> system-err
  820. 39.23 s gammaloop-nextest-python-api> Error: Python API test subprocess failed.
  821. 39.23 s gammaloop-nextest-python-api> stdout:
  822. 39.23 s gammaloop-nextest-python-api> ┌────────────────────────────────────────────────────────┐
  823. 39.23 s gammaloop-nextest-python-api> │ You are running a restricted Symbolica instance. │
  824. 39.23 s gammaloop-nextest-python-api> │ │
  825. 39.23 s gammaloop-nextest-python-api> │ This mode is only permitted for non-commercial use and │
  826. 39.23 s gammaloop-nextest-python-api> │ is limited to one instance and core per machine. │
  827. 39.23 s gammaloop-nextest-python-api> │ │
  828. 39.23 s gammaloop-nextest-python-api> │ Hobbyists can easily acquire a free license key │
  829. 39.23 s gammaloop-nextest-python-api> │ that unlocks all cores and removes this banner: │
  830. 39.23 s gammaloop-nextest-python-api> │ │
  831. 39.23 s gammaloop-nextest-python-api> │ from symbolica import * │
  832. 39.23 s gammaloop-nextest-python-api> │ request_hobbyist_license('YOUR_NAME', 'YOUR_EMAIL') │
  833. 39.23 s gammaloop-nextest-python-api> │ │
  834. 39.23 s gammaloop-nextest-python-api> │ All other users can obtain a free 30-day trial key: │
  835. 39.23 s gammaloop-nextest-python-api> │ │
  836. 39.23 s gammaloop-nextest-python-api> │ from symbolica import * │
  837. 39.23 s gammaloop-nextest-python-api> │ request_trial_license('NAME', 'EMAIL', 'EMPLOYER') │
  838. 39.23 s gammaloop-nextest-python-api> │ │
  839. 39.23 s gammaloop-nextest-python-api> │ See https://symbolica.io/docs/get_started.html#license │
  840. 39.23 s gammaloop-nextest-python-api> └────────────────────────────────────────────────────────┘
  841. 39.23 s gammaloop-nextest-python-api> ┌───────────────────────────────────────────────────────────────────────────────────────────────────────────┐
  842. 39.23 s gammaloop-nextest-python-api> │ Cannot start new unlicensed Symbolica instance since there is already another one running on the machine. │
  843. 39.23 s gammaloop-nextest-python-api> └───────────────────────────────────────────────────────────────────────────────────────────────────────────┘
  844. 39.23 s gammaloop-nextest-python-api>
  845. 39.23 s gammaloop-nextest-python-api> stderr:
  846. 39.23 s gammaloop-nextest-python-api> ┌───────────────────────────────────┐
  847. 39.23 s gammaloop-nextest-python-api> │ The Symbolica license has expired │
  848. 39.23 s gammaloop-nextest-python-api> └───────────────────────────────────┘
  849. 39.23 s gammaloop-nextest-python-api> [2026-09-02 02:19:17.561] @gammaloop_api::se... INFO : Running command import model sm-default
  850. 39.23 s gammaloop-nextest-python-api> [2026-09-02 02:19:17.561] @import::model INFO : Loading built-in JSON model sm-default
  851. 39.23 s gammaloop-nextest-python-api> [2026-09-02 02:19:17.585] @gammaloop_api::se... INFO : Running command set default-runtime kv kinematics.externals='{"type":"constant","data":{"momenta":[[32.0,0.0,0.0,32.0],[32.0,0.0,0.0,-32.0]],"helicities":[1,1]}}'
  852. 39.23 s gammaloop-nextest-python-api> [2026-09-02 02:19:17.586] @gammaloop_api::se... INFO : Running command set default-runtime kv subtraction.disable_threshold_subtraction=true
  853. 39.23 s gammaloop-nextest-python-api> [2026-09-02 02:19:17.587] @gammaloop_api::se... INFO : Running command generate xs e+ e- > d d~ g | e- a d g QED^2==4 [{{2}} QCD=0] --numerator-grouping group_identical_graphs_up_to_sign --clear-existing-processes --only-diagrams
  854. 39.23 s gammaloop-nextest-python-api> [2026-09-02 02:19:17.979] @commands::generate INFO : Generated cross-section 2 graphs.
  855. 39.23 s gammaloop-nextest-python-api> [2026-09-02 02:19:17.979] @commands::generate INFO : Only diagram generation was requested, skipping integrand generation. You can generate integrands later using the 'generate existing <options>' command.
  856. 39.23 s gammaloop-nextest-python-api> [2026-09-02 02:19:17.980] @gammaloop_api::se... INFO : Running command generate
  857. 39.23 s gammaloop-nextest-python-api>
  858. 39.23 s gammaloop-nextest-python-api>
  859. 39.23 s gammaloop-nextest-python-api> Location:
  860. 39.23 s gammaloop-nextest-python-api> tests/tests/test_python_api.rs:157:20
  861. 39.23 s gammaloop-nextest-python-api>
  862. 39.23 s gammaloop-nextest-python-api> 5. gammaloop-integration-tests::test_python_api::python_settings_wrappers_expose_nested_runtime_and_global_settings
  863. 39.23 s gammaloop-nextest-python-api> failure: test failure with exit code 101
  864. 39.23 s gammaloop-nextest-python-api> Error: Python API test subprocess failed.
  865. 39.23 s gammaloop-nextest-python-api> stdout:
  866. 39.23 s gammaloop-nextest-python-api> ┌────────────────────────────────────────────────────────┐
  867. 39.23 s gammaloop-nextest-python-api> │ You are running a restricted Symbolica instance. │
  868. 39.23 s gammaloop-nextest-python-api> │ │
  869. 39.23 s gammaloop-nextest-python-api> │ This mode is only permitted for non-commercial use and │
  870. 39.23 s gammaloop-nextest-python-api> │ is limited to one instance and core per machine. │
  871. 39.23 s gammaloop-nextest-python-api> │ │
  872. 39.23 s gammaloop-nextest-python-api> │ Hobbyists can easily acquire a free license key │
  873. 39.23 s gammaloop-nextest-python-api> │ that unlocks all cores and removes this banner: │
  874. 39.23 s gammaloop-nextest-python-api> │ │
  875. 39.23 s gammaloop-nextest-python-api> │ from symbolica import * │
  876. 39.23 s gammaloop-nextest-python-api> │ request_hobbyist_license('YOUR_NAME', 'YOUR_EMAIL') │
  877. 39.23 s gammaloop-nextest-python-api> │ │
  878. 39.23 s gammaloop-nextest-python-api> │ All other users can obtain a free 30-day trial key: │
  879. 39.23 s gammaloop-nextest-python-api> │ │
  880. 39.23 s gammaloop-nextest-python-api> │ from symbolica import * │
  881. 39.23 s gammaloop-nextest-python-api> │ request_trial_license('NAME', 'EMAIL', 'EMPLOYER') │
  882. 39.23 s gammaloop-nextest-python-api> │ │
  883. 39.23 s gammaloop-nextest-python-api> │ See https://symbolica.io/docs/get_started.html#license │
  884. 39.23 s gammaloop-nextest-python-api> └────────────────────────────────────────────────────────┘
  885. 39.23 s gammaloop-nextest-python-api> ┌───────────────────────────────────────────────────────────────────────────────────────────────────────────┐
  886. 39.23 s gammaloop-nextest-python-api> │ Cannot start new unlicensed Symbolica instance since there is already another one running on the machine. │
  887. 39.23 s gammaloop-nextest-python-api> └───────────────────────────────────────────────────────────────────────────────────────────────────────────┘
  888. 39.23 s gammaloop-nextest-python-api>
  889. 39.23 s gammaloop-nextest-python-api> stderr:
  890. 39.23 s gammaloop-nextest-python-api> ┌───────────────────────────────────┐
  891. 39.23 s gammaloop-nextest-python-api> │ The Symbolica license has expired │
  892. 39.23 s gammaloop-nextest-python-api> └───────────────────────────────────┘
  893. 39.23 s gammaloop-nextest-python-api>
  894. 39.24 s gammaloop-nextest-python-api>
  895. 39.24 s gammaloop-nextest-python-api> Location:
  896. 39.24 s gammaloop-nextest-python-api> tests/tests/test_python_api.rs:157:20
  897. 39.24 s gammaloop-nextest-python-api> system-out
  898. 39.24 s gammaloop-nextest-python-api> running 1 test
  899. 39.24 s gammaloop-nextest-python-api> test python_settings_wrappers_expose_nested_runtime_and_global_settings ... FAILED
  900. 39.24 s gammaloop-nextest-python-api>
  901. 39.24 s gammaloop-nextest-python-api> failures:
  902. 39.24 s gammaloop-nextest-python-api>
  903. 39.24 s gammaloop-nextest-python-api> failures:
  904. 39.24 s gammaloop-nextest-python-api> python_settings_wrappers_expose_nested_runtime_and_global_settings
  905. 39.24 s gammaloop-nextest-python-api>
  906. 39.24 s gammaloop-nextest-python-api> test result: FAILED. 0 passed; 1 failed; 0 ignored; 0 measured; 4 filtered out; finished in 0.95s
  907. 39.24 s gammaloop-nextest-python-api> system-err
  908. 39.24 s gammaloop-nextest-python-api> Error: Python API test subprocess failed.
  909. 39.24 s gammaloop-nextest-python-api> stdout:
  910. 39.24 s gammaloop-nextest-python-api> ┌────────────────────────────────────────────────────────┐
  911. 39.24 s gammaloop-nextest-python-api> │ You are running a restricted Symbolica instance. │
  912. 39.24 s gammaloop-nextest-python-api> │ │
  913. 39.24 s gammaloop-nextest-python-api> │ This mode is only permitted for non-commercial use and │
  914. 39.24 s gammaloop-nextest-python-api> │ is limited to one instance and core per machine. │
  915. 39.24 s gammaloop-nextest-python-api> │ │
  916. 39.24 s gammaloop-nextest-python-api> │ Hobbyists can easily acquire a free license key │
  917. 39.24 s gammaloop-nextest-python-api> │ that unlocks all cores and removes this banner: │
  918. 39.24 s gammaloop-nextest-python-api> │ │
  919. 39.24 s gammaloop-nextest-python-api> │ from symbolica import * │
  920. 39.24 s gammaloop-nextest-python-api> │ request_hobbyist_license('YOUR_NAME', 'YOUR_EMAIL') │
  921. 39.24 s gammaloop-nextest-python-api> │ │
  922. 39.24 s gammaloop-nextest-python-api> │ All other users can obtain a free 30-day trial key: │
  923. 39.24 s gammaloop-nextest-python-api> │ │
  924. 39.24 s gammaloop-nextest-python-api> │ from symbolica import * │
  925. 39.24 s gammaloop-nextest-python-api> │ request_trial_license('NAME', 'EMAIL', 'EMPLOYER') │
  926. 39.24 s gammaloop-nextest-python-api> │ │
  927. 39.24 s gammaloop-nextest-python-api> │ See https://symbolica.io/docs/get_started.html#license │
  928. 39.24 s gammaloop-nextest-python-api> └────────────────────────────────────────────────────────┘
  929. 39.24 s gammaloop-nextest-python-api> ┌───────────────────────────────────────────────────────────────────────────────────────────────────────────┐
  930. 39.24 s gammaloop-nextest-python-api> │ Cannot start new unlicensed Symbolica instance since there is already another one running on the machine. │
  931. 39.24 s gammaloop-nextest-python-api> └───────────────────────────────────────────────────────────────────────────────────────────────────────────┘
  932. 39.24 s gammaloop-nextest-python-api>
  933. 39.24 s gammaloop-nextest-python-api> stderr:
  934. 39.24 s gammaloop-nextest-python-api> ┌───────────────────────────────────┐
  935. 39.24 s gammaloop-nextest-python-api> │ The Symbolica license has expired │
  936. 39.24 s gammaloop-nextest-python-api> └───────────────────────────────────┘
  937. 39.24 s gammaloop-nextest-python-api>
  938. 39.24 s gammaloop-nextest-python-api>
  939. 39.24 s gammaloop-nextest-python-api> Location:
  940. 39.24 s gammaloop-nextest-python-api> tests/tests/test_python_api.rs:157:20
  941. 39.24 s gammaloop-nextest-python-api> =========================================
  942. 39.32 s [0 built (1 failed)]error: Cannot build '/nix/store/fzljqa63rh9s640jcldimpyrcjcnir2c-gammaloop-nextest-python-api.drv'.
  943. 39.32 s Reason: builder failed with exit code 100.
  944. 39.32 s Output paths:
  945. 39.32 s /nix/store/sw1jmzipa5q26jwkkcqa1c6ynssy5rwc-gammaloop-nextest-python-api
  946. 39.32 s Last 925 log lines:
  947. 39.32 s > Extracting 1 binary, 1 build script output directory, and 3 linked paths to /build/nextest-archive-3kCaEP
  948. 39.32 s > Extracted 18 files to /build/nextest-archive-3kCaEP in 0.12s
  949. 39.32 s > ------------
  950. 39.32 s > Nextest run ID cf291be8-6420-49e7-9cf1-a05d79cae94e with nextest profile: ci_gammaloop
  951. 39.32 s > Starting 5 tests across 1 binary
  952. 39.32 s > FAIL [ 0.658s] (1/5) gammaloop-integration-tests::test_python_api python_session_getters_return_live_toml_and_command_blocks
  953. 39.32 s > stdout ---
  954. 39.32 s >
  955. 39.32 s > running 1 test
  956. 39.32 s > test python_session_getters_return_live_toml_and_command_blocks ... FAILED
  957. 39.32 s >
  958. 39.32 s > failures:
  959. 39.32 s >
  960. 39.32 s > failures:
  961. 39.32 s > python_session_getters_return_live_toml_and_command_blocks
  962. 39.32 s >
  963. 39.32 s > test result: FAILED. 0 passed; 1 failed; 0 ignored; 0 measured; 4 filtered out; finished in 0.64s
  964. 39.32 s >
  965. 39.32 s > stderr ---
  966. 39.32 s > Error: Python API test subprocess failed.
  967. 39.32 s > stdout:
  968. 39.32 s > ┌────────────────────────────────────────────────────────┐
  969. 39.32 s > │ You are running a restricted Symbolica instance. │
  970. 39.32 s > │ │
  971. 39.32 s > │ This mode is only permitted for non-commercial use and │
  972. 39.32 s > │ is limited to one instance and core per machine. │
  973. 39.32 s > │ │
  974. 39.32 s > │ Hobbyists can easily acquire a free license key │
  975. 39.32 s > │ that unlocks all cores and removes this banner: │
  976. 39.32 s > │ │
  977. 39.32 s > │ from symbolica import * │
  978. 39.32 s > │ request_hobbyist_license('YOUR_NAME', 'YOUR_EMAIL') │
  979. 39.32 s > │ │
  980. 39.32 s > │ All other users can obtain a free 30-day trial key: │
  981. 39.32 s > │ │
  982. 39.32 s > │ from symbolica import * │
  983. 39.32 s > │ request_trial_license('NAME', 'EMAIL', 'EMPLOYER') │
  984. 39.32 s > │ │
  985. 39.32 s > │ See https://symbolica.io/docs/get_started.html#license │
  986. 39.32 s > └────────────────────────────────────────────────────────┘
  987. 39.32 s > ┌───────────────────────────────────────────────────────────────────────────────────────────────────────────┐
  988. 39.32 s > │ Cannot start new unlicensed Symbolica instance since there is already another one running on the machine. │
  989. 39.33 s > └───────────────────────────────────────────────────────────────────────────────────────────────────────────┘
  990. 39.33 s >
  991. 39.33 s > stderr:
  992. 39.33 s > ┌───────────────────────────────────┐
  993. 39.33 s > │ The Symbolica license has expired │
  994. 39.33 s > └───────────────────────────────────┘
  995. 39.33 s >
  996. 39.33 s >
  997. 39.33 s > Location:
  998. 39.33 s > tests/tests/test_python_api.rs:157:20
  999. 39.33 s >
  1000. 39.33 s > FAIL [ 0.679s] (2/5) gammaloop-integration-tests::test_python_api python_evaluate_samples_batch_and_momentum_space_have_expected_shape
  1001. 39.33 s > stdout ---
  1002. 39.33 s >
  1003. 39.33 s > running 1 test
  1004. 39.33 s > test python_evaluate_samples_batch_and_momentum_space_have_expected_shape ... FAILED
  1005. 39.33 s >
  1006. 39.33 s > failures:
  1007. 39.33 s >
  1008. 39.33 s > failures:
  1009. 39.33 s > python_evaluate_samples_batch_and_momentum_space_have_expected_shape
  1010. 39.33 s >
  1011. 39.33 s > test result: FAILED. 0 passed; 1 failed; 0 ignored; 0 measured; 4 filtered out; finished in 0.67s
  1012. 39.33 s >
  1013. 39.33 s > stderr ---
  1014. 39.33 s > Error: Python API test subprocess failed.
  1015. 39.33 s > stdout:
  1016. 39.33 s > ┌────────────────────────────────────────────────────────┐
  1017. 39.33 s > │ You are running a restricted Symbolica instance. │
  1018. 39.33 s > │ │
  1019. 39.33 s > │ This mode is only permitted for non-commercial use and │
  1020. 39.33 s > │ is limited to one instance and core per machine. │
  1021. 39.33 s > │ │
  1022. 39.33 s > │ Hobbyists can easily acquire a free license key │
  1023. 39.33 s > │ that unlocks all cores and removes this banner: │
  1024. 39.33 s > │ │
  1025. 39.33 s > │ from symbolica import * │
  1026. 39.33 s > │ request_hobbyist_license('YOUR_NAME', 'YOUR_EMAIL') │
  1027. 39.33 s > │ │
  1028. 39.33 s > │ All other users can obtain a free 30-day trial key: │
  1029. 39.33 s > │ │
  1030. 39.33 s > │ from symbolica import * │
  1031. 39.33 s > │ request_trial_license('NAME', 'EMAIL', 'EMPLOYER') │
  1032. 39.33 s > │ │
  1033. 39.33 s > │ See https://symbolica.io/docs/get_started.html#license │
  1034. 39.33 s > └────────────────────────────────────────────────────────┘
  1035. 39.33 s > ┌───────────────────────────────────────────────────────────────────────────────────────────────────────────┐
  1036. 39.33 s > │ Cannot start new unlicensed Symbolica instance since there is already another one running on the machine. │
  1037. 39.33 s > └───────────────────────────────────────────────────────────────────────────────────────────────────────────┘
  1038. 39.33 s >
  1039. 39.33 s > stderr:
  1040. 39.33 s > ┌───────────────────────────────────┐
  1041. 39.33 s > │ The Symbolica license has expired │
  1042. 39.33 s > └───────────────────────────────────┘
  1043. 39.33 s >
  1044. 39.33 s >
  1045. 39.33 s > Location:
  1046. 39.33 s > tests/tests/test_python_api.rs:157:20
  1047. 39.33 s >
  1048. 39.33 s > FAIL [ 0.691s] (3/5) gammaloop-integration-tests::test_python_api python_evaluate_sample_preserves_graph_grouping_and_incoming_pdgs
  1049. 39.33 s > stdout ---
  1050. 39.33 s >
  1051. 39.33 s > running 1 test
  1052. 39.33 s > test python_evaluate_sample_preserves_graph_grouping_and_incoming_pdgs ... FAILED
  1053. 39.33 s >
  1054. 39.33 s > failures:
  1055. 39.33 s >
  1056. 39.33 s > failures:
  1057. 39.33 s > python_evaluate_sample_preserves_graph_grouping_and_incoming_pdgs
  1058. 39.33 s >
  1059. 39.33 s > test result: FAILED. 0 passed; 1 failed; 0 ignored; 0 measured; 4 filtered out; finished in 0.67s
  1060. 39.33 s >
  1061. 39.33 s > stderr ---
  1062. 39.33 s > Error: Python API test subprocess failed.
  1063. 39.33 s > stdout:
  1064. 39.33 s > ┌────────────────────────────────────────────────────────┐
  1065. 39.33 s > │ You are running a restricted Symbolica instance. │
  1066. 39.33 s > │ │
  1067. 39.33 s > │ This mode is only permitted for non-commercial use and │
  1068. 39.33 s > │ is limited to one instance and core per machine. │
  1069. 39.33 s > │ │
  1070. 39.33 s > │ Hobbyists can easily acquire a free license key │
  1071. 39.33 s > │ that unlocks all cores and removes this banner: │
  1072. 39.33 s > │ │
  1073. 39.33 s > │ from symbolica import * │
  1074. 39.33 s > │ request_hobbyist_license('YOUR_NAME', 'YOUR_EMAIL') │
  1075. 39.33 s > │ │
  1076. 39.33 s > │ All other users can obtain a free 30-day trial key: │
  1077. 39.33 s > │ │
  1078. 39.33 s > │ from symbolica import * │
  1079. 39.33 s > │ request_trial_license('NAME', 'EMAIL', 'EMPLOYER') │
  1080. 39.33 s > │ │
  1081. 39.33 s > │ See https://symbolica.io/docs/get_started.html#license │
  1082. 39.33 s > └────────────────────────────────────────────────────────┘
  1083. 39.33 s > ┌───────────────────────────────────────────────────────────────────────────────────────────────────────────┐
  1084. 39.33 s > │ Cannot start new unlicensed Symbolica instance since there is already another one running on the machine. │
  1085. 39.33 s > └───────────────────────────────────────────────────────────────────────────────────────────────────────────┘
  1086. 39.33 s >
  1087. 39.33 s > stderr:
  1088. 39.33 s > ┌───────────────────────────────────┐
  1089. 39.33 s > │ The Symbolica license has expired │
  1090. 39.33 s > └───────────────────────────────────┘
  1091. 39.33 s >
  1092. 39.33 s >
  1093. 39.33 s > Location:
  1094. 39.33 s > tests/tests/test_python_api.rs:157:20
  1095. 39.33 s >
  1096. 39.33 s > FAIL [ 0.921s] (4/5) gammaloop-integration-tests::test_python_api python_evaluate_sample_honors_generate_events_and_observable_snapshots
  1097. 39.33 s > stdout ---
  1098. 39.33 s >
  1099. 39.33 s > running 1 test
  1100. 39.33 s > test python_evaluate_sample_honors_generate_events_and_observable_snapshots ... FAILED
  1101. 39.33 s >
  1102. 39.33 s > failures:
  1103. 39.33 s >
  1104. 39.33 s > failures:
  1105. 39.33 s > python_evaluate_sample_honors_generate_events_and_observable_snapshots
  1106. 39.33 s >
  1107. 39.33 s > test result: FAILED. 0 passed; 1 failed; 0 ignored; 0 measured; 4 filtered out; finished in 0.91s
  1108. 39.33 s >
  1109. 39.33 s > stderr ---
  1110. 39.33 s > Error: Python API test subprocess failed.
  1111. 39.33 s > stdout:
  1112. 39.33 s > ┌────────────────────────────────────────────────────────┐
  1113. 39.33 s > │ You are running a restricted Symbolica instance. │
  1114. 39.33 s > │ │
  1115. 39.33 s > │ This mode is only permitted for non-commercial use and │
  1116. 39.33 s > │ is limited to one instance and core per machine. │
  1117. 39.33 s > │ │
  1118. 39.33 s > │ Hobbyists can easily acquire a free license key │
  1119. 39.33 s > │ that unlocks all cores and removes this banner: │
  1120. 39.33 s > │ │
  1121. 39.33 s > │ from symbolica import * │
  1122. 39.33 s > │ request_hobbyist_license('YOUR_NAME', 'YOUR_EMAIL') │
  1123. 39.33 s > │ │
  1124. 39.33 s > │ All other users can obtain a free 30-day trial key: │
  1125. 39.33 s > │ │
  1126. 39.33 s > │ from symbolica import * │
  1127. 39.33 s > │ request_trial_license('NAME', 'EMAIL', 'EMPLOYER') │
  1128. 39.33 s > │ │
  1129. 39.33 s > │ See https://symbolica.io/docs/get_started.html#license │
  1130. 39.33 s > └────────────────────────────────────────────────────────┘
  1131. 39.33 s > ┌───────────────────────────────────────────────────────────────────────────────────────────────────────────┐
  1132. 39.33 s > │ Cannot start new unlicensed Symbolica instance since there is already another one running on the machine. │
  1133. 39.33 s > └───────────────────────────────────────────────────────────────────────────────────────────────────────────┘
  1134. 39.33 s >
  1135. 39.33 s > stderr:
  1136. 39.33 s > ┌───────────────────────────────────┐
  1137. 39.33 s > │ The Symbolica license has expired │
  1138. 39.33 s > └───────────────────────────────────┘
  1139. 39.33 s > [2026-09-02 02:19:17.561] @gammaloop_api::se... INFO : Running command import model sm-default
  1140. 39.33 s > [2026-09-02 02:19:17.561] @import::model INFO : Loading built-in JSON model sm-default
  1141. 39.33 s > [2026-09-02 02:19:17.585] @gammaloop_api::se... INFO : Running command set default-runtime kv kinematics.externals='{"type":"constant","data":{"momenta":[[32.0,0.0,0.0,32.0],[32.0,0.0,0.0,-32.0]],"helicities":[1,1]}}'
  1142. 39.33 s > [2026-09-02 02:19:17.586] @gammaloop_api::se... INFO : Running command set default-runtime kv subtraction.disable_threshold_subtraction=true
  1143. 39.33 s > [2026-09-02 02:19:17.587] @gammaloop_api::se... INFO : Running command generate xs e+ e- > d d~ g | e- a d g QED^2==4 [{{2}} QCD=0] --numerator-grouping group_identical_graphs_up_to_sign --clear-existing-processes --only-diagrams
  1144. 39.33 s > [2026-09-02 02:19:17.979] @commands::generate INFO : Generated cross-section 2 graphs.
  1145. 39.33 s > [2026-09-02 02:19:17.979] @commands::generate INFO : Only diagram generation was requested, skipping integrand generation. You can generate integrands later using the 'generate existing <options>' command.
  1146. 39.33 s > [2026-09-02 02:19:17.980] @gammaloop_api::se... INFO : Running command generate
  1147. 39.33 s >
  1148. 39.33 s >
  1149. 39.33 s > Location:
  1150. 39.33 s > tests/tests/test_python_api.rs:157:20
  1151. 39.33 s >
  1152. 39.33 s > FAIL [ 0.965s] (5/5) gammaloop-integration-tests::test_python_api python_settings_wrappers_expose_nested_runtime_and_global_settings
  1153. 39.33 s > stdout ---
  1154. 39.33 s >
  1155. 39.33 s > running 1 test
  1156. 39.33 s > test python_settings_wrappers_expose_nested_runtime_and_global_settings ... FAILED
  1157. 39.33 s >
  1158. 39.33 s > failures:
  1159. 39.33 s >
  1160. 39.33 s > failures:
  1161. 39.33 s > python_settings_wrappers_expose_nested_runtime_and_global_settings
  1162. 39.33 s >
  1163. 39.33 s > test result: FAILED. 0 passed; 1 failed; 0 ignored; 0 measured; 4 filtered out; finished in 0.95s
  1164. 39.33 s >
  1165. 39.33 s > stderr ---
  1166. 39.33 s > Error: Python API test subprocess failed.
  1167. 39.33 s > stdout:
  1168. 39.33 s > ┌────────────────────────────────────────────────────────┐
  1169. 39.33 s > │ You are running a restricted Symbolica instance. │
  1170. 39.33 s > │ │
  1171. 39.33 s > │ This mode is only permitted for non-commercial use and │
  1172. 39.33 s > │ is limited to one instance and core per machine. │
  1173. 39.33 s > │ │
  1174. 39.33 s > │ Hobbyists can easily acquire a free license key │
  1175. 39.33 s > │ that unlocks all cores and removes this banner: │
  1176. 39.33 s > │ │
  1177. 39.33 s > │ from symbolica import * │
  1178. 39.33 s > │ request_hobbyist_license('YOUR_NAME', 'YOUR_EMAIL') │
  1179. 39.33 s > │ │
  1180. 39.33 s > │ All other users can obtain a free 30-day trial key: │
  1181. 39.33 s > │ │
  1182. 39.33 s > │ from symbolica import * │
  1183. 39.33 s > │ request_trial_license('NAME', 'EMAIL', 'EMPLOYER') │
  1184. 39.33 s > │ │
  1185. 39.33 s > │ See https://symbolica.io/docs/get_started.html#license │
  1186. 39.33 s > └────────────────────────────────────────────────────────┘
  1187. 39.33 s > ┌───────────────────────────────────────────────────────────────────────────────────────────────────────────┐
  1188. 39.33 s > │ Cannot start new unlicensed Symbolica instance since there is already another one running on the machine. │
  1189. 39.33 s > └───────────────────────────────────────────────────────────────────────────────────────────────────────────┘
  1190. 39.33 s >
  1191. 39.33 s > stderr:
  1192. 39.33 s > ┌───────────────────────────────────┐
  1193. 39.33 s > │ The Symbolica license has expired │
  1194. 39.33 s > └───────────────────────────────────┘
  1195. 39.33 s >
  1196. 39.33 s >
  1197. 39.33 s > Location:
  1198. 39.33 s > tests/tests/test_python_api.rs:157:20
  1199. 39.33 s >
  1200. 39.33 s > ------------
  1201. 39.33 s > Summary [ 0.972s] 5 tests run: 0 passed, 5 failed, 0 skipped
  1202. 39.33 s > FAIL [ 0.658s] (1/5) gammaloop-integration-tests::test_python_api python_session_getters_return_live_toml_and_command_blocks
  1203. 39.33 s > stdout ---
  1204. 39.33 s >
  1205. 39.33 s > running 1 test
  1206. 39.33 s > test python_session_getters_return_live_toml_and_command_blocks ... FAILED
  1207. 39.33 s >
  1208. 39.33 s > failures:
  1209. 39.33 s >
  1210. 39.33 s > failures:
  1211. 39.33 s > python_session_getters_return_live_toml_and_command_blocks
  1212. 39.33 s >
  1213. 39.33 s > test result: FAILED. 0 passed; 1 failed; 0 ignored; 0 measured; 4 filtered out; finished in 0.64s
  1214. 39.33 s >
  1215. 39.33 s > stderr ---
  1216. 39.33 s > Error: Python API test subprocess failed.
  1217. 39.33 s > stdout:
  1218. 39.33 s > ┌────────────────────────────────────────────────────────┐
  1219. 39.33 s > │ You are running a restricted Symbolica instance. │
  1220. 39.33 s > │ │
  1221. 39.33 s > │ This mode is only permitted for non-commercial use and │
  1222. 39.33 s > │ is limited to one instance and core per machine. │
  1223. 39.33 s > │ │
  1224. 39.33 s > │ Hobbyists can easily acquire a free license key │
  1225. 39.33 s > │ that unlocks all cores and removes this banner: │
  1226. 39.33 s > │ │
  1227. 39.33 s > │ from symbolica import * │
  1228. 39.33 s > │ request_hobbyist_license('YOUR_NAME', 'YOUR_EMAIL') │
  1229. 39.33 s > │ │
  1230. 39.33 s > │ All other users can obtain a free 30-day trial key: │
  1231. 39.33 s > │ │
  1232. 39.33 s > │ from symbolica import * │
  1233. 39.33 s > │ request_trial_license('NAME', 'EMAIL', 'EMPLOYER') │
  1234. 39.33 s > │ │
  1235. 39.33 s > │ See https://symbolica.io/docs/get_started.html#license │
  1236. 39.33 s > └────────────────────────────────────────────────────────┘
  1237. 39.33 s > ┌───────────────────────────────────────────────────────────────────────────────────────────────────────────┐
  1238. 39.33 s > │ Cannot start new unlicensed Symbolica instance since there is already another one running on the machine. │
  1239. 39.33 s > └───────────────────────────────────────────────────────────────────────────────────────────────────────────┘
  1240. 39.33 s >
  1241. 39.33 s > stderr:
  1242. 39.33 s > ┌───────────────────────────────────┐
  1243. 39.33 s > │ The Symbolica license has expired │
  1244. 39.33 s > └───────────────────────────────────┘
  1245. 39.33 s >
  1246. 39.33 s >
  1247. 39.33 s > Location:
  1248. 39.33 s > tests/tests/test_python_api.rs:157:20
  1249. 39.33 s >
  1250. 39.33 s > FAIL [ 0.679s] (2/5) gammaloop-integration-tests::test_python_api python_evaluate_samples_batch_and_momentum_space_have_expected_shape
  1251. 39.33 s > stdout ---
  1252. 39.33 s >
  1253. 39.33 s > running 1 test
  1254. 39.33 s > test python_evaluate_samples_batch_and_momentum_space_have_expected_shape ... FAILED
  1255. 39.33 s >
  1256. 39.33 s > failures:
  1257. 39.33 s >
  1258. 39.33 s > failures:
  1259. 39.33 s > python_evaluate_samples_batch_and_momentum_space_have_expected_shape
  1260. 39.33 s >
  1261. 39.33 s > test result: FAILED. 0 passed; 1 failed; 0 ignored; 0 measured; 4 filtered out; finished in 0.67s
  1262. 39.33 s >
  1263. 39.33 s > stderr ---
  1264. 39.33 s > Error: Python API test subprocess failed.
  1265. 39.33 s > stdout:
  1266. 39.33 s > ┌────────────────────────────────────────────────────────┐
  1267. 39.33 s > │ You are running a restricted Symbolica instance. │
  1268. 39.33 s > │ │
  1269. 39.33 s > │ This mode is only permitted for non-commercial use and │
  1270. 39.33 s > │ is limited to one instance and core per machine. │
  1271. 39.33 s > │ │
  1272. 39.33 s > │ Hobbyists can easily acquire a free license key │
  1273. 39.33 s > │ that unlocks all cores and removes this banner: │
  1274. 39.33 s > │ │
  1275. 39.33 s > │ from symbolica import * │
  1276. 39.33 s > │ request_hobbyist_license('YOUR_NAME', 'YOUR_EMAIL') │
  1277. 39.33 s > │ │
  1278. 39.33 s > │ All other users can obtain a free 30-day trial key: │
  1279. 39.33 s > │ │
  1280. 39.33 s > │ from symbolica import * │
  1281. 39.33 s > │ request_trial_license('NAME', 'EMAIL', 'EMPLOYER') │
  1282. 39.33 s > │ │
  1283. 39.33 s > │ See https://symbolica.io/docs/get_started.html#license │
  1284. 39.33 s > └────────────────────────────────────────────────────────┘
  1285. 39.33 s > ┌───────────────────────────────────────────────────────────────────────────────────────────────────────────┐
  1286. 39.33 s > │ Cannot start new unlicensed Symbolica instance since there is already another one running on the machine. │
  1287. 39.33 s > └───────────────────────────────────────────────────────────────────────────────────────────────────────────┘
  1288. 39.33 s >
  1289. 39.33 s > stderr:
  1290. 39.33 s > ┌───────────────────────────────────┐
  1291. 39.33 s > │ The Symbolica license has expired │
  1292. 39.33 s > └───────────────────────────────────┘
  1293. 39.33 s >
  1294. 39.33 s >
  1295. 39.33 s > Location:
  1296. 39.33 s > tests/tests/test_python_api.rs:157:20
  1297. 39.33 s >
  1298. 39.33 s > FAIL [ 0.691s] (3/5) gammaloop-integration-tests::test_python_api python_evaluate_sample_preserves_graph_grouping_and_incoming_pdgs
  1299. 39.33 s > stdout ---
  1300. 39.33 s >
  1301. 39.33 s > running 1 test
  1302. 39.33 s > test python_evaluate_sample_preserves_graph_grouping_and_incoming_pdgs ... FAILED
  1303. 39.33 s >
  1304. 39.33 s > failures:
  1305. 39.33 s >
  1306. 39.33 s > failures:
  1307. 39.33 s > python_evaluate_sample_preserves_graph_grouping_and_incoming_pdgs
  1308. 39.33 s >
  1309. 39.33 s > test result: FAILED. 0 passed; 1 failed; 0 ignored; 0 measured; 4 filtered out; finished in 0.67s
  1310. 39.33 s >
  1311. 39.33 s > stderr ---
  1312. 39.33 s > Error: Python API test subprocess failed.
  1313. 39.33 s > stdout:
  1314. 39.33 s > ┌────────────────────────────────────────────────────────┐
  1315. 39.33 s > │ You are running a restricted Symbolica instance. │
  1316. 39.33 s > │ │
  1317. 39.33 s > │ This mode is only permitted for non-commercial use and │
  1318. 39.33 s > │ is limited to one instance and core per machine. │
  1319. 39.33 s > │ │
  1320. 39.33 s > │ Hobbyists can easily acquire a free license key │
  1321. 39.33 s > │ that unlocks all cores and removes this banner: │
  1322. 39.33 s > │ │
  1323. 39.33 s > │ from symbolica import * │
  1324. 39.33 s > │ request_hobbyist_license('YOUR_NAME', 'YOUR_EMAIL') │
  1325. 39.33 s > │ │
  1326. 39.33 s > │ All other users can obtain a free 30-day trial key: │
  1327. 39.33 s > │ │
  1328. 39.33 s > │ from symbolica import * │
  1329. 39.33 s > │ request_trial_license('NAME', 'EMAIL', 'EMPLOYER') │
  1330. 39.33 s > │ │
  1331. 39.33 s > │ See https://symbolica.io/docs/get_started.html#license │
  1332. 39.33 s > └────────────────────────────────────────────────────────┘
  1333. 39.33 s > ┌───────────────────────────────────────────────────────────────────────────────────────────────────────────┐
  1334. 39.33 s > │ Cannot start new unlicensed Symbolica instance since there is already another one running on the machine. │
  1335. 39.33 s > └───────────────────────────────────────────────────────────────────────────────────────────────────────────┘
  1336. 39.33 s >
  1337. 39.33 s > stderr:
  1338. 39.33 s > ┌───────────────────────────────────┐
  1339. 39.33 s > │ The Symbolica license has expired │
  1340. 39.33 s > └───────────────────────────────────┘
  1341. 39.33 s >
  1342. 39.33 s >
  1343. 39.33 s > Location:
  1344. 39.33 s > tests/tests/test_python_api.rs:157:20
  1345. 39.33 s >
  1346. 39.33 s > FAIL [ 0.921s] (4/5) gammaloop-integration-tests::test_python_api python_evaluate_sample_honors_generate_events_and_observable_snapshots
  1347. 39.33 s > stdout ---
  1348. 39.33 s >
  1349. 39.33 s > running 1 test
  1350. 39.33 s > test python_evaluate_sample_honors_generate_events_and_observable_snapshots ... FAILED
  1351. 39.33 s >
  1352. 39.33 s > failures:
  1353. 39.33 s >
  1354. 39.33 s > failures:
  1355. 39.33 s > python_evaluate_sample_honors_generate_events_and_observable_snapshots
  1356. 39.33 s >
  1357. 39.33 s > test result: FAILED. 0 passed; 1 failed; 0 ignored; 0 measured; 4 filtered out; finished in 0.91s
  1358. 39.33 s >
  1359. 39.33 s > stderr ---
  1360. 39.33 s > Error: Python API test subprocess failed.
  1361. 39.33 s > stdout:
  1362. 39.33 s > ┌────────────────────────────────────────────────────────┐
  1363. 39.33 s > │ You are running a restricted Symbolica instance. │
  1364. 39.33 s > │ │
  1365. 39.33 s > │ This mode is only permitted for non-commercial use and │
  1366. 39.33 s > │ is limited to one instance and core per machine. │
  1367. 39.33 s > │ │
  1368. 39.33 s > │ Hobbyists can easily acquire a free license key │
  1369. 39.33 s > │ that unlocks all cores and removes this banner: │
  1370. 39.33 s > │ │
  1371. 39.33 s > │ from symbolica import * │
  1372. 39.33 s > │ request_hobbyist_license('YOUR_NAME', 'YOUR_EMAIL') │
  1373. 39.33 s > │ │
  1374. 39.33 s > │ All other users can obtain a free 30-day trial key: │
  1375. 39.33 s > │ │
  1376. 39.33 s > │ from symbolica import * │
  1377. 39.33 s > │ request_trial_license('NAME', 'EMAIL', 'EMPLOYER') │
  1378. 39.33 s > │ │
  1379. 39.33 s > │ See https://symbolica.io/docs/get_started.html#license │
  1380. 39.33 s > └────────────────────────────────────────────────────────┘
  1381. 39.33 s > ┌───────────────────────────────────────────────────────────────────────────────────────────────────────────┐
  1382. 39.33 s > │ Cannot start new unlicensed Symbolica instance since there is already another one running on the machine. │
  1383. 39.33 s > └───────────────────────────────────────────────────────────────────────────────────────────────────────────┘
  1384. 39.33 s >
  1385. 39.33 s > stderr:
  1386. 39.33 s > ┌───────────────────────────────────┐
  1387. 39.33 s > │ The Symbolica license has expired │
  1388. 39.33 s > └───────────────────────────────────┘
  1389. 39.33 s > [2026-09-02 02:19:17.561] @gammaloop_api::se... INFO : Running command import model sm-default
  1390. 39.33 s > [2026-09-02 02:19:17.561] @import::model INFO : Loading built-in JSON model sm-default
  1391. 39.33 s > [2026-09-02 02:19:17.585] @gammaloop_api::se... INFO : Running command set default-runtime kv kinematics.externals='{"type":"constant","data":{"momenta":[[32.0,0.0,0.0,32.0],[32.0,0.0,0.0,-32.0]],"helicities":[1,1]}}'
  1392. 39.33 s > [2026-09-02 02:19:17.586] @gammaloop_api::se... INFO : Running command set default-runtime kv subtraction.disable_threshold_subtraction=true
  1393. 39.33 s > [2026-09-02 02:19:17.587] @gammaloop_api::se... INFO : Running command generate xs e+ e- > d d~ g | e- a d g QED^2==4 [{{2}} QCD=0] --numerator-grouping group_identical_graphs_up_to_sign --clear-existing-processes --only-diagrams
  1394. 39.33 s > [2026-09-02 02:19:17.979] @commands::generate INFO : Generated cross-section 2 graphs.
  1395. 39.33 s > [2026-09-02 02:19:17.979] @commands::generate INFO : Only diagram generation was requested, skipping integrand generation. You can generate integrands later using the 'generate existing <options>' command.
  1396. 39.33 s > [2026-09-02 02:19:17.980] @gammaloop_api::se... INFO : Running command generate
  1397. 39.33 s >
  1398. 39.33 s >
  1399. 39.33 s > Location:
  1400. 39.33 s > tests/tests/test_python_api.rs:157:20
  1401. 39.33 s >
  1402. 39.33 s > FAIL [ 0.965s] (5/5) gammaloop-integration-tests::test_python_api python_settings_wrappers_expose_nested_runtime_and_global_settings
  1403. 39.33 s > stdout ---
  1404. 39.33 s >
  1405. 39.33 s > running 1 test
  1406. 39.33 s > test python_settings_wrappers_expose_nested_runtime_and_global_settings ... FAILED
  1407. 39.33 s >
  1408. 39.33 s > failures:
  1409. 39.33 s >
  1410. 39.33 s > failures:
  1411. 39.33 s > python_settings_wrappers_expose_nested_runtime_and_global_settings
  1412. 39.33 s >
  1413. 39.33 s > test result: FAILED. 0 passed; 1 failed; 0 ignored; 0 measured; 4 filtered out; finished in 0.95s
  1414. 39.33 s >
  1415. 39.33 s > stderr ---
  1416. 39.33 s > Error: Python API test subprocess failed.
  1417. 39.33 s > stdout:
  1418. 39.33 s > ┌────────────────────────────────────────────────────────┐
  1419. 39.33 s > │ You are running a restricted Symbolica instance. │
  1420. 39.33 s > │ │
  1421. 39.33 s > │ This mode is only permitted for non-commercial use and │
  1422. 39.33 s > │ is limited to one instance and core per machine. │
  1423. 39.33 s > │ │
  1424. 39.33 s > │ Hobbyists can easily acquire a free license key │
  1425. 39.33 s > │ that unlocks all cores and removes this banner: │
  1426. 39.33 s > │ │
  1427. 39.33 s > │ from symbolica import * │
  1428. 39.33 s > │ request_hobbyist_license('YOUR_NAME', 'YOUR_EMAIL') │
  1429. 39.33 s > │ │
  1430. 39.33 s > │ All other users can obtain a free 30-day trial key: │
  1431. 39.33 s > │ │
  1432. 39.33 s > │ from symbolica import * │
  1433. 39.33 s > │ request_trial_license('NAME', 'EMAIL', 'EMPLOYER') │
  1434. 39.33 s > │ │
  1435. 39.33 s > │ See https://symbolica.io/docs/get_started.html#license │
  1436. 39.33 s > └────────────────────────────────────────────────────────┘
  1437. 39.33 s > ┌───────────────────────────────────────────────────────────────────────────────────────────────────────────┐
  1438. 39.33 s > │ Cannot start new unlicensed Symbolica instance since there is already another one running on the machine. │
  1439. 39.33 s > └───────────────────────────────────────────────────────────────────────────────────────────────────────────┘
  1440. 39.33 s >
  1441. 39.33 s > stderr:
  1442. 39.33 s > ┌───────────────────────────────────┐
  1443. 39.33 s > │ The Symbolica license has expired │
  1444. 39.33 s > └───────────────────────────────────┘
  1445. 39.33 s >
  1446. 39.33 s >
  1447. 39.33 s > Location:
  1448. 39.33 s > tests/tests/test_python_api.rs:157:20
  1449. 39.33 s >
  1450. 39.33 s > error: test run failed
  1451. 39.33 s >
  1452. 39.33 s > ========== nextest test summary ==========
  1453. 39.33 s > report: target/nextest/ci_gammaloop/junit.xml
  1454. 39.33 s > tests: 5, failures: 5, errors: 0
  1455. 39.33 s >
  1456. 39.33 s > 1. gammaloop-integration-tests::test_python_api::python_session_getters_return_live_toml_and_command_blocks
  1457. 39.33 s > failure: test failure with exit code 101
  1458. 39.33 s > Error: Python API test subprocess failed.
  1459. 39.33 s > stdout:
  1460. 39.33 s > ┌────────────────────────────────────────────────────────┐
  1461. 39.33 s > │ You are running a restricted Symbolica instance. │
  1462. 39.33 s > │ │
  1463. 39.33 s > │ This mode is only permitted for non-commercial use and │
  1464. 39.33 s > │ is limited to one instance and core per machine. │
  1465. 39.33 s > │ │
  1466. 39.33 s > │ Hobbyists can easily acquire a free license key │
  1467. 39.33 s > │ that unlocks all cores and removes this banner: │
  1468. 39.33 s > │ │
  1469. 39.33 s > │ from symbolica import * │
  1470. 39.33 s > │ request_hobbyist_license('YOUR_NAME', 'YOUR_EMAIL') │
  1471. 39.33 s > │ │
  1472. 39.33 s > │ All other users can obtain a free 30-day trial key: │
  1473. 39.33 s > │ │
  1474. 39.33 s > │ from symbolica import * │
  1475. 39.33 s > │ request_trial_license('NAME', 'EMAIL', 'EMPLOYER') │
  1476. 39.33 s > │ │
  1477. 39.33 s > │ See https://symbolica.io/docs/get_started.html#license │
  1478. 39.33 s > └────────────────────────────────────────────────────────┘
  1479. 39.33 s > ┌───────────────────────────────────────────────────────────────────────────────────────────────────────────┐
  1480. 39.33 s > │ Cannot start new unlicensed Symbolica instance since there is already another one running on the machine. │
  1481. 39.33 s > └───────────────────────────────────────────────────────────────────────────────────────────────────────────┘
  1482. 39.33 s >
  1483. 39.33 s > stderr:
  1484. 39.33 s > ┌───────────────────────────────────┐
  1485. 39.33 s > │ The Symbolica license has expired │
  1486. 39.33 s > └───────────────────────────────────┘
  1487. 39.33 s >
  1488. 39.33 s >
  1489. 39.33 s > Location:
  1490. 39.33 s > tests/tests/test_python_api.rs:157:20
  1491. 39.33 s > system-out
  1492. 39.33 s > running 1 test
  1493. 39.33 s > test python_session_getters_return_live_toml_and_command_blocks ... FAILED
  1494. 39.33 s >
  1495. 39.33 s > failures:
  1496. 39.33 s >
  1497. 39.33 s > failures:
  1498. 39.33 s > python_session_getters_return_live_toml_and_command_blocks
  1499. 39.33 s >
  1500. 39.33 s > test result: FAILED. 0 passed; 1 failed; 0 ignored; 0 measured; 4 filtered out; finished in 0.64s
  1501. 39.33 s > system-err
  1502. 39.33 s > Error: Python API test subprocess failed.
  1503. 39.33 s > stdout:
  1504. 39.33 s > ┌────────────────────────────────────────────────────────┐
  1505. 39.33 s > │ You are running a restricted Symbolica instance. │
  1506. 39.33 s > │ │
  1507. 39.33 s > │ This mode is only permitted for non-commercial use and │
  1508. 39.33 s > │ is limited to one instance and core per machine. │
  1509. 39.33 s > │ │
  1510. 39.33 s > │ Hobbyists can easily acquire a free license key │
  1511. 39.33 s > │ that unlocks all cores and removes this banner: │
  1512. 39.33 s > │ │
  1513. 39.33 s > │ from symbolica import * │
  1514. 39.33 s > │ request_hobbyist_license('YOUR_NAME', 'YOUR_EMAIL') │
  1515. 39.33 s > │ │
  1516. 39.33 s > │ All other users can obtain a free 30-day trial key: │
  1517. 39.33 s > │ │
  1518. 39.33 s > │ from symbolica import * │
  1519. 39.33 s > │ request_trial_license('NAME', 'EMAIL', 'EMPLOYER') │
  1520. 39.33 s > │ │
  1521. 39.33 s > │ See https://symbolica.io/docs/get_started.html#license │
  1522. 39.33 s > └────────────────────────────────────────────────────────┘
  1523. 39.33 s > ┌───────────────────────────────────────────────────────────────────────────────────────────────────────────┐
  1524. 39.33 s > │ Cannot start new unlicensed Symbolica instance since there is already another one running on the machine. │
  1525. 39.33 s > └───────────────────────────────────────────────────────────────────────────────────────────────────────────┘
  1526. 39.33 s >
  1527. 39.33 s > stderr:
  1528. 39.33 s > ┌───────────────────────────────────┐
  1529. 39.33 s > │ The Symbolica license has expired │
  1530. 39.33 s > └───────────────────────────────────┘
  1531. 39.33 s >
  1532. 39.33 s >
  1533. 39.33 s > Location:
  1534. 39.33 s > tests/tests/test_python_api.rs:157:20
  1535. 39.33 s >
  1536. 39.33 s > 2. gammaloop-integration-tests::test_python_api::python_evaluate_samples_batch_and_momentum_space_have_expected_shape
  1537. 39.33 s > failure: test failure with exit code 101
  1538. 39.33 s > Error: Python API test subprocess failed.
  1539. 39.33 s > stdout:
  1540. 39.33 s > ┌────────────────────────────────────────────────────────┐
  1541. 39.33 s > │ You are running a restricted Symbolica instance. │
  1542. 39.33 s > │ │
  1543. 39.33 s > │ This mode is only permitted for non-commercial use and │
  1544. 39.33 s > │ is limited to one instance and core per machine. │
  1545. 39.33 s > │ │
  1546. 39.33 s > │ Hobbyists can easily acquire a free license key │
  1547. 39.33 s > │ that unlocks all cores and removes this banner: │
  1548. 39.33 s > │ │
  1549. 39.33 s > │ from symbolica import * │
  1550. 39.33 s > │ request_hobbyist_license('YOUR_NAME', 'YOUR_EMAIL') │
  1551. 39.33 s > │ │
  1552. 39.33 s > │ All other users can obtain a free 30-day trial key: │
  1553. 39.33 s > │ │
  1554. 39.33 s > │ from symbolica import * │
  1555. 39.33 s > │ request_trial_license('NAME', 'EMAIL', 'EMPLOYER') │
  1556. 39.33 s > │ │
  1557. 39.33 s > │ See https://symbolica.io/docs/get_started.html#license │
  1558. 39.33 s > └────────────────────────────────────────────────────────┘
  1559. 39.33 s > ┌───────────────────────────────────────────────────────────────────────────────────────────────────────────┐
  1560. 39.33 s > │ Cannot start new unlicensed Symbolica instance since there is already another one running on the machine. │
  1561. 39.33 s > └───────────────────────────────────────────────────────────────────────────────────────────────────────────┘
  1562. 39.33 s >
  1563. 39.33 s > stderr:
  1564. 39.33 s > ┌───────────────────────────────────┐
  1565. 39.33 s > │ The Symbolica license has expired │
  1566. 39.33 s > └───────────────────────────────────┘
  1567. 39.33 s >
  1568. 39.33 s >
  1569. 39.33 s > Location:
  1570. 39.33 s > tests/tests/test_python_api.rs:157:20
  1571. 39.33 s > system-out
  1572. 39.33 s > running 1 test
  1573. 39.33 s > test python_evaluate_samples_batch_and_momentum_space_have_expected_shape ... FAILED
  1574. 39.33 s >
  1575. 39.33 s > failures:
  1576. 39.33 s >
  1577. 39.33 s > failures:
  1578. 39.33 s > python_evaluate_samples_batch_and_momentum_space_have_expected_shape
  1579. 39.33 s >
  1580. 39.33 s > test result: FAILED. 0 passed; 1 failed; 0 ignored; 0 measured; 4 filtered out; finished in 0.67s
  1581. 39.33 s > system-err
  1582. 39.33 s > Error: Python API test subprocess failed.
  1583. 39.33 s > stdout:
  1584. 39.33 s > ┌────────────────────────────────────────────────────────┐
  1585. 39.33 s > │ You are running a restricted Symbolica instance. │
  1586. 39.33 s > │ │
  1587. 39.33 s > │ This mode is only permitted for non-commercial use and │
  1588. 39.33 s > │ is limited to one instance and core per machine. │
  1589. 39.33 s > │ │
  1590. 39.33 s > │ Hobbyists can easily acquire a free license key │
  1591. 39.33 s > │ that unlocks all cores and removes this banner: │
  1592. 39.33 s > │ │
  1593. 39.33 s > │ from symbolica import * │
  1594. 39.33 s > │ request_hobbyist_license('YOUR_NAME', 'YOUR_EMAIL') │
  1595. 39.33 s > │ │
  1596. 39.33 s > │ All other users can obtain a free 30-day trial key: │
  1597. 39.33 s > │ │
  1598. 39.33 s > │ from symbolica import * │
  1599. 39.33 s > │ request_trial_license('NAME', 'EMAIL', 'EMPLOYER') │
  1600. 39.33 s > │ │
  1601. 39.33 s > │ See https://symbolica.io/docs/get_started.html#license │
  1602. 39.33 s > └────────────────────────────────────────────────────────┘
  1603. 39.33 s > ┌───────────────────────────────────────────────────────────────────────────────────────────────────────────┐
  1604. 39.33 s > │ Cannot start new unlicensed Symbolica instance since there is already another one running on the machine. │
  1605. 39.33 s > └───────────────────────────────────────────────────────────────────────────────────────────────────────────┘
  1606. 39.33 s >
  1607. 39.33 s > stderr:
  1608. 39.33 s > ┌───────────────────────────────────┐
  1609. 39.33 s > │ The Symbolica license has expired │
  1610. 39.33 s > └───────────────────────────────────┘
  1611. 39.33 s >
  1612. 39.33 s >
  1613. 39.33 s > Location:
  1614. 39.33 s > tests/tests/test_python_api.rs:157:20
  1615. 39.33 s >
  1616. 39.33 s > 3. gammaloop-integration-tests::test_python_api::python_evaluate_sample_preserves_graph_grouping_and_incoming_pdgs
  1617. 39.33 s > failure: test failure with exit code 101
  1618. 39.33 s > Error: Python API test subprocess failed.
  1619. 39.33 s > stdout:
  1620. 39.33 s > ┌────────────────────────────────────────────────────────┐
  1621. 39.33 s > │ You are running a restricted Symbolica instance. │
  1622. 39.33 s > │ │
  1623. 39.33 s > │ This mode is only permitted for non-commercial use and │
  1624. 39.33 s > │ is limited to one instance and core per machine. │
  1625. 39.33 s > │ │
  1626. 39.33 s > │ Hobbyists can easily acquire a free license key │
  1627. 39.33 s > │ that unlocks all cores and removes this banner: │
  1628. 39.33 s > │ │
  1629. 39.33 s > │ from symbolica import * │
  1630. 39.33 s > │ request_hobbyist_license('YOUR_NAME', 'YOUR_EMAIL') │
  1631. 39.33 s > │ │
  1632. 39.33 s > │ All other users can obtain a free 30-day trial key: │
  1633. 39.33 s > │ │
  1634. 39.33 s > │ from symbolica import * │
  1635. 39.33 s > │ request_trial_license('NAME', 'EMAIL', 'EMPLOYER') │
  1636. 39.33 s > │ │
  1637. 39.33 s > │ See https://symbolica.io/docs/get_started.html#license │
  1638. 39.33 s > └────────────────────────────────────────────────────────┘
  1639. 39.33 s > ┌───────────────────────────────────────────────────────────────────────────────────────────────────────────┐
  1640. 39.33 s > │ Cannot start new unlicensed Symbolica instance since there is already another one running on the machine. │
  1641. 39.33 s > └───────────────────────────────────────────────────────────────────────────────────────────────────────────┘
  1642. 39.33 s >
  1643. 39.33 s > stderr:
  1644. 39.33 s > ┌───────────────────────────────────┐
  1645. 39.33 s > │ The Symbolica license has expired │
  1646. 39.33 s > └───────────────────────────────────┘
  1647. 39.33 s >
  1648. 39.33 s >
  1649. 39.33 s > Location:
  1650. 39.33 s > tests/tests/test_python_api.rs:157:20
  1651. 39.33 s > system-out
  1652. 39.33 s > running 1 test
  1653. 39.33 s > test python_evaluate_sample_preserves_graph_grouping_and_incoming_pdgs ... FAILED
  1654. 39.33 s >
  1655. 39.33 s > failures:
  1656. 39.33 s >
  1657. 39.33 s > failures:
  1658. 39.33 s > python_evaluate_sample_preserves_graph_grouping_and_incoming_pdgs
  1659. 39.33 s >
  1660. 39.33 s > test result: FAILED. 0 passed; 1 failed; 0 ignored; 0 measured; 4 filtered out; finished in 0.67s
  1661. 39.33 s > system-err
  1662. 39.33 s > Error: Python API test subprocess failed.
  1663. 39.33 s > stdout:
  1664. 39.33 s > ┌────────────────────────────────────────────────────────┐
  1665. 39.33 s > │ You are running a restricted Symbolica instance. │
  1666. 39.33 s > │ │
  1667. 39.33 s > │ This mode is only permitted for non-commercial use and │
  1668. 39.33 s > │ is limited to one instance and core per machine. │
  1669. 39.33 s > │ │
  1670. 39.33 s > │ Hobbyists can easily acquire a free license key │
  1671. 39.33 s > │ that unlocks all cores and removes this banner: │
  1672. 39.33 s > │ │
  1673. 39.33 s > │ from symbolica import * │
  1674. 39.33 s > │ request_hobbyist_license('YOUR_NAME', 'YOUR_EMAIL') │
  1675. 39.33 s > │ │
  1676. 39.33 s > │ All other users can obtain a free 30-day trial key: │
  1677. 39.33 s > │ │
  1678. 39.33 s > │ from symbolica import * │
  1679. 39.33 s > │ request_trial_license('NAME', 'EMAIL', 'EMPLOYER') │
  1680. 39.33 s > │ │
  1681. 39.33 s > │ See https://symbolica.io/docs/get_started.html#license │
  1682. 39.33 s > └────────────────────────────────────────────────────────┘
  1683. 39.33 s > ┌───────────────────────────────────────────────────────────────────────────────────────────────────────────┐
  1684. 39.33 s > │ Cannot start new unlicensed Symbolica instance since there is already another one running on the machine. │
  1685. 39.33 s > └───────────────────────────────────────────────────────────────────────────────────────────────────────────┘
  1686. 39.33 s >
  1687. 39.33 s > stderr:
  1688. 39.33 s > ┌───────────────────────────────────┐
  1689. 39.33 s > │ The Symbolica license has expired │
  1690. 39.33 s > └───────────────────────────────────┘
  1691. 39.33 s >
  1692. 39.33 s >
  1693. 39.33 s > Location:
  1694. 39.33 s > tests/tests/test_python_api.rs:157:20
  1695. 39.33 s >
  1696. 39.33 s > 4. gammaloop-integration-tests::test_python_api::python_evaluate_sample_honors_generate_events_and_observable_snapshots
  1697. 39.33 s > failure: test failure with exit code 101
  1698. 39.33 s > Error: Python API test subprocess failed.
  1699. 39.33 s > stdout:
  1700. 39.33 s > ┌────────────────────────────────────────────────────────┐
  1701. 39.33 s > │ You are running a restricted Symbolica instance. │
  1702. 39.33 s > │ │
  1703. 39.33 s > │ This mode is only permitted for non-commercial use and │
  1704. 39.33 s > │ is limited to one instance and core per machine. │
  1705. 39.33 s > │ │
  1706. 39.33 s > │ Hobbyists can easily acquire a free license key │
  1707. 39.33 s > │ that unlocks all cores and removes this banner: │
  1708. 39.33 s > │ │
  1709. 39.33 s > │ from symbolica import * │
  1710. 39.33 s > │ request_hobbyist_license('YOUR_NAME', 'YOUR_EMAIL') │
  1711. 39.33 s > │ │
  1712. 39.33 s > │ All other users can obtain a free 30-day trial key: │
  1713. 39.33 s > │ │
  1714. 39.33 s > │ from symbolica import * │
  1715. 39.33 s > │ request_trial_license('NAME', 'EMAIL', 'EMPLOYER') │
  1716. 39.33 s > │ │
  1717. 39.33 s > │ See https://symbolica.io/docs/get_started.html#license │
  1718. 39.33 s > └────────────────────────────────────────────────────────┘
  1719. 39.33 s > ┌───────────────────────────────────────────────────────────────────────────────────────────────────────────┐
  1720. 39.33 s > │ Cannot start new unlicensed Symbolica instance since there is already another one running on the machine. │
  1721. 39.33 s > └───────────────────────────────────────────────────────────────────────────────────────────────────────────┘
  1722. 39.33 s >
  1723. 39.33 s > stderr:
  1724. 39.33 s > ┌───────────────────────────────────┐
  1725. 39.33 s > │ The Symbolica license has expired │
  1726. 39.33 s > └───────────────────────────────────┘
  1727. 39.33 s > [2026-09-02 02:19:17.561] @gammaloop_api::se... INFO : Running command import model sm-default
  1728. 39.33 s > [2026-09-02 02:19:17.561] @import::model INFO : Loading built-in JSON model sm-default
  1729. 39.33 s > [2026-09-02 02:19:17.585] @gammaloop_api::se... INFO : Running command set default-runtime kv kinematics.externals='{"type":"constant","data":{"momenta":[[32.0,0.0,0.0,32.0],[32.0,0.0,0.0,-32.0]],"helicities":[1,1]}}'
  1730. 39.33 s > [2026-09-02 02:19:17.586] @gammaloop_api::se... INFO : Running command set default-runtime kv subtraction.disable_threshold_subtraction=true
  1731. 39.33 s > [2026-09-02 02:19:17.587] @gammaloop_api::se... INFO : Running command generate xs e+ e- > d d~ g | e- a d g QED^2==4 [{{2}} QCD=0] --numerator-grouping group_identical_graphs_up_to_sign --clear-existing-processes --only-diagrams
  1732. 39.33 s > [2026-09-02 02:19:17.979] @commands::generate INFO : Generated cross-section 2 graphs.
  1733. 39.33 s > [2026-09-02 02:19:17.979] @commands::generate INFO : Only diagram generation was requested, skipping integrand generation. You can generate integrands later using the 'generate existing <options>' command.
  1734. 39.33 s > [2026-09-02 02:19:17.980] @gammaloop_api::se... INFO : Running command generate
  1735. 39.33 s >
  1736. 39.33 s >
  1737. 39.33 s > Location:
  1738. 39.33 s > tests/tests/test_python_api.rs:157:20
  1739. 39.33 s > system-out
  1740. 39.33 s > running 1 test
  1741. 39.33 s > test python_evaluate_sample_honors_generate_events_and_observable_snapshots ... FAILED
  1742. 39.33 s >
  1743. 39.33 s > failures:
  1744. 39.33 s >
  1745. 39.33 s > failures:
  1746. 39.33 s > python_evaluate_sample_honors_generate_events_and_observable_snapshots
  1747. 39.33 s >
  1748. 39.33 s > test result: FAILED. 0 passed; 1 failed; 0 ignored; 0 measured; 4 filtered out; finished in 0.91s
  1749. 39.33 s > system-err
  1750. 39.33 s > Error: Python API test subprocess failed.
  1751. 39.33 s > stdout:
  1752. 39.33 s > ┌────────────────────────────────────────────────────────┐
  1753. 39.33 s > │ You are running a restricted Symbolica instance. │
  1754. 39.33 s > │ │
  1755. 39.33 s > │ This mode is only permitted for non-commercial use and │
  1756. 39.33 s > │ is limited to one instance and core per machine. │
  1757. 39.33 s > │ │
  1758. 39.33 s > │ Hobbyists can easily acquire a free license key │
  1759. 39.33 s > │ that unlocks all cores and removes this banner: │
  1760. 39.33 s > │ │
  1761. 39.33 s > │ from symbolica import * │
  1762. 39.33 s > │ request_hobbyist_license('YOUR_NAME', 'YOUR_EMAIL') │
  1763. 39.33 s > │ │
  1764. 39.33 s > │ All other users can obtain a free 30-day trial key: │
  1765. 39.33 s > │ │
  1766. 39.33 s > │ from symbolica import * │
  1767. 39.33 s > │ request_trial_license('NAME', 'EMAIL', 'EMPLOYER') │
  1768. 39.33 s > │ │
  1769. 39.33 s > │ See https://symbolica.io/docs/get_started.html#license │
  1770. 39.33 s > └────────────────────────────────────────────────────────┘
  1771. 39.33 s > ┌───────────────────────────────────────────────────────────────────────────────────────────────────────────┐
  1772. 39.33 s > │ Cannot start new unlicensed Symbolica instance since there is already another one running on the machine. │
  1773. 39.33 s > └───────────────────────────────────────────────────────────────────────────────────────────────────────────┘
  1774. 39.33 s >
  1775. 39.33 s > stderr:
  1776. 39.33 s > ┌───────────────────────────────────┐
  1777. 39.33 s > │ The Symbolica license has expired │
  1778. 39.33 s > └───────────────────────────────────┘
  1779. 39.33 s > [2026-09-02 02:19:17.561] @gammaloop_api::se... INFO : Running command import model sm-default
  1780. 39.33 s > [2026-09-02 02:19:17.561] @import::model INFO : Loading built-in JSON model sm-default
  1781. 39.33 s > [2026-09-02 02:19:17.585] @gammaloop_api::se... INFO : Running command set default-runtime kv kinematics.externals='{"type":"constant","data":{"momenta":[[32.0,0.0,0.0,32.0],[32.0,0.0,0.0,-32.0]],"helicities":[1,1]}}'
  1782. 39.33 s > [2026-09-02 02:19:17.586] @gammaloop_api::se... INFO : Running command set default-runtime kv subtraction.disable_threshold_subtraction=true
  1783. 39.33 s > [2026-09-02 02:19:17.587] @gammaloop_api::se... INFO : Running command generate xs e+ e- > d d~ g | e- a d g QED^2==4 [{{2}} QCD=0] --numerator-grouping group_identical_graphs_up_to_sign --clear-existing-processes --only-diagrams
  1784. 39.33 s > [2026-09-02 02:19:17.979] @commands::generate INFO : Generated cross-section 2 graphs.
  1785. 39.33 s > [2026-09-02 02:19:17.979] @commands::generate INFO : Only diagram generation was requested, skipping integrand generation. You can generate integrands later using the 'generate existing <options>' command.
  1786. 39.33 s > [2026-09-02 02:19:17.980] @gammaloop_api::se... INFO : Running command generate
  1787. 39.33 s >
  1788. 39.33 s >
  1789. 39.33 s > Location:
  1790. 39.33 s > tests/tests/test_python_api.rs:157:20
  1791. 39.33 s >
  1792. 39.33 s > 5. gammaloop-integration-tests::test_python_api::python_settings_wrappers_expose_nested_runtime_and_global_settings
  1793. 39.33 s > failure: test failure with exit code 101
  1794. 39.33 s > Error: Python API test subprocess failed.
  1795. 39.33 s > stdout:
  1796. 39.33 s > ┌────────────────────────────────────────────────────────┐
  1797. 39.33 s > │ You are running a restricted Symbolica instance. │
  1798. 39.33 s > │ │
  1799. 39.33 s > │ This mode is only permitted for non-commercial use and │
  1800. 39.33 s > │ is limited to one instance and core per machine. │
  1801. 39.33 s > │ │
  1802. 39.33 s > │ Hobbyists can easily acquire a free license key │
  1803. 39.33 s > │ that unlocks all cores and removes this banner: │
  1804. 39.33 s > │ │
  1805. 39.33 s > │ from symbolica import * │
  1806. 39.33 s > │ request_hobbyist_license('YOUR_NAME', 'YOUR_EMAIL') │
  1807. 39.33 s > │ │
  1808. 39.33 s > │ All other users can obtain a free 30-day trial key: │
  1809. 39.33 s > │ │
  1810. 39.33 s > │ from symbolica import * │
  1811. 39.33 s > │ request_trial_license('NAME', 'EMAIL', 'EMPLOYER') │
  1812. 39.33 s > │ │
  1813. 39.33 s > │ See https://symbolica.io/docs/get_started.html#license │
  1814. 39.33 s > └────────────────────────────────────────────────────────┘
  1815. 39.33 s > ┌───────────────────────────────────────────────────────────────────────────────────────────────────────────┐
  1816. 39.33 s > │ Cannot start new unlicensed Symbolica instance since there is already another one running on the machine. │
  1817. 39.33 s > └───────────────────────────────────────────────────────────────────────────────────────────────────────────┘
  1818. 39.33 s >
  1819. 39.33 s > stderr:
  1820. 39.33 s > ┌───────────────────────────────────┐
  1821. 39.33 s > │ The Symbolica license has expired │
  1822. 39.33 s > └───────────────────────────────────┘
  1823. 39.33 s >
  1824. 39.33 s >
  1825. 39.33 s > Location:
  1826. 39.33 s > tests/tests/test_python_api.rs:157:20
  1827. 39.33 s > system-out
  1828. 39.33 s > running 1 test
  1829. 39.33 s > test python_settings_wrappers_expose_nested_runtime_and_global_settings ... FAILED
  1830. 39.33 s >
  1831. 39.33 s > failures:
  1832. 39.33 s >
  1833. 39.33 s > failures:
  1834. 39.33 s > python_settings_wrappers_expose_nested_runtime_and_global_settings
  1835. 39.33 s >
  1836. 39.33 s > test result: FAILED. 0 passed; 1 failed; 0 ignored; 0 measured; 4 filtered out; finished in 0.95s
  1837. 39.33 s > system-err
  1838. 39.33 s > Error: Python API test subprocess failed.
  1839. 39.33 s > stdout:
  1840. 39.33 s > ┌────────────────────────────────────────────────────────┐
  1841. 39.33 s > │ You are running a restricted Symbolica instance. │
  1842. 39.33 s > │ │
  1843. 39.33 s > │ This mode is only permitted for non-commercial use and │
  1844. 39.33 s > │ is limited to one instance and core per machine. │
  1845. 39.33 s > │ │
  1846. 39.33 s > │ Hobbyists can easily acquire a free license key │
  1847. 39.33 s > │ that unlocks all cores and removes this banner: │
  1848. 39.33 s > │ │
  1849. 39.33 s > │ from symbolica import * │
  1850. 39.33 s > │ request_hobbyist_license('YOUR_NAME', 'YOUR_EMAIL') │
  1851. 39.33 s > │ │
  1852. 39.33 s > │ All other users can obtain a free 30-day trial key: │
  1853. 39.33 s > │ │
  1854. 39.33 s > │ from symbolica import * │
  1855. 39.33 s > │ request_trial_license('NAME', 'EMAIL', 'EMPLOYER') │
  1856. 39.33 s > │ │
  1857. 39.33 s > │ See https://symbolica.io/docs/get_started.html#license │
  1858. 39.33 s > └────────────────────────────────────────────────────────┘
  1859. 39.33 s > ┌───────────────────────────────────────────────────────────────────────────────────────────────────────────┐
  1860. 39.33 s > │ Cannot start new unlicensed Symbolica instance since there is already another one running on the machine. │
  1861. 39.33 s > └───────────────────────────────────────────────────────────────────────────────────────────────────────────┘
  1862. 39.33 s >
  1863. 39.33 s > stderr:
  1864. 39.33 s > ┌───────────────────────────────────┐
  1865. 39.33 s > │ The Symbolica license has expired │
  1866. 39.33 s > └───────────────────────────────────┘
  1867. 39.33 s >
  1868. 39.33 s >
  1869. 39.33 s > Location:
  1870. 39.33 s > tests/tests/test_python_api.rs:157:20
  1871. 39.33 s > =========================================
  1872. 39.33 s For full logs, run:
  1873. 39.33 s nix log /nix/store/fzljqa63rh9s640jcldimpyrcjcnir2c-gammaloop-nextest-python-api.drv
  1874. 39.54 s Run failed.