1. 0.00 s $ /nix/store/bhv6xyvqw6gjs3j488gi1z6wdv18bdpa-coreutils-9.11/bin/timeout --kill-after=15s 7200s /nix/store/bxgja2ppiqi6w2bgn0r07d7mgnl1k6k2-nix-2.34.8/bin/nix --extra-experimental-features nix-command --extra-experimental-features flakes flake clone git+https://github.com/alphal00p/gammaloop --dest /tmp/nix-ci-worker/stable-pwd/repo/
  2. 0.06 s Cloning into '/tmp/nix-ci-worker/stable-pwd/repo'...
  3. 0.82 s remote: Enumerating objects: 162082, done.
  4. 0.93 s remote: Counting objects: 0% (1/3658) remote: Counting objects: 1% (37/3658) remote: Counting objects: 2% (74/3658) remote: Counting objects: 3% (110/3658) remote: Counting objects: 4% (147/3658) remote: Counting objects: 5% (183/3658) remote: Counting objects: 6% (220/3658) remote: Counting objects: 7% (257/3658) remote: Counting objects: 8% (293/3658) remote: Counting objects: 9% (330/3658) remote: Counting objects: 10% (366/3658) remote: Counting objects: 11% (403/3658) remote: Counting objects: 12% (439/3658) remote: Counting objects: 13% (476/3658) remote: Counting objects: 14% (513/3658) remote: Counting objects: 15% (549/3658) remote: Counting objects: 16% (586/3658) remote: Counting objects: 17% (622/3658) remote: Counting objects: 18% (659/3658) remote: Counting objects: 19% (696/3658) remote: Counting objects: 20% (732/3658) remote: Counting objects: 21% (769/3658) remote: Counting objects: 22% (805/3658) remote: Counting objects: 23% (842/3658) remote: Counting objects: 24% (878/3658) remote: Counting objects: 25% (915/3658) remote: Counting objects: 26% (952/3658) remote: Counting objects: 27% (988/3658) remote: Counting objects: 28% (1025/3658) remote: Counting objects: 29% (1061/3658) remote: Counting objects: 30% (1098/3658) remote: Counting objects: 31% (1134/3658) remote: Counting objects: 32% (1171/3658) remote: Counting objects: 33% (1208/3658) remote: Counting objects: 34% (1244/3658) remote: Counting objects: 35% (1281/3658) remote: Counting objects: 36% (1317/3658) remote: Counting objects: 37% (1354/3658) remote: Counting objects: 38% (1391/3658) remote: Counting objects: 39% (1427/3658) remote: Counting objects: 40% (1464/3658) remote: Counting objects: 41% (1500/3658) remote: Counting objects: 42% (1537/3658) remote: Counting objects: 43% (1573/3658) remote: Counting objects: 44% (1610/3658) remote: Counting objects: 45% (1647/3658) remote: Counting objects: 46% (1683/3658) remote: Counting objects: 47% (1720/3658) remote: Counting objects: 48% (1756/3658) remote: Counting objects: 49% (1793/3658) remote: Counting objects: 50% (1829/3658) remote: Counting objects: 51% (1866/3658) remote: Counting objects: 52% (1903/3658) remote: Counting objects: 53% (1939/3658) remote: Counting objects: 54% (1976/3658) remote: Counting objects: 55% (2012/3658) remote: Counting objects: 56% (2049/3658) remote: Counting objects: 57% (2086/3658) remote: Counting objects: 58% (2122/3658) remote: Counting objects: 59% (2159/3658) remote: Counting objects: 60% (2195/3658) remote: Counting objects: 61% (2232/3658) remote: Counting objects: 62% (2268/3658) remote: Counting objects: 63% (2305/3658) remote: Counting objects: 64% (2342/3658) remote: Counting objects: 65% (2378/3658) remote: Counting objects: 66% (2415/3658) remote: Counting objects: 67% (2451/3658) remote: Counting objects: 68% (2488/3658) remote: Counting objects: 69% (2525/3658) remote: Counting objects: 70% (2561/3658) remote: Counting objects: 71% (2598/3658) remote: Counting objects: 72% (2634/3658) remote: Counting objects: 73% (2671/3658) remote: Counting objects: 74% (2707/3658) remote: Counting objects: 75% (2744/3658) remote: Counting objects: 76% (2781/3658) remote: Counting objects: 77% (2817/3658) remote: Counting objects: 78% (2854/3658) remote: Counting objects: 79% (2890/3658) remote: Counting objects: 80% (2927/3658) remote: Counting objects: 81% (2963/3658) remote: Counting objects: 82% (3000/3658) remote: Counting objects: 83% (3037/3658) remote: Counting objects: 84% (3073/3658) remote: Counting objects: 85% (3110/3658) remote: Counting objects: 86% (3146/3658) remote: Counting objects: 87% (3183/3658) remote: Counting objects: 88% (3220/3658) remote: Counting objects: 89% (3256/3658) remote: Counting objects: 90% (3293/3658) remote: Counting objects: 91% (3329/3658) remote: Counting objects: 92% (3366/3658) remote: Counting objects: 93% (3402/3658) remote: Counting objects: 94% (3439/3658) remote: Counting objects: 95% (3476/3658) remote: Counting objects: 96% (3512/3658) remote: Counting objects: 97% (3549/3658) remote: Counting objects: 98% (3585/3658) remote: Counting objects: 99% (3622/3658) remote: Counting objects: 100% (3658/3658) remote: Counting objects: 100% (3658/3658), done.
  5. 2.82 s remote: Compressing objects: 0% (1/1470) remote: Compressing objects: 1% (15/1470) remote: Compressing objects: 2% (30/1470) remote: Compressing objects: 3% (45/1470) remote: Compressing objects: 4% (59/1470) remote: Compressing objects: 5% (74/1470) remote: Compressing objects: 6% (89/1470) remote: Compressing objects: 7% (103/1470) remote: Compressing objects: 8% (118/1470) remote: Compressing objects: 9% (133/1470) remote: Compressing objects: 10% (147/1470) remote: Compressing objects: 11% (162/1470) remote: Compressing objects: 12% (177/1470) remote: Compressing objects: 13% (192/1470) remote: Compressing objects: 14% (206/1470) remote: Compressing objects: 15% (221/1470) remote: Compressing objects: 16% (236/1470) remote: Compressing objects: 17% (250/1470) remote: Compressing objects: 18% (265/1470) remote: Compressing objects: 19% (280/1470) remote: Compressing objects: 20% (294/1470) remote: Compressing objects: 21% (309/1470) remote: Compressing objects: 22% (324/1470) remote: Compressing objects: 23% (339/1470) remote: Compressing objects: 24% (353/1470) remote: Compressing objects: 25% (368/1470) remote: Compressing objects: 26% (383/1470) remote: Compressing objects: 27% (397/1470) remote: Compressing objects: 28% (412/1470) remote: Compressing objects: 29% (427/1470) remote: Compressing objects: 30% (441/1470) remote: Compressing objects: 31% (456/1470) remote: Compressing objects: 32% (471/1470) remote: Compressing objects: 32% (483/1470) remote: Compressing objects: 33% (486/1470) remote: Compressing objects: 34% (500/1470) remote: Compressing objects: 35% (515/1470) remote: Compressing objects: 36% (530/1470) remote: Compressing objects: 37% (544/1470) remote: Compressing objects: 38% (559/1470) remote: Compressing objects: 39% (574/1470) remote: Compressing objects: 40% (588/1470) remote: Compressing objects: 41% (603/1470) remote: Compressing objects: 42% (618/1470) remote: Compressing objects: 43% (633/1470) remote: Compressing objects: 44% (647/1470) remote: Compressing objects: 45% (662/1470) remote: Compressing objects: 46% (677/1470) remote: Compressing objects: 47% (691/1470) remote: Compressing objects: 48% (706/1470) remote: Compressing objects: 49% (721/1470) remote: Compressing objects: 50% (735/1470) remote: Compressing objects: 51% (750/1470) remote: Compressing objects: 52% (765/1470) remote: Compressing objects: 53% (780/1470) remote: Compressing objects: 54% (794/1470) remote: Compressing objects: 55% (809/1470) remote: Compressing objects: 56% (824/1470) remote: Compressing objects: 57% (838/1470) remote: Compressing objects: 58% (853/1470) remote: Compressing objects: 59% (868/1470) remote: Compressing objects: 60% (882/1470) remote: Compressing objects: 61% (897/1470) remote: Compressing objects: 62% (912/1470) remote: Compressing objects: 63% (927/1470) remote: Compressing objects: 64% (941/1470) remote: Compressing objects: 65% (956/1470) remote: Compressing objects: 66% (971/1470) remote: Compressing objects: 67% (985/1470) remote: Compressing objects: 68% (1000/1470) remote: Compressing objects: 69% (1015/1470) remote: Compressing objects: 70% (1029/1470) remote: Compressing objects: 71% (1044/1470) remote: Compressing objects: 72% (1059/1470) remote: Compressing objects: 73% (1074/1470) remote: Compressing objects: 74% (1088/1470) remote: Compressing objects: 75% (1103/1470) remote: Compressing objects: 76% (1118/1470) remote: Compressing objects: 77% (1132/1470) remote: Compressing objects: 78% (1147/1470) remote: Compressing objects: 79% (1162/1470) remote: Compressing objects: 80% (1176/1470) remote: Compressing objects: 81% (1191/1470) remote: Compressing objects: 82% (1206/1470) remote: Compressing objects: 83% (1221/1470) remote: Compressing objects: 84% (1235/1470) remote: Compressing objects: 85% (1250/1470) remote: Compressing objects: 86% (1265/1470) remote: Compressing objects: 87% (1279/1470) remote: Compressing objects: 88% (1294/1470) remote: Compressing objects: 89% (1309/1470) remote: Compressing objects: 89% (1311/1470) remote: Compressing objects: 90% (1323/1470) remote: Compressing objects: 91% (1338/1470) remote: Compressing objects: 92% (1353/1470) remote: Compressing objects: 93% (1368/1470) remote: Compressing objects: 94% (1382/1470) remote: Compressing objects: 95% (1397/1470) remote: Compressing objects: 96% (1412/1470) remote: Compressing objects: 97% (1426/1470) remote: Compressing objects: 98% (1441/1470) remote: Compressing objects: 99% (1456/1470) remote: Compressing objects: 100% (1470/1470) remote: Compressing objects: 100% (1470/1470), done.
  6. 19.91 s Receiving objects: 0% (1/162082) Receiving objects: 1% (1621/162082) Receiving objects: 2% (3242/162082) Receiving objects: 3% (4863/162082) Receiving objects: 4% (6484/162082) Receiving objects: 5% (8105/162082), 15.02 MiB | 29.91 MiB/s Receiving objects: 5% (9335/162082), 15.02 MiB | 29.91 MiB/s Receiving objects: 6% (9725/162082), 29.24 MiB | 29.17 MiB/s Receiving objects: 7% (11346/162082), 29.24 MiB | 29.17 MiB/s Receiving objects: 8% (12967/162082), 29.24 MiB | 29.17 MiB/s Receiving objects: 9% (14588/162082), 29.24 MiB | 29.17 MiB/s Receiving objects: 10% (16209/162082), 45.19 MiB | 30.08 MiB/s Receiving objects: 11% (17830/162082), 45.19 MiB | 30.08 MiB/s Receiving objects: 11% (17908/162082), 45.19 MiB | 30.08 MiB/s Receiving objects: 12% (19450/162082), 57.60 MiB | 28.77 MiB/s Receiving objects: 13% (21071/162082), 57.60 MiB | 28.77 MiB/s Receiving objects: 14% (22692/162082), 69.82 MiB | 27.90 MiB/s Receiving objects: 15% (24313/162082), 69.82 MiB | 27.90 MiB/s Receiving objects: 16% (25934/162082), 69.82 MiB | 27.90 MiB/s Receiving objects: 16% (26332/162082), 82.40 MiB | 27.45 MiB/s Receiving objects: 17% (27554/162082), 82.40 MiB | 27.45 MiB/s Receiving objects: 18% (29175/162082), 95.50 MiB | 27.27 MiB/s Receiving objects: 19% (30796/162082), 95.50 MiB | 27.27 MiB/s Receiving objects: 20% (32417/162082), 95.50 MiB | 27.27 MiB/s Receiving objects: 20% (32474/162082), 95.50 MiB | 27.27 MiB/s Receiving objects: 21% (34038/162082), 108.77 MiB | 27.18 MiB/s Receiving objects: 22% (35659/162082), 122.24 MiB | 27.15 MiB/s Receiving objects: 23% (37279/162082), 122.24 MiB | 27.15 MiB/s Receiving objects: 23% (38136/162082), 122.24 MiB | 27.15 MiB/s Receiving objects: 24% (38900/162082), 135.98 MiB | 26.88 MiB/s Receiving objects: 25% (40521/162082), 135.98 MiB | 26.88 MiB/s Receiving objects: 26% (42142/162082), 135.98 MiB | 26.88 MiB/s Receiving objects: 27% (43763/162082), 149.74 MiB | 26.78 MiB/s Receiving objects: 28% (45383/162082), 149.74 MiB | 26.78 MiB/s Receiving objects: 29% (47004/162082), 149.74 MiB | 26.78 MiB/s Receiving objects: 30% (48625/162082), 149.74 MiB | 26.78 MiB/s Receiving objects: 30% (49545/162082), 163.79 MiB | 26.35 MiB/s Receiving objects: 31% (50246/162082), 163.79 MiB | 26.35 MiB/s Receiving objects: 32% (51867/162082), 163.79 MiB | 26.35 MiB/s Receiving objects: 33% (53488/162082), 163.79 MiB | 26.35 MiB/s Receiving objects: 34% (55108/162082), 163.79 MiB | 26.35 MiB/s Receiving objects: 35% (56729/162082), 163.79 MiB | 26.35 MiB/s Receiving objects: 36% (58350/162082), 163.79 MiB | 26.35 MiB/s Receiving objects: 37% (59971/162082), 163.79 MiB | 26.35 MiB/s Receiving objects: 38% (61592/162082), 163.79 MiB | 26.35 MiB/s Receiving objects: 39% (63212/162082), 178.21 MiB | 26.80 MiB/s Receiving objects: 40% (64833/162082), 178.21 MiB | 26.80 MiB/s Receiving objects: 41% (66454/162082), 178.21 MiB | 26.80 MiB/s Receiving objects: 42% (68075/162082), 178.21 MiB | 26.80 MiB/s Receiving objects: 42% (69659/162082), 192.84 MiB | 27.33 MiB/s Receiving objects: 43% (69696/162082), 192.84 MiB | 27.33 MiB/s Receiving objects: 44% (71317/162082), 192.84 MiB | 27.33 MiB/s Receiving objects: 45% (72937/162082), 192.84 MiB | 27.33 MiB/s Receiving objects: 46% (74558/162082), 192.84 MiB | 27.33 MiB/s Receiving objects: 47% (76179/162082), 192.84 MiB | 27.33 MiB/s Receiving objects: 48% (77800/162082), 207.84 MiB | 27.87 MiB/s Receiving objects: 48% (77862/162082), 222.86 MiB | 28.30 MiB/s Receiving objects: 48% (78211/162082), 252.93 MiB | 29.02 MiB/s Receiving objects: 49% (79421/162082), 267.90 MiB | 29.30 MiB/s Receiving objects: 50% (81041/162082), 267.90 MiB | 29.30 MiB/s Receiving objects: 50% (81296/162082), 282.80 MiB | 29.55 MiB/s Receiving objects: 51% (82662/162082), 282.80 MiB | 29.55 MiB/s Receiving objects: 51% (83702/162082), 298.89 MiB | 30.01 MiB/s Receiving objects: 52% (84283/162082), 315.59 MiB | 30.51 MiB/s Receiving objects: 53% (85904/162082), 315.59 MiB | 30.51 MiB/s Receiving objects: 54% (87525/162082), 315.59 MiB | 30.51 MiB/s Receiving objects: 55% (89146/162082), 315.59 MiB | 30.51 MiB/s Receiving objects: 56% (90766/162082), 329.51 MiB | 30.35 MiB/s Receiving objects: 57% (92387/162082), 329.51 MiB | 30.35 MiB/s Receiving objects: 58% (94008/162082), 329.51 MiB | 30.35 MiB/s Receiving objects: 59% (95629/162082), 329.51 MiB | 30.35 MiB/s Receiving objects: 60% (97250/162082), 329.51 MiB | 30.35 MiB/s Receiving objects: 61% (98871/162082), 329.51 MiB | 30.35 MiB/s Receiving objects: 62% (100491/162082), 329.51 MiB | 30.35 MiB/s Receiving objects: 63% (102112/162082), 329.51 MiB | 30.35 MiB/s Receiving objects: 64% (103733/162082), 329.51 MiB | 30.35 MiB/s Receiving objects: 65% (105354/162082), 329.51 MiB | 30.35 MiB/s Receiving objects: 66% (106975/162082), 329.51 MiB | 30.35 MiB/s Receiving objects: 67% (108595/162082), 329.51 MiB | 30.35 MiB/s Receiving objects: 68% (110216/162082), 329.51 MiB | 30.35 MiB/s Receiving objects: 69% (111837/162082), 329.51 MiB | 30.35 MiB/s Receiving objects: 70% (113458/162082), 329.51 MiB | 30.35 MiB/s Receiving objects: 71% (115079/162082), 329.51 MiB | 30.35 MiB/s Receiving objects: 72% (116700/162082), 329.51 MiB | 30.35 MiB/s Receiving objects: 73% (118320/162082), 329.51 MiB | 30.35 MiB/s Receiving objects: 74% (119941/162082), 329.51 MiB | 30.35 MiB/s Receiving objects: 75% (121562/162082), 329.51 MiB | 30.35 MiB/s Receiving objects: 75% (122186/162082), 343.98 MiB | 30.23 MiB/s Receiving objects: 76% (123183/162082), 343.98 MiB | 30.23 MiB/s Receiving objects: 77% (124804/162082), 357.77 MiB | 29.96 MiB/s Receiving objects: 77% (125927/162082), 357.77 MiB | 29.96 MiB/s Receiving objects: 78% (126424/162082), 357.77 MiB | 29.96 MiB/s Receiving objects: 79% (128045/162082), 357.77 MiB | 29.96 MiB/s Receiving objects: 80% (129666/162082), 357.77 MiB | 29.96 MiB/s Receiving objects: 81% (131287/162082), 372.31 MiB | 29.86 MiB/s Receiving objects: 82% (132908/162082), 372.31 MiB | 29.86 MiB/s Receiving objects: 83% (134529/162082), 387.43 MiB | 29.88 MiB/s Receiving objects: 83% (134556/162082), 387.43 MiB | 29.88 MiB/s Receiving objects: 84% (136149/162082), 403.14 MiB | 30.04 MiB/s Receiving objects: 85% (137770/162082), 403.14 MiB | 30.04 MiB/s Receiving objects: 86% (139391/162082), 403.14 MiB | 30.04 MiB/s Receiving objects: 87% (141012/162082), 419.27 MiB | 30.32 MiB/s Receiving objects: 88% (142633/162082), 419.27 MiB | 30.32 MiB/s Receiving objects: 89% (144253/162082), 419.27 MiB | 30.32 MiB/s Receiving objects: 89% (145252/162082), 419.27 MiB | 30.32 MiB/s Receiving objects: 90% (145874/162082), 435.77 MiB | 30.40 MiB/s Receiving objects: 91% (147495/162082), 452.47 MiB | 30.41 MiB/s Receiving objects: 92% (149116/162082), 452.47 MiB | 30.41 MiB/s Receiving objects: 93% (150737/162082), 452.47 MiB | 30.41 MiB/s Receiving objects: 94% (152358/162082), 452.47 MiB | 30.41 MiB/s Receiving objects: 94% (152852/162082), 469.14 MiB | 31.02 MiB/s Receiving objects: 95% (153978/162082), 469.14 MiB | 31.02 MiB/s Receiving objects: 96% (155599/162082), 485.69 MiB | 31.48 MiB/s Receiving objects: 97% (157220/162082), 485.69 MiB | 31.48 MiB/s Receiving objects: 98% (158841/162082), 485.69 MiB | 31.48 MiB/s Receiving objects: 99% (160462/162082), 485.69 MiB | 31.48 MiB/s Receiving objects: 99% (160641/162082), 485.69 MiB | 31.48 MiB/s remote: Total 162082 (delta 2545), reused 2660 (delta 2170), pack-reused 158424 (from 3)
  7. 19.92 s Receiving objects: 100% (162082/162082), 498.61 MiB | 31.28 MiB/s Receiving objects: 100% (162082/162082), 500.55 MiB | 29.29 MiB/s, done.
  8. 22.16 s Resolving deltas: 0% (0/105553) Resolving deltas: 1% (1056/105553) Resolving deltas: 2% (2114/105553) Resolving deltas: 3% (3167/105553) Resolving deltas: 4% (4223/105553) Resolving deltas: 5% (5279/105553) Resolving deltas: 6% (6334/105553) Resolving deltas: 7% (7389/105553) Resolving deltas: 8% (8445/105553) Resolving deltas: 9% (9500/105553) Resolving deltas: 10% (10556/105553) Resolving deltas: 11% (11613/105553) Resolving deltas: 12% (12668/105553) Resolving deltas: 13% (13723/105553) Resolving deltas: 14% (14778/105553) Resolving deltas: 15% (15833/105553) Resolving deltas: 16% (16889/105553) Resolving deltas: 17% (17945/105553) Resolving deltas: 18% (19000/105553) Resolving deltas: 19% (20056/105553) Resolving deltas: 20% (21111/105553) Resolving deltas: 21% (22167/105553) Resolving deltas: 22% (23222/105553) Resolving deltas: 23% (24279/105553) Resolving deltas: 24% (25333/105553) Resolving deltas: 25% (26389/105553) Resolving deltas: 26% (27444/105553) Resolving deltas: 27% (28500/105553) Resolving deltas: 28% (29555/105553) Resolving deltas: 29% (30611/105553) Resolving deltas: 30% (31666/105553) Resolving deltas: 31% (32722/105553) Resolving deltas: 32% (33777/105553) Resolving deltas: 33% (34834/105553) Resolving deltas: 34% (35889/105553) Resolving deltas: 35% (36945/105553) Resolving deltas: 36% (38001/105553) Resolving deltas: 37% (39056/105553) Resolving deltas: 38% (40111/105553) Resolving deltas: 39% (41166/105553) Resolving deltas: 40% (42222/105553) Resolving deltas: 41% (43277/105553) Resolving deltas: 42% (44333/105553) Resolving deltas: 43% (45388/105553) Resolving deltas: 43% (46231/105553) Resolving deltas: 44% (46445/105553) Resolving deltas: 45% (47499/105553) Resolving deltas: 46% (48556/105553) Resolving deltas: 47% (49612/105553) Resolving deltas: 48% (50666/105553) Resolving deltas: 49% (51721/105553) Resolving deltas: 50% (52777/105553) Resolving deltas: 51% (53833/105553) Resolving deltas: 52% (54888/105553) Resolving deltas: 53% (55944/105553) Resolving deltas: 54% (57001/105553) Resolving deltas: 55% (58056/105553) Resolving deltas: 56% (59110/105553) Resolving deltas: 57% (60166/105553) Resolving deltas: 58% (61221/105553) Resolving deltas: 59% (62277/105553) Resolving deltas: 60% (63332/105553) Resolving deltas: 61% (64388/105553) Resolving deltas: 62% (65443/105553) Resolving deltas: 63% (66499/105553) Resolving deltas: 64% (67554/105553) Resolving deltas: 65% (68610/105553) Resolving deltas: 66% (69665/105553) Resolving deltas: 67% (70721/105553) Resolving deltas: 68% (71777/105553) Resolving deltas: 69% (72833/105553) Resolving deltas: 70% (73888/105553) Resolving deltas: 71% (74943/105553) Resolving deltas: 72% (75999/105553) Resolving deltas: 73% (77054/105553) Resolving deltas: 74% (78111/105553) Resolving deltas: 75% (79167/105553) Resolving deltas: 76% (80221/105553) Resolving deltas: 77% (81276/105553) Resolving deltas: 78% (82337/105553) Resolving deltas: 79% (83389/105553) Resolving deltas: 80% (84443/105553) Resolving deltas: 81% (85498/105553) Resolving deltas: 82% (86554/105553) Resolving deltas: 83% (87609/105553) Resolving deltas: 84% (88665/105553) Resolving deltas: 85% (89721/105553) Resolving deltas: 86% (90776/105553) Resolving deltas: 87% (91832/105553) Resolving deltas: 88% (92887/105553) Resolving deltas: 89% (93945/105553) Resolving deltas: 90% (94998/105553) Resolving deltas: 91% (96055/105553) Resolving deltas: 92% (97109/105553) Resolving deltas: 93% (98166/105553) Resolving deltas: 93% (98273/105553) Resolving deltas: 94% (99220/105553) Resolving deltas: 95% (100277/105553) Resolving deltas: 96% (101331/105553) Resolving deltas: 97% (102387/105553) Resolving deltas: 98% (103442/105553) Resolving deltas: 99% (104498/105553) Resolving deltas: 100% (105553/105553) Resolving deltas: 100% (105553/105553), done.
  9. 22.74 s Fetching commit 8959f063dd3a21d9dfa4be72260815fa7c625bde for feynkit ...
  10. 22.74 s $ /nix/store/b1wn5clix1mz4vpfih7x9cnj9qfh7c6h-git-2.54.0/bin/git fetch origin 8959f063dd3a21d9dfa4be72260815fa7c625bde
  11. 23.18 s From https://github.com/alphal00p/gammaloop
  12. 23.18 s * branch 8959f063dd3a21d9dfa4be72260815fa7c625bde -> FETCH_HEAD
  13. 23.19 s $ /nix/store/bhv6xyvqw6gjs3j488gi1z6wdv18bdpa-coreutils-9.11/bin/timeout --kill-after=15s 7200s /nix/store/b1wn5clix1mz4vpfih7x9cnj9qfh7c6h-git-2.54.0/bin/git -c advice.detachedHead=false checkout 8959f063dd3a21d9dfa4be72260815fa7c625bde
  14. 23.59 s HEAD is now at 8959f063d record indexed tensor qualification and remaining performance limits
  15. 23.60 s $ /nix/store/bhv6xyvqw6gjs3j488gi1z6wdv18bdpa-coreutils-9.11/bin/timeout --kill-after=15s 7200s /nix/store/bxgja2ppiqi6w2bgn0r07d7mgnl1k6k2-nix-2.34.8/bin/nix --extra-experimental-features nix-command --extra-experimental-features flakes --log-format internal-json run .#packages.x86_64-linux.nix-ci-check-gammaloop-nextest-clinnet --print-build-logs
  16. 23.78 s warning: ignoring untrusted flake configuration setting 'extra-substituters'.
  17. 23.78 s Pass '--accept-flake-config' to trust it
  18. 23.78 s warning: ignoring untrusted flake configuration setting 'extra-trusted-public-keys'.
  19. 23.78 s Pass '--accept-flake-config' to trust it
  20. 28.97 s
  21. 29.09 s Downloading cached nix-ci-check-gammaloop-nextest-clinnet from https://cache.nix-ci.com
  22. 29.30 s Downloaded cached nix-ci-check-gammaloop-nextest-clinnet (1128 B) in 208ms
  23. 29.30 s Progress: 0 of 1 built, 1 of 1 downloaded from cache
  24. 29.43 s evaluating derivation 'gdo you want to allow configuration setting 'extra-substituters' to be set to 'https://cache.nix-ci.com' (y/N)? do you want to permanently mark this value as untrusted (y/N)? warning: ignoring untrusted flake configuration setting 'extra-substituters'.
  25. 29.43 s Pass '--accept-flake-config' to trust it
  26. 29.43 s do you want to allow configuration setting 'extra-trusted-public-keys' to be set to 'nix-ci:g3xV5BDTLtIBZr/A00IU1x0EtKKlb7YLgBN2SgYgM6A=' (y/N)? do you want to permanently mark this value as untrusted (y/N)? warning: ignoring untrusted flake configuration setting 'extra-trusted-public-keys'.
  27. 29.43 s Pass '--accept-flake-config' to trust it
  28. 36.61 s copying '/nix/store/vrm9 evaluating derivation 'g copying '/nix/store/vrm9 evaluating derivation 'g copying '/nix/store/vrm9 evaluating derivation 'g copying '/nix/store/vrm9 evaluating derivation 'g querying gammaloop-nexte querying info about miss querying gammaloop-nexte [0.0 KiB DL] querying in [0/3 built, 1/0/1 copied [0/2 built, 1 copied (9. [1/0/2 built, 1 copied (gammaloop-nextest-binaries-clinnet (post)> Uploading to the NixCI cache: /nix/store/r6d9ks0lpr631mrcy43137c895a0w5ns-gammaloop-nextest-binaries-clinnet
  29. 36.65 s gammaloop-nextest-binaries-clinnet (post)> warning: 'warn-short-path-literals' is deprecated, use 'lint-short-path-literals = ignore' instead
  30. 36.66 s gammaloop-nextest-binaries-clinnet (post)> copying 0 paths...
  31. 36.71 s gammaloop-nextest-binaries-clinnet (post)> warning: 'warn-short-path-literals' is deprecated, use 'lint-short-path-literals = ignore' instead
  32. 37.07 s gammaloop-nextest-binaries-clinnet (post)> copying 24 paths...
  33. 37.07 s gammaloop-nextest-binaries-clinnet (post)> copying path '/nix/store/8iabjla4r4kvsy6z7pr7gxq3387b6mpa-source' to 'https://cache.nix-ci.com'...
  34. 37.07 s gammaloop-nextest-binaries-clinnet (post)> copying path '/nix/store/5szi20w3pi7873pkz6s6xhiwb7h3zn8a-source' to 'https://cache.nix-ci.com'...
  35. 37.07 s gammaloop-nextest-binaries-clinnet (post)> copying path '/nix/store/7rr78dvp0bcyk2m5zk2hlaaw6lf4baiw-source' to 'https://cache.nix-ci.com'...
  36. 37.07 s gammaloop-nextest-binaries-clinnet (post)> copying path '/nix/store/lnpb5l1ix8q93mdmd2x5zxk5pm1a97ha-Cargo.toml.drv' to 'https://cache.nix-ci.com'...
  37. 37.07 s gammaloop-nextest-binaries-clinnet (post)> copying path '/nix/store/zlcqaxjy6hpi048ykpx521in862kxhlg-source' to 'https://cache.nix-ci.com'...
  38. 37.07 s gammaloop-nextest-binaries-clinnet (post)> copying path '/nix/store/kxidi00flzkza2cjigslgaw7v4fj8l3i-cleaned-mkDummySrc' to 'https://cache.nix-ci.com'...
  39. 37.07 s gammaloop-nextest-binaries-clinnet (post)> copying path '/nix/store/hrxc5ca34qzr9k5vn6vcqpb33pfmd04p-Cargo.toml.drv' to 'https://cache.nix-ci.com'...
  40. 37.07 s gammaloop-nextest-binaries-clinnet (post)> copying path '/nix/store/j1pr3clib5dcw2far12ajwibdsjdj97l-Cargo.toml.drv' to 'https://cache.nix-ci.com'...
  41. 37.07 s gammaloop-nextest-binaries-clinnet (post)> copying path '/nix/store/prrq9prfcmi4g27ki7dgvj6rw96i97ha-source' to 'https://cache.nix-ci.com'...
  42. 37.07 s gammaloop-nextest-binaries-clinnet (post)> copying path '/nix/store/lyxk0gxcj9s8vjpg7ipcmpnanx7pmrnl-Cargo.toml.drv' to 'https://cache.nix-ci.com'...
  43. 38.56 s gammaloop-nextest-binaries-clinnet (post)> copying path '/nix/store/12avy7rrzk102m2x5956jc7z6gmr2jsr-source.drv' to 'https://cache.nix-ci.com'...
  44. 38.56 s gammaloop-nextest-binaries-clinnet (post)> copying path '/nix/store/7vbci22wrrxp6n9bfc53dvbwmnr6h1lj-source.drv' to 'https://cache.nix-ci.com'...
  45. 38.56 s gammaloop-nextest-binaries-clinnet (post)> copying path '/nix/store/124qmbdmmjs8z2mram3pqwbpkjdhd4qx-source.drv' to 'https://cache.nix-ci.com'...
  46. 38.81 s gammaloop-nextest-binaries-clinnet (post)> copying path '/nix/store/gpzyhl2yyb416z7y10wwk0qjvvxvsgm1-gammaloop-crate-gammaloop-workspace-hack-deps-0.1.0.drv' to 'https://cache.nix-ci.com'...
  47. 39.03 s gammaloop-nextest-binaries-clinnet (post)> copying path '/nix/store/1xj0rlhil0zsyyjc95jddm8iw6vhj3bb-gammaloop-crate-gammaloop-workspace-hack-build-0.1.0.drv' to 'https://cache.nix-ci.com'...
  48. 39.24 s gammaloop-nextest-binaries-clinnet (post)> copying path '/nix/store/54z51gy09vs0jf7kjlsqdm22pzmnrcnn-gammaloop-workspace-deps-deps-0.1.0.drv' to 'https://cache.nix-ci.com'...
  49. 39.45 s gammaloop-nextest-binaries-clinnet (post)> copying path '/nix/store/4g3g8s8dhqr1rz747rk4gjja0p63pzfp-gammaloop-crate-clinnet-dependency-deps-deps-0.1.0.drv' to 'https://cache.nix-ci.com'...
  50. 40.46 s gammaloop-nextest-binaries-clinnet (post)> copying path '/nix/store/iw7xhk79q4d6jnm6xk04b8ns31jq2lg3-source.drv' to 'https://cache.nix-ci.com'...
  51. 40.67 s gammaloop-nextest-binaries-clinnet (post)> copying path '/nix/store/liw345ywxq6r1k0kpj47zdv0vd97v6zr-gammaloop-crate-clinnet-dependency-deps-0.1.0.drv' to 'https://cache.nix-ci.com'...
  52. 40.90 s gammaloop-nextest-binaries-clinnet (post)> copying path '/nix/store/f6zkbnlsyaff4wng73i6hwgq55k71n24-gammaloop-crate-test-dependencies-81656ab15e4a8254-inputs.drv' to 'https://cache.nix-ci.com'...
  53. 41.10 s gammaloop-nextest-binaries-clinnet (post)> copying path '/nix/store/ppygzh0kjzvz1mn16pg26dly2p2z0xlr-gammaloop-crate-test-dependencies-81656ab15e4a8254-deps-0.1.0.drv' to 'https://cache.nix-ci.com'...
  54. 41.32 s gammaloop-nextest-binaries-clinnet (post)> copying path '/nix/store/zi3h1wmn1dvway8dv4s0r3mrk0hcs004-gammaloop-crate-test-binaries-clinnet-81656ab15e4a8254-deps-0.1.0.drv' to 'https://cache.nix-ci.com'...
  55. 41.53 s gammaloop-nextest-binaries-clinnet (post)> copying path '/nix/store/x6v38divxvkn4rpdps7ks07gh7drcb5g-gammaloop-nextest-binaries-clinnet-clinnet-0.1.0.drv' to 'https://cache.nix-ci.com'...
  56. 41.76 s gammaloop-nextest-binaries-clinnet (post)> copying path '/nix/store/97lhymb4ffzrjkflx00vsbvs5c9xqj9g-gammaloop-nextest-binaries-clinnet.drv' to 'https://cache.nix-ci.com'...
  57. 42.41 s [1/3 built, 1 copied (9. [1/1/2 built, 1 copied (gammaloop-nextest-clinnet> Nextest worker budget: 16
  58. 42.42 s gammaloop-nextest-clinnet> Extracting 4 binaries (including 1 non-test binary), 1 build script output directory, and 1 linked path to /build/source
  59. 42.51 s gammaloop-nextest-clinnet> Extracted 16 files to /build/source in 0.08s
  60. 42.52 s gammaloop-nextest-clinnet> ------------
  61. 42.52 s gammaloop-nextest-clinnet> Nextest run ID 31610fd8-d687-4d31-8910-c2ba6d3eb88d with nextest profile: ci_gammaloop
  62. 42.52 s gammaloop-nextest-clinnet> Starting 38 tests across 3 binaries
  63. 103.58 s gammaloop-nextest-clinnet> FAIL [ 61.035s] (32/38) clinnet::public_typst_behavior public_linnest_endpoint_anchor_distances_stay_local
  64. 103.58 s gammaloop-nextest-clinnet> stdout ---
  65. 103.58 s gammaloop-nextest-clinnet>
  66. 103.58 s gammaloop-nextest-clinnet> running 1 test
  67. 103.58 s gammaloop-nextest-clinnet> test public_linnest_endpoint_anchor_distances_stay_local has been running for over 60 seconds
  68. 103.58 s gammaloop-nextest-clinnet> test public_linnest_endpoint_anchor_distances_stay_local ... FAILED
  69. 103.58 s gammaloop-nextest-clinnet>
  70. 103.58 s gammaloop-nextest-clinnet> failures:
  71. 103.58 s gammaloop-nextest-clinnet>
  72. 103.58 s gammaloop-nextest-clinnet> failures:
  73. 103.58 s gammaloop-nextest-clinnet> public_linnest_endpoint_anchor_distances_stay_local
  74. 103.58 s gammaloop-nextest-clinnet>
  75. 103.58 s gammaloop-nextest-clinnet> test result: FAILED. 0 passed; 1 failed; 0 ignored; 0 measured; 17 filtered out; finished in 61.02s
  76. 103.58 s gammaloop-nextest-clinnet>
  77. 103.58 s gammaloop-nextest-clinnet> stderr ---
  78. 103.58 s gammaloop-nextest-clinnet>
  79. 103.58 s gammaloop-nextest-clinnet> thread 'public_linnest_endpoint_anchor_distances_stay_local' (264) panicked at crates/clinnet/tests/public_typst_behavior.rs:81:55:
  80. 103.58 s gammaloop-nextest-clinnet> called `Result::unwrap()` on an `Err` value: typst failed while compiling template /build/.tmpW3gckD/.clinnet/templates/linnest-public-behavior.svg
  81. 103.58 s gammaloop-nextest-clinnet>
  82. 103.58 s gammaloop-nextest-clinnet> Command executed:
  83. 103.58 s gammaloop-nextest-clinnet> "typst" "c" "/build/.tmpW3gckD/.clinnet/templates/linnest-public-behavior.typ" "/build/.tmpW3gckD/.clinnet/templates/linnest-public-behavior.svg" "--root" "/build/.tmpW3gckD/.clinnet/templates"
  84. 103.58 s gammaloop-nextest-clinnet>
  85. 103.58 s gammaloop-nextest-clinnet> Typst stdout:
  86. 103.58 s gammaloop-nextest-clinnet>
  87. 103.58 s gammaloop-nextest-clinnet>
  88. 103.58 s gammaloop-nextest-clinnet> Typst stderr:
  89. 103.58 s gammaloop-nextest-clinnet>
  90. 103.58 s gammaloop-nextest-clinnet>
  91. 103.58 s gammaloop-nextest-clinnet> Location:
  92. 103.58 s gammaloop-nextest-clinnet> crates/clinnet/src/lib.rs:741:13
  93. 103.58 s gammaloop-nextest-clinnet> stack backtrace:
  94. 103.58 s gammaloop-nextest-clinnet> 0: __rustc::rust_begin_unwind
  95. 103.58 s gammaloop-nextest-clinnet> 1: core::panicking::panic_fmt
  96. 103.58 s gammaloop-nextest-clinnet> 2: core::result::unwrap_failed
  97. 103.58 s gammaloop-nextest-clinnet> 3: public_typst_behavior::render
  98. 103.58 s gammaloop-nextest-clinnet> 4: <std::sync::once::Once>::call_once_force::<<std::sync::once_lock::OnceLock<alloc::string::String>>::initialize<<std::sync::once_lock::OnceLock<alloc::string::String>>::get_or_init<public_typst_behavior::linnest_public_svg::{closure#0}>::{closure#0}, !>::{closure#0}>::{closure#0}
  99. 103.58 s gammaloop-nextest-clinnet> 5: <std::sys::sync::once::futex::Once>::call
  100. 103.58 s gammaloop-nextest-clinnet> 6: <std::sync::once_lock::OnceLock<alloc::string::String>>::initialize::<<std::sync::once_lock::OnceLock<alloc::string::String>>::get_or_init<public_typst_behavior::linnest_public_svg::{closure#0}>::{closure#0}, !>
  101. 103.58 s gammaloop-nextest-clinnet> 7: <public_typst_behavior::public_linnest_endpoint_anchor_distances_stay_local::{closure#0} as core::ops::function::FnOnce<()>>::call_once
  102. 103.58 s gammaloop-nextest-clinnet> note: Some details are omitted, run with `RUST_BACKTRACE=full` for a verbose backtrace.
  103. 103.58 s gammaloop-nextest-clinnet>
  104. 106.51 s gammaloop-nextest-clinnet> FAIL [ 63.913s] (33/38) clinnet::public_typst_behavior public_linnest_overlays_follow_the_unit
  105. 106.51 s gammaloop-nextest-clinnet> stdout ---
  106. 106.51 s gammaloop-nextest-clinnet>
  107. 106.51 s gammaloop-nextest-clinnet> running 1 test
  108. 106.51 s gammaloop-nextest-clinnet> test public_linnest_overlays_follow_the_unit has been running for over 60 seconds
  109. 106.51 s gammaloop-nextest-clinnet> test public_linnest_overlays_follow_the_unit ... FAILED
  110. 106.51 s gammaloop-nextest-clinnet>
  111. 106.51 s gammaloop-nextest-clinnet> failures:
  112. 106.51 s gammaloop-nextest-clinnet>
  113. 106.51 s gammaloop-nextest-clinnet> failures:
  114. 106.51 s gammaloop-nextest-clinnet> public_linnest_overlays_follow_the_unit
  115. 106.51 s gammaloop-nextest-clinnet>
  116. 106.51 s gammaloop-nextest-clinnet> test result: FAILED. 0 passed; 1 failed; 0 ignored; 0 measured; 17 filtered out; finished in 63.90s
  117. 106.51 s gammaloop-nextest-clinnet>
  118. 106.51 s gammaloop-nextest-clinnet> stderr ---
  119. 106.51 s gammaloop-nextest-clinnet>
  120. 106.51 s gammaloop-nextest-clinnet> thread 'public_linnest_overlays_follow_the_unit' (316) panicked at crates/clinnet/tests/public_typst_behavior.rs:81:55:
  121. 106.51 s gammaloop-nextest-clinnet> called `Result::unwrap()` on an `Err` value: typst failed while compiling template /build/.tmpWaRADP/.clinnet/templates/linnest-public-behavior.svg
  122. 106.51 s gammaloop-nextest-clinnet>
  123. 106.51 s gammaloop-nextest-clinnet> Command executed:
  124. 106.51 s gammaloop-nextest-clinnet> "typst" "c" "/build/.tmpWaRADP/.clinnet/templates/linnest-public-behavior.typ" "/build/.tmpWaRADP/.clinnet/templates/linnest-public-behavior.svg" "--root" "/build/.tmpWaRADP/.clinnet/templates"
  125. 106.51 s gammaloop-nextest-clinnet>
  126. 106.51 s gammaloop-nextest-clinnet> Typst stdout:
  127. 106.51 s gammaloop-nextest-clinnet>
  128. 106.51 s gammaloop-nextest-clinnet>
  129. 106.51 s gammaloop-nextest-clinnet> Typst stderr:
  130. 106.51 s gammaloop-nextest-clinnet>
  131. 106.51 s gammaloop-nextest-clinnet>
  132. 106.51 s gammaloop-nextest-clinnet> Location:
  133. 106.51 s gammaloop-nextest-clinnet> crates/clinnet/src/lib.rs:741:13
  134. 106.51 s gammaloop-nextest-clinnet> stack backtrace:
  135. 106.51 s gammaloop-nextest-clinnet> 0: __rustc::rust_begin_unwind
  136. 106.51 s gammaloop-nextest-clinnet> 1: core::panicking::panic_fmt
  137. 106.51 s gammaloop-nextest-clinnet> 2: core::result::unwrap_failed
  138. 106.51 s gammaloop-nextest-clinnet> 3: public_typst_behavior::render
  139. 106.51 s gammaloop-nextest-clinnet> 4: <std::sync::once::Once>::call_once_force::<<std::sync::once_lock::OnceLock<alloc::string::String>>::initialize<<std::sync::once_lock::OnceLock<alloc::string::String>>::get_or_init<public_typst_behavior::linnest_public_svg::{closure#0}>::{closure#0}, !>::{closure#0}>::{closure#0}
  140. 106.51 s gammaloop-nextest-clinnet> 5: <std::sys::sync::once::futex::Once>::call
  141. 106.51 s gammaloop-nextest-clinnet> 6: <std::sync::once_lock::OnceLock<alloc::string::String>>::initialize::<<std::sync::once_lock::OnceLock<alloc::string::String>>::get_or_init<public_typst_behavior::linnest_public_svg::{closure#0}>::{closure#0}, !>
  142. 106.51 s gammaloop-nextest-clinnet> 7: <public_typst_behavior::public_linnest_overlays_follow_the_unit::{closure#0} as core::ops::function::FnOnce<()>>::call_once
  143. 106.51 s gammaloop-nextest-clinnet> note: Some details are omitted, run with `RUST_BACKTRACE=full` for a verbose backtrace.
  144. 106.51 s gammaloop-nextest-clinnet>
  145. 116.90 s gammaloop-nextest-clinnet> FAIL [ 74.285s] (34/38) clinnet::public_typst_behavior public_linnest_fixture_assertions_hold
  146. 116.90 s gammaloop-nextest-clinnet> stdout ---
  147. 116.90 s gammaloop-nextest-clinnet>
  148. 116.90 s gammaloop-nextest-clinnet> running 1 test
  149. 116.90 s gammaloop-nextest-clinnet> test public_linnest_fixture_assertions_hold has been running for over 60 seconds
  150. 116.90 s gammaloop-nextest-clinnet> test public_linnest_fixture_assertions_hold ... FAILED
  151. 116.90 s gammaloop-nextest-clinnet>
  152. 116.90 s gammaloop-nextest-clinnet> failures:
  153. 116.90 s gammaloop-nextest-clinnet>
  154. 116.90 s gammaloop-nextest-clinnet> failures:
  155. 116.90 s gammaloop-nextest-clinnet> public_linnest_fixture_assertions_hold
  156. 116.90 s gammaloop-nextest-clinnet>
  157. 116.90 s gammaloop-nextest-clinnet> test result: FAILED. 0 passed; 1 failed; 0 ignored; 0 measured; 17 filtered out; finished in 74.28s
  158. 116.90 s gammaloop-nextest-clinnet>
  159. 116.90 s gammaloop-nextest-clinnet> stderr ---
  160. 116.90 s gammaloop-nextest-clinnet>
  161. 116.90 s gammaloop-nextest-clinnet> thread 'public_linnest_fixture_assertions_hold' (281) panicked at crates/clinnet/tests/public_typst_behavior.rs:81:55:
  162. 116.90 s gammaloop-nextest-clinnet> called `Result::unwrap()` on an `Err` value: typst failed while compiling template /build/.tmpbsHWZO/.clinnet/templates/linnest-public-behavior.svg
  163. 116.90 s gammaloop-nextest-clinnet>
  164. 116.90 s gammaloop-nextest-clinnet> Command executed:
  165. 116.90 s gammaloop-nextest-clinnet> "typst" "c" "/build/.tmpbsHWZO/.clinnet/templates/linnest-public-behavior.typ" "/build/.tmpbsHWZO/.clinnet/templates/linnest-public-behavior.svg" "--root" "/build/.tmpbsHWZO/.clinnet/templates"
  166. 116.90 s gammaloop-nextest-clinnet>
  167. 116.90 s gammaloop-nextest-clinnet> Typst stdout:
  168. 116.90 s gammaloop-nextest-clinnet>
  169. 116.90 s gammaloop-nextest-clinnet>
  170. 116.90 s gammaloop-nextest-clinnet> Typst stderr:
  171. 116.90 s gammaloop-nextest-clinnet>
  172. 116.90 s gammaloop-nextest-clinnet>
  173. 116.90 s gammaloop-nextest-clinnet> Location:
  174. 116.90 s gammaloop-nextest-clinnet> crates/clinnet/src/lib.rs:741:13
  175. 116.90 s gammaloop-nextest-clinnet> stack backtrace:
  176. 116.90 s gammaloop-nextest-clinnet> 0: __rustc::rust_begin_unwind
  177. 116.90 s gammaloop-nextest-clinnet> 1: core::panicking::panic_fmt
  178. 116.90 s gammaloop-nextest-clinnet> 2: core::result::unwrap_failed
  179. 116.90 s gammaloop-nextest-clinnet> 3: public_typst_behavior::render
  180. 116.90 s gammaloop-nextest-clinnet> 4: <std::sync::once::Once>::call_once_force::<<std::sync::once_lock::OnceLock<alloc::string::String>>::initialize<<std::sync::once_lock::OnceLock<alloc::string::String>>::get_or_init<public_typst_behavior::linnest_public_svg::{closure#0}>::{closure#0}, !>::{closure#0}>::{closure#0}
  181. 116.90 s gammaloop-nextest-clinnet> 5: <std::sys::sync::once::futex::Once>::call
  182. 116.90 s gammaloop-nextest-clinnet> 6: <std::sync::once_lock::OnceLock<alloc::string::String>>::initialize::<<std::sync::once_lock::OnceLock<alloc::string::String>>::get_or_init<public_typst_behavior::linnest_public_svg::{closure#0}>::{closure#0}, !>
  183. 116.90 s gammaloop-nextest-clinnet> 7: <public_typst_behavior::public_linnest_fixture_assertions_hold::{closure#0} as core::ops::function::FnOnce<()>>::call_once
  184. 116.90 s gammaloop-nextest-clinnet> note: Some details are omitted, run with `RUST_BACKTRACE=full` for a verbose backtrace.
  185. 116.90 s gammaloop-nextest-clinnet>
  186. 127.44 s gammaloop-nextest-clinnet> ------------
  187. 127.44 s gammaloop-nextest-clinnet> Summary [ 84.917s] 38 tests run: 35 passed, 3 failed, 0 skipped
  188. 127.44 s gammaloop-nextest-clinnet> FAIL [ 61.035s] (32/38) clinnet::public_typst_behavior public_linnest_endpoint_anchor_distances_stay_local
  189. 127.44 s gammaloop-nextest-clinnet> stdout ---
  190. 127.44 s gammaloop-nextest-clinnet>
  191. 127.44 s gammaloop-nextest-clinnet> running 1 test
  192. 127.44 s gammaloop-nextest-clinnet> test public_linnest_endpoint_anchor_distances_stay_local has been running for over 60 seconds
  193. 127.44 s gammaloop-nextest-clinnet> test public_linnest_endpoint_anchor_distances_stay_local ... FAILED
  194. 127.44 s gammaloop-nextest-clinnet>
  195. 127.44 s gammaloop-nextest-clinnet> failures:
  196. 127.44 s gammaloop-nextest-clinnet>
  197. 127.44 s gammaloop-nextest-clinnet> failures:
  198. 127.44 s gammaloop-nextest-clinnet> public_linnest_endpoint_anchor_distances_stay_local
  199. 127.44 s gammaloop-nextest-clinnet>
  200. 127.44 s gammaloop-nextest-clinnet> test result: FAILED. 0 passed; 1 failed; 0 ignored; 0 measured; 17 filtered out; finished in 61.02s
  201. 127.44 s gammaloop-nextest-clinnet>
  202. 127.44 s gammaloop-nextest-clinnet> stderr ---
  203. 127.44 s gammaloop-nextest-clinnet>
  204. 127.44 s gammaloop-nextest-clinnet> thread 'public_linnest_endpoint_anchor_distances_stay_local' (264) panicked at crates/clinnet/tests/public_typst_behavior.rs:81:55:
  205. 127.44 s gammaloop-nextest-clinnet> called `Result::unwrap()` on an `Err` value: typst failed while compiling template /build/.tmpW3gckD/.clinnet/templates/linnest-public-behavior.svg
  206. 127.44 s gammaloop-nextest-clinnet>
  207. 127.44 s gammaloop-nextest-clinnet> Command executed:
  208. 127.44 s gammaloop-nextest-clinnet> "typst" "c" "/build/.tmpW3gckD/.clinnet/templates/linnest-public-behavior.typ" "/build/.tmpW3gckD/.clinnet/templates/linnest-public-behavior.svg" "--root" "/build/.tmpW3gckD/.clinnet/templates"
  209. 127.44 s gammaloop-nextest-clinnet>
  210. 127.44 s gammaloop-nextest-clinnet> Typst stdout:
  211. 127.44 s gammaloop-nextest-clinnet>
  212. 127.44 s gammaloop-nextest-clinnet>
  213. 127.44 s gammaloop-nextest-clinnet> Typst stderr:
  214. 127.44 s gammaloop-nextest-clinnet>
  215. 127.44 s gammaloop-nextest-clinnet>
  216. 127.44 s gammaloop-nextest-clinnet> Location:
  217. 127.44 s gammaloop-nextest-clinnet> crates/clinnet/src/lib.rs:741:13
  218. 127.44 s gammaloop-nextest-clinnet> stack backtrace:
  219. 127.44 s gammaloop-nextest-clinnet> 0: __rustc::rust_begin_unwind
  220. 127.44 s gammaloop-nextest-clinnet> 1: core::panicking::panic_fmt
  221. 127.44 s gammaloop-nextest-clinnet> 2: core::result::unwrap_failed
  222. 127.44 s gammaloop-nextest-clinnet> 3: public_typst_behavior::render
  223. 127.44 s gammaloop-nextest-clinnet> 4: <std::sync::once::Once>::call_once_force::<<std::sync::once_lock::OnceLock<alloc::string::String>>::initialize<<std::sync::once_lock::OnceLock<alloc::string::String>>::get_or_init<public_typst_behavior::linnest_public_svg::{closure#0}>::{closure#0}, !>::{closure#0}>::{closure#0}
  224. 127.44 s gammaloop-nextest-clinnet> 5: <std::sys::sync::once::futex::Once>::call
  225. 127.44 s gammaloop-nextest-clinnet> 6: <std::sync::once_lock::OnceLock<alloc::string::String>>::initialize::<<std::sync::once_lock::OnceLock<alloc::string::String>>::get_or_init<public_typst_behavior::linnest_public_svg::{closure#0}>::{closure#0}, !>
  226. 127.44 s gammaloop-nextest-clinnet> 7: <public_typst_behavior::public_linnest_endpoint_anchor_distances_stay_local::{closure#0} as core::ops::function::FnOnce<()>>::call_once
  227. 127.44 s gammaloop-nextest-clinnet> note: Some details are omitted, run with `RUST_BACKTRACE=full` for a verbose backtrace.
  228. 127.44 s gammaloop-nextest-clinnet>
  229. 127.44 s gammaloop-nextest-clinnet> FAIL [ 63.913s] (33/38) clinnet::public_typst_behavior public_linnest_overlays_follow_the_unit
  230. 127.44 s gammaloop-nextest-clinnet> stdout ---
  231. 127.44 s gammaloop-nextest-clinnet>
  232. 127.44 s gammaloop-nextest-clinnet> running 1 test
  233. 127.44 s gammaloop-nextest-clinnet> test public_linnest_overlays_follow_the_unit has been running for over 60 seconds
  234. 127.44 s gammaloop-nextest-clinnet> test public_linnest_overlays_follow_the_unit ... FAILED
  235. 127.44 s gammaloop-nextest-clinnet>
  236. 127.44 s gammaloop-nextest-clinnet> failures:
  237. 127.44 s gammaloop-nextest-clinnet>
  238. 127.44 s gammaloop-nextest-clinnet> failures:
  239. 127.44 s gammaloop-nextest-clinnet> public_linnest_overlays_follow_the_unit
  240. 127.44 s gammaloop-nextest-clinnet>
  241. 127.44 s gammaloop-nextest-clinnet> test result: FAILED. 0 passed; 1 failed; 0 ignored; 0 measured; 17 filtered out; finished in 63.90s
  242. 127.44 s gammaloop-nextest-clinnet>
  243. 127.44 s gammaloop-nextest-clinnet> stderr ---
  244. 127.44 s gammaloop-nextest-clinnet>
  245. 127.44 s gammaloop-nextest-clinnet> thread 'public_linnest_overlays_follow_the_unit' (316) panicked at crates/clinnet/tests/public_typst_behavior.rs:81:55:
  246. 127.44 s gammaloop-nextest-clinnet> called `Result::unwrap()` on an `Err` value: typst failed while compiling template /build/.tmpWaRADP/.clinnet/templates/linnest-public-behavior.svg
  247. 127.44 s gammaloop-nextest-clinnet>
  248. 127.44 s gammaloop-nextest-clinnet> Command executed:
  249. 127.44 s gammaloop-nextest-clinnet> "typst" "c" "/build/.tmpWaRADP/.clinnet/templates/linnest-public-behavior.typ" "/build/.tmpWaRADP/.clinnet/templates/linnest-public-behavior.svg" "--root" "/build/.tmpWaRADP/.clinnet/templates"
  250. 127.44 s gammaloop-nextest-clinnet>
  251. 127.44 s gammaloop-nextest-clinnet> Typst stdout:
  252. 127.44 s gammaloop-nextest-clinnet>
  253. 127.44 s gammaloop-nextest-clinnet>
  254. 127.44 s gammaloop-nextest-clinnet> Typst stderr:
  255. 127.44 s gammaloop-nextest-clinnet>
  256. 127.44 s gammaloop-nextest-clinnet>
  257. 127.44 s gammaloop-nextest-clinnet> Location:
  258. 127.44 s gammaloop-nextest-clinnet> crates/clinnet/src/lib.rs:741:13
  259. 127.44 s gammaloop-nextest-clinnet> stack backtrace:
  260. 127.44 s gammaloop-nextest-clinnet> 0: __rustc::rust_begin_unwind
  261. 127.44 s gammaloop-nextest-clinnet> 1: core::panicking::panic_fmt
  262. 127.44 s gammaloop-nextest-clinnet> 2: core::result::unwrap_failed
  263. 127.44 s gammaloop-nextest-clinnet> 3: public_typst_behavior::render
  264. 127.44 s gammaloop-nextest-clinnet> 4: <std::sync::once::Once>::call_once_force::<<std::sync::once_lock::OnceLock<alloc::string::String>>::initialize<<std::sync::once_lock::OnceLock<alloc::string::String>>::get_or_init<public_typst_behavior::linnest_public_svg::{closure#0}>::{closure#0}, !>::{closure#0}>::{closure#0}
  265. 127.44 s gammaloop-nextest-clinnet> 5: <std::sys::sync::once::futex::Once>::call
  266. 127.44 s gammaloop-nextest-clinnet> 6: <std::sync::once_lock::OnceLock<alloc::string::String>>::initialize::<<std::sync::once_lock::OnceLock<alloc::string::String>>::get_or_init<public_typst_behavior::linnest_public_svg::{closure#0}>::{closure#0}, !>
  267. 127.44 s gammaloop-nextest-clinnet> 7: <public_typst_behavior::public_linnest_overlays_follow_the_unit::{closure#0} as core::ops::function::FnOnce<()>>::call_once
  268. 127.44 s gammaloop-nextest-clinnet> note: Some details are omitted, run with `RUST_BACKTRACE=full` for a verbose backtrace.
  269. 127.44 s gammaloop-nextest-clinnet>
  270. 127.44 s gammaloop-nextest-clinnet> FAIL [ 74.285s] (34/38) clinnet::public_typst_behavior public_linnest_fixture_assertions_hold
  271. 127.44 s gammaloop-nextest-clinnet> stdout ---
  272. 127.44 s gammaloop-nextest-clinnet>
  273. 127.44 s gammaloop-nextest-clinnet> running 1 test
  274. 127.44 s gammaloop-nextest-clinnet> test public_linnest_fixture_assertions_hold has been running for over 60 seconds
  275. 127.44 s gammaloop-nextest-clinnet> test public_linnest_fixture_assertions_hold ... FAILED
  276. 127.44 s gammaloop-nextest-clinnet>
  277. 127.44 s gammaloop-nextest-clinnet> failures:
  278. 127.44 s gammaloop-nextest-clinnet>
  279. 127.44 s gammaloop-nextest-clinnet> failures:
  280. 127.44 s gammaloop-nextest-clinnet> public_linnest_fixture_assertions_hold
  281. 127.44 s gammaloop-nextest-clinnet>
  282. 127.44 s gammaloop-nextest-clinnet> test result: FAILED. 0 passed; 1 failed; 0 ignored; 0 measured; 17 filtered out; finished in 74.28s
  283. 127.44 s gammaloop-nextest-clinnet>
  284. 127.44 s gammaloop-nextest-clinnet> stderr ---
  285. 127.44 s gammaloop-nextest-clinnet>
  286. 127.44 s gammaloop-nextest-clinnet> thread 'public_linnest_fixture_assertions_hold' (281) panicked at crates/clinnet/tests/public_typst_behavior.rs:81:55:
  287. 127.44 s gammaloop-nextest-clinnet> called `Result::unwrap()` on an `Err` value: typst failed while compiling template /build/.tmpbsHWZO/.clinnet/templates/linnest-public-behavior.svg
  288. 127.44 s gammaloop-nextest-clinnet>
  289. 127.44 s gammaloop-nextest-clinnet> Command executed:
  290. 127.44 s gammaloop-nextest-clinnet> "typst" "c" "/build/.tmpbsHWZO/.clinnet/templates/linnest-public-behavior.typ" "/build/.tmpbsHWZO/.clinnet/templates/linnest-public-behavior.svg" "--root" "/build/.tmpbsHWZO/.clinnet/templates"
  291. 127.44 s gammaloop-nextest-clinnet>
  292. 127.44 s gammaloop-nextest-clinnet> Typst stdout:
  293. 127.44 s gammaloop-nextest-clinnet>
  294. 127.44 s gammaloop-nextest-clinnet>
  295. 127.44 s gammaloop-nextest-clinnet> Typst stderr:
  296. 127.44 s gammaloop-nextest-clinnet>
  297. 127.44 s gammaloop-nextest-clinnet>
  298. 127.44 s gammaloop-nextest-clinnet> Location:
  299. 127.44 s gammaloop-nextest-clinnet> crates/clinnet/src/lib.rs:741:13
  300. 127.44 s gammaloop-nextest-clinnet> stack backtrace:
  301. 127.44 s gammaloop-nextest-clinnet> 0: __rustc::rust_begin_unwind
  302. 127.44 s gammaloop-nextest-clinnet> 1: core::panicking::panic_fmt
  303. 127.44 s gammaloop-nextest-clinnet> 2: core::result::unwrap_failed
  304. 127.44 s gammaloop-nextest-clinnet> 3: public_typst_behavior::render
  305. 127.44 s gammaloop-nextest-clinnet> 4: <std::sync::once::Once>::call_once_force::<<std::sync::once_lock::OnceLock<alloc::string::String>>::initialize<<std::sync::once_lock::OnceLock<alloc::string::String>>::get_or_init<public_typst_behavior::linnest_public_svg::{closure#0}>::{closure#0}, !>::{closure#0}>::{closure#0}
  306. 127.44 s gammaloop-nextest-clinnet> 5: <std::sys::sync::once::futex::Once>::call
  307. 127.44 s gammaloop-nextest-clinnet> 6: <std::sync::once_lock::OnceLock<alloc::string::String>>::initialize::<<std::sync::once_lock::OnceLock<alloc::string::String>>::get_or_init<public_typst_behavior::linnest_public_svg::{closure#0}>::{closure#0}, !>
  308. 127.44 s gammaloop-nextest-clinnet> 7: <public_typst_behavior::public_linnest_fixture_assertions_hold::{closure#0} as core::ops::function::FnOnce<()>>::call_once
  309. 127.44 s gammaloop-nextest-clinnet> note: Some details are omitted, run with `RUST_BACKTRACE=full` for a verbose backtrace.
  310. 127.44 s gammaloop-nextest-clinnet>
  311. 127.45 s gammaloop-nextest-clinnet> error: test run failed
  312. 127.52 s gammaloop-nextest-clinnet>
  313. 127.52 s gammaloop-nextest-clinnet> ========== nextest test summary ==========
  314. 127.52 s gammaloop-nextest-clinnet> report: target/nextest/ci_gammaloop/junit.xml
  315. 127.52 s gammaloop-nextest-clinnet> tests: 38, failures: 3, errors: 0
  316. 127.52 s gammaloop-nextest-clinnet>
  317. 127.52 s gammaloop-nextest-clinnet> 1. clinnet::public_typst_behavior::public_linnest_endpoint_anchor_distances_stay_local
  318. 127.52 s gammaloop-nextest-clinnet> failure: test failure with exit code 101
  319. 127.52 s gammaloop-nextest-clinnet> thread 'public_linnest_endpoint_anchor_distances_stay_local' (264) panicked at crates/clinnet/tests/public_typst_behavior.rs:81:55:
  320. 127.52 s gammaloop-nextest-clinnet> called `Result::unwrap()` on an `Err` value: typst failed while compiling template /build/.tmpW3gckD/.clinnet/templates/linnest-public-behavior.svg
  321. 127.52 s gammaloop-nextest-clinnet>
  322. 127.52 s gammaloop-nextest-clinnet> Command executed:
  323. 127.52 s gammaloop-nextest-clinnet> "typst" "c" "/build/.tmpW3gckD/.clinnet/templates/linnest-public-behavior.typ" "/build/.tmpW3gckD/.clinnet/templates/linnest-public-behavior.svg" "--root" "/build/.tmpW3gckD/.clinnet/templates"
  324. 127.52 s gammaloop-nextest-clinnet>
  325. 127.52 s gammaloop-nextest-clinnet> Typst stdout:
  326. 127.52 s gammaloop-nextest-clinnet>
  327. 127.52 s gammaloop-nextest-clinnet>
  328. 127.52 s gammaloop-nextest-clinnet> Typst stderr:
  329. 127.52 s gammaloop-nextest-clinnet>
  330. 127.52 s gammaloop-nextest-clinnet>
  331. 127.52 s gammaloop-nextest-clinnet> Location:
  332. 127.52 s gammaloop-nextest-clinnet> crates/clinnet/src/lib.rs:741:13
  333. 127.52 s gammaloop-nextest-clinnet> stack backtrace:
  334. 127.52 s gammaloop-nextest-clinnet> 0: __rustc::rust_begin_unwind
  335. 127.52 s gammaloop-nextest-clinnet> 1: core::panicking::panic_fmt
  336. 127.52 s gammaloop-nextest-clinnet> 2: core::result::unwrap_failed
  337. 127.52 s gammaloop-nextest-clinnet> 3: public_typst_behavior::render
  338. 127.52 s gammaloop-nextest-clinnet> 4: <std::sync::once::Once>::call_once_force::<<std::sync::once_lock::OnceLock<alloc::string::String>>::initialize<<std::sync::once_lock::OnceLock<alloc::string::String>>::get_or_init<public_typst_behavior::linnest_public_svg::{closure#0}>::{closure#0}, !>::{closure#0}>::{closure#0}
  339. 127.52 s gammaloop-nextest-clinnet> 5: <std::sys::sync::once::futex::Once>::call
  340. 127.52 s gammaloop-nextest-clinnet> 6: <std::sync::once_lock::OnceLock<alloc::string::String>>::initialize::<<std::sync::once_lock::OnceLock<alloc::string::String>>::get_or_init<public_typst_behavior::linnest_public_svg::{closure#0}>::{closure#0}, !>
  341. 127.52 s gammaloop-nextest-clinnet> 7: <public_typst_behavior::public_linnest_endpoint_anchor_distances_stay_local::{closure#0} as core::ops::function::FnOnce<()>>::call_once
  342. 127.52 s gammaloop-nextest-clinnet> note: Some details are omitted, run with `RUST_BACKTRACE=full` for a verbose backtrace.
  343. 127.52 s gammaloop-nextest-clinnet> system-out
  344. 127.52 s gammaloop-nextest-clinnet> running 1 test
  345. 127.52 s gammaloop-nextest-clinnet> test public_linnest_endpoint_anchor_distances_stay_local has been running for over 60 seconds
  346. 127.52 s gammaloop-nextest-clinnet> test public_linnest_endpoint_anchor_distances_stay_local ... FAILED
  347. 127.52 s gammaloop-nextest-clinnet>
  348. 127.52 s gammaloop-nextest-clinnet> failures:
  349. 127.52 s gammaloop-nextest-clinnet>
  350. 127.52 s gammaloop-nextest-clinnet> failures:
  351. 127.52 s gammaloop-nextest-clinnet> public_linnest_endpoint_anchor_distances_stay_local
  352. 127.52 s gammaloop-nextest-clinnet>
  353. 127.52 s gammaloop-nextest-clinnet> test result: FAILED. 0 passed; 1 failed; 0 ignored; 0 measured; 17 filtered out; finished in 61.02s
  354. 127.52 s gammaloop-nextest-clinnet> system-err
  355. 127.52 s gammaloop-nextest-clinnet> thread 'public_linnest_endpoint_anchor_distances_stay_local' (264) panicked at crates/clinnet/tests/public_typst_behavior.rs:81:55:
  356. 127.52 s gammaloop-nextest-clinnet> called `Result::unwrap()` on an `Err` value: typst failed while compiling template /build/.tmpW3gckD/.clinnet/templates/linnest-public-behavior.svg
  357. 127.52 s gammaloop-nextest-clinnet>
  358. 127.52 s gammaloop-nextest-clinnet> Command executed:
  359. 127.52 s gammaloop-nextest-clinnet> "typst" "c" "/build/.tmpW3gckD/.clinnet/templates/linnest-public-behavior.typ" "/build/.tmpW3gckD/.clinnet/templates/linnest-public-behavior.svg" "--root" "/build/.tmpW3gckD/.clinnet/templates"
  360. 127.52 s gammaloop-nextest-clinnet>
  361. 127.52 s gammaloop-nextest-clinnet> Typst stdout:
  362. 127.52 s gammaloop-nextest-clinnet>
  363. 127.52 s gammaloop-nextest-clinnet>
  364. 127.52 s gammaloop-nextest-clinnet> Typst stderr:
  365. 127.52 s gammaloop-nextest-clinnet>
  366. 127.52 s gammaloop-nextest-clinnet>
  367. 127.52 s gammaloop-nextest-clinnet> Location:
  368. 127.52 s gammaloop-nextest-clinnet> crates/clinnet/src/lib.rs:741:13
  369. 127.52 s gammaloop-nextest-clinnet> stack backtrace:
  370. 127.52 s gammaloop-nextest-clinnet> 0: __rustc::rust_begin_unwind
  371. 127.52 s gammaloop-nextest-clinnet> 1: core::panicking::panic_fmt
  372. 127.52 s gammaloop-nextest-clinnet> 2: core::result::unwrap_failed
  373. 127.52 s gammaloop-nextest-clinnet> 3: public_typst_behavior::render
  374. 127.52 s gammaloop-nextest-clinnet> 4: <std::sync::once::Once>::call_once_force::<<std::sync::once_lock::OnceLock<alloc::string::String>>::initialize<<std::sync::once_lock::OnceLock<alloc::string::String>>::get_or_init<public_typst_behavior::linnest_public_svg::{closure#0}>::{closure#0}, !>::{closure#0}>::{closure#0}
  375. 127.52 s gammaloop-nextest-clinnet> 5: <std::sys::sync::once::futex::Once>::call
  376. 127.52 s gammaloop-nextest-clinnet> 6: <std::sync::once_lock::OnceLock<alloc::string::String>>::initialize::<<std::sync::once_lock::OnceLock<alloc::string::String>>::get_or_init<public_typst_behavior::linnest_public_svg::{closure#0}>::{closure#0}, !>
  377. 127.52 s gammaloop-nextest-clinnet> 7: <public_typst_behavior::public_linnest_endpoint_anchor_distances_stay_local::{closure#0} as core::ops::function::FnOnce<()>>::call_once
  378. 127.52 s gammaloop-nextest-clinnet> note: Some details are omitted, run with `RUST_BACKTRACE=full` for a verbose backtrace.
  379. 127.52 s gammaloop-nextest-clinnet>
  380. 127.52 s gammaloop-nextest-clinnet> 2. clinnet::public_typst_behavior::public_linnest_overlays_follow_the_unit
  381. 127.52 s gammaloop-nextest-clinnet> failure: test failure with exit code 101
  382. 127.52 s gammaloop-nextest-clinnet> thread 'public_linnest_overlays_follow_the_unit' (316) panicked at crates/clinnet/tests/public_typst_behavior.rs:81:55:
  383. 127.52 s gammaloop-nextest-clinnet> called `Result::unwrap()` on an `Err` value: typst failed while compiling template /build/.tmpWaRADP/.clinnet/templates/linnest-public-behavior.svg
  384. 127.52 s gammaloop-nextest-clinnet>
  385. 127.52 s gammaloop-nextest-clinnet> Command executed:
  386. 127.52 s gammaloop-nextest-clinnet> "typst" "c" "/build/.tmpWaRADP/.clinnet/templates/linnest-public-behavior.typ" "/build/.tmpWaRADP/.clinnet/templates/linnest-public-behavior.svg" "--root" "/build/.tmpWaRADP/.clinnet/templates"
  387. 127.52 s gammaloop-nextest-clinnet>
  388. 127.52 s gammaloop-nextest-clinnet> Typst stdout:
  389. 127.52 s gammaloop-nextest-clinnet>
  390. 127.52 s gammaloop-nextest-clinnet>
  391. 127.52 s gammaloop-nextest-clinnet> Typst stderr:
  392. 127.52 s gammaloop-nextest-clinnet>
  393. 127.52 s gammaloop-nextest-clinnet>
  394. 127.52 s gammaloop-nextest-clinnet> Location:
  395. 127.52 s gammaloop-nextest-clinnet> crates/clinnet/src/lib.rs:741:13
  396. 127.52 s gammaloop-nextest-clinnet> stack backtrace:
  397. 127.52 s gammaloop-nextest-clinnet> 0: __rustc::rust_begin_unwind
  398. 127.52 s gammaloop-nextest-clinnet> 1: core::panicking::panic_fmt
  399. 127.52 s gammaloop-nextest-clinnet> 2: core::result::unwrap_failed
  400. 127.52 s gammaloop-nextest-clinnet> 3: public_typst_behavior::render
  401. 127.52 s gammaloop-nextest-clinnet> 4: <std::sync::once::Once>::call_once_force::<<std::sync::once_lock::OnceLock<alloc::string::String>>::initialize<<std::sync::once_lock::OnceLock<alloc::string::String>>::get_or_init<public_typst_behavior::linnest_public_svg::{closure#0}>::{closure#0}, !>::{closure#0}>::{closure#0}
  402. 127.52 s gammaloop-nextest-clinnet> 5: <std::sys::sync::once::futex::Once>::call
  403. 127.52 s gammaloop-nextest-clinnet> 6: <std::sync::once_lock::OnceLock<alloc::string::String>>::initialize::<<std::sync::once_lock::OnceLock<alloc::string::String>>::get_or_init<public_typst_behavior::linnest_public_svg::{closure#0}>::{closure#0}, !>
  404. 127.52 s gammaloop-nextest-clinnet> 7: <public_typst_behavior::public_linnest_overlays_follow_the_unit::{closure#0} as core::ops::function::FnOnce<()>>::call_once
  405. 127.52 s gammaloop-nextest-clinnet> note: Some details are omitted, run with `RUST_BACKTRACE=full` for a verbose backtrace.
  406. 127.52 s gammaloop-nextest-clinnet> system-out
  407. 127.52 s gammaloop-nextest-clinnet> running 1 test
  408. 127.52 s gammaloop-nextest-clinnet> test public_linnest_overlays_follow_the_unit has been running for over 60 seconds
  409. 127.52 s gammaloop-nextest-clinnet> test public_linnest_overlays_follow_the_unit ... FAILED
  410. 127.52 s gammaloop-nextest-clinnet>
  411. 127.52 s gammaloop-nextest-clinnet> failures:
  412. 127.52 s gammaloop-nextest-clinnet>
  413. 127.52 s gammaloop-nextest-clinnet> failures:
  414. 127.52 s gammaloop-nextest-clinnet> public_linnest_overlays_follow_the_unit
  415. 127.52 s gammaloop-nextest-clinnet>
  416. 127.52 s gammaloop-nextest-clinnet> test result: FAILED. 0 passed; 1 failed; 0 ignored; 0 measured; 17 filtered out; finished in 63.90s
  417. 127.52 s gammaloop-nextest-clinnet> system-err
  418. 127.52 s gammaloop-nextest-clinnet> thread 'public_linnest_overlays_follow_the_unit' (316) panicked at crates/clinnet/tests/public_typst_behavior.rs:81:55:
  419. 127.52 s gammaloop-nextest-clinnet> called `Result::unwrap()` on an `Err` value: typst failed while compiling template /build/.tmpWaRADP/.clinnet/templates/linnest-public-behavior.svg
  420. 127.52 s gammaloop-nextest-clinnet>
  421. 127.52 s gammaloop-nextest-clinnet> Command executed:
  422. 127.52 s gammaloop-nextest-clinnet> "typst" "c" "/build/.tmpWaRADP/.clinnet/templates/linnest-public-behavior.typ" "/build/.tmpWaRADP/.clinnet/templates/linnest-public-behavior.svg" "--root" "/build/.tmpWaRADP/.clinnet/templates"
  423. 127.52 s gammaloop-nextest-clinnet>
  424. 127.52 s gammaloop-nextest-clinnet> Typst stdout:
  425. 127.52 s gammaloop-nextest-clinnet>
  426. 127.52 s gammaloop-nextest-clinnet>
  427. 127.52 s gammaloop-nextest-clinnet> Typst stderr:
  428. 127.52 s gammaloop-nextest-clinnet>
  429. 127.52 s gammaloop-nextest-clinnet>
  430. 127.52 s gammaloop-nextest-clinnet> Location:
  431. 127.52 s gammaloop-nextest-clinnet> crates/clinnet/src/lib.rs:741:13
  432. 127.52 s gammaloop-nextest-clinnet> stack backtrace:
  433. 127.52 s gammaloop-nextest-clinnet> 0: __rustc::rust_begin_unwind
  434. 127.52 s gammaloop-nextest-clinnet> 1: core::panicking::panic_fmt
  435. 127.52 s gammaloop-nextest-clinnet> 2: core::result::unwrap_failed
  436. 127.52 s gammaloop-nextest-clinnet> 3: public_typst_behavior::render
  437. 127.52 s gammaloop-nextest-clinnet> 4: <std::sync::once::Once>::call_once_force::<<std::sync::once_lock::OnceLock<alloc::string::String>>::initialize<<std::sync::once_lock::OnceLock<alloc::string::String>>::get_or_init<public_typst_behavior::linnest_public_svg::{closure#0}>::{closure#0}, !>::{closure#0}>::{closure#0}
  438. 127.52 s gammaloop-nextest-clinnet> 5: <std::sys::sync::once::futex::Once>::call
  439. 127.52 s gammaloop-nextest-clinnet> 6: <std::sync::once_lock::OnceLock<alloc::string::String>>::initialize::<<std::sync::once_lock::OnceLock<alloc::string::String>>::get_or_init<public_typst_behavior::linnest_public_svg::{closure#0}>::{closure#0}, !>
  440. 127.52 s gammaloop-nextest-clinnet> 7: <public_typst_behavior::public_linnest_overlays_follow_the_unit::{closure#0} as core::ops::function::FnOnce<()>>::call_once
  441. 127.52 s gammaloop-nextest-clinnet> note: Some details are omitted, run with `RUST_BACKTRACE=full` for a verbose backtrace.
  442. 127.52 s gammaloop-nextest-clinnet>
  443. 127.52 s gammaloop-nextest-clinnet> 3. clinnet::public_typst_behavior::public_linnest_fixture_assertions_hold
  444. 127.52 s gammaloop-nextest-clinnet> failure: test failure with exit code 101
  445. 127.52 s gammaloop-nextest-clinnet> thread 'public_linnest_fixture_assertions_hold' (281) panicked at crates/clinnet/tests/public_typst_behavior.rs:81:55:
  446. 127.52 s gammaloop-nextest-clinnet> called `Result::unwrap()` on an `Err` value: typst failed while compiling template /build/.tmpbsHWZO/.clinnet/templates/linnest-public-behavior.svg
  447. 127.52 s gammaloop-nextest-clinnet>
  448. 127.52 s gammaloop-nextest-clinnet> Command executed:
  449. 127.52 s gammaloop-nextest-clinnet> "typst" "c" "/build/.tmpbsHWZO/.clinnet/templates/linnest-public-behavior.typ" "/build/.tmpbsHWZO/.clinnet/templates/linnest-public-behavior.svg" "--root" "/build/.tmpbsHWZO/.clinnet/templates"
  450. 127.52 s gammaloop-nextest-clinnet>
  451. 127.52 s gammaloop-nextest-clinnet> Typst stdout:
  452. 127.52 s gammaloop-nextest-clinnet>
  453. 127.52 s gammaloop-nextest-clinnet>
  454. 127.52 s gammaloop-nextest-clinnet> Typst stderr:
  455. 127.52 s gammaloop-nextest-clinnet>
  456. 127.52 s gammaloop-nextest-clinnet>
  457. 127.52 s gammaloop-nextest-clinnet> Location:
  458. 127.52 s gammaloop-nextest-clinnet> crates/clinnet/src/lib.rs:741:13
  459. 127.52 s gammaloop-nextest-clinnet> stack backtrace:
  460. 127.52 s gammaloop-nextest-clinnet> 0: __rustc::rust_begin_unwind
  461. 127.52 s gammaloop-nextest-clinnet> 1: core::panicking::panic_fmt
  462. 127.52 s gammaloop-nextest-clinnet> 2: core::result::unwrap_failed
  463. 127.52 s gammaloop-nextest-clinnet> 3: public_typst_behavior::render
  464. 127.52 s gammaloop-nextest-clinnet> 4: <std::sync::once::Once>::call_once_force::<<std::sync::once_lock::OnceLock<alloc::string::String>>::initialize<<std::sync::once_lock::OnceLock<alloc::string::String>>::get_or_init<public_typst_behavior::linnest_public_svg::{closure#0}>::{closure#0}, !>::{closure#0}>::{closure#0}
  465. 127.52 s gammaloop-nextest-clinnet> 5: <std::sys::sync::once::futex::Once>::call
  466. 127.52 s gammaloop-nextest-clinnet> 6: <std::sync::once_lock::OnceLock<alloc::string::String>>::initialize::<<std::sync::once_lock::OnceLock<alloc::string::String>>::get_or_init<public_typst_behavior::linnest_public_svg::{closure#0}>::{closure#0}, !>
  467. 127.52 s gammaloop-nextest-clinnet> 7: <public_typst_behavior::public_linnest_fixture_assertions_hold::{closure#0} as core::ops::function::FnOnce<()>>::call_once
  468. 127.52 s gammaloop-nextest-clinnet> note: Some details are omitted, run with `RUST_BACKTRACE=full` for a verbose backtrace.
  469. 127.52 s gammaloop-nextest-clinnet> system-out
  470. 127.52 s gammaloop-nextest-clinnet> running 1 test
  471. 127.52 s gammaloop-nextest-clinnet> test public_linnest_fixture_assertions_hold has been running for over 60 seconds
  472. 127.52 s gammaloop-nextest-clinnet> test public_linnest_fixture_assertions_hold ... FAILED
  473. 127.52 s gammaloop-nextest-clinnet>
  474. 127.52 s gammaloop-nextest-clinnet> failures:
  475. 127.52 s gammaloop-nextest-clinnet>
  476. 127.52 s gammaloop-nextest-clinnet> failures:
  477. 127.52 s gammaloop-nextest-clinnet> public_linnest_fixture_assertions_hold
  478. 127.52 s gammaloop-nextest-clinnet>
  479. 127.52 s gammaloop-nextest-clinnet> test result: FAILED. 0 passed; 1 failed; 0 ignored; 0 measured; 17 filtered out; finished in 74.28s
  480. 127.52 s gammaloop-nextest-clinnet> system-err
  481. 127.52 s gammaloop-nextest-clinnet> thread 'public_linnest_fixture_assertions_hold' (281) panicked at crates/clinnet/tests/public_typst_behavior.rs:81:55:
  482. 127.52 s gammaloop-nextest-clinnet> called `Result::unwrap()` on an `Err` value: typst failed while compiling template /build/.tmpbsHWZO/.clinnet/templates/linnest-public-behavior.svg
  483. 127.52 s gammaloop-nextest-clinnet>
  484. 127.52 s gammaloop-nextest-clinnet> Command executed:
  485. 127.52 s gammaloop-nextest-clinnet> "typst" "c" "/build/.tmpbsHWZO/.clinnet/templates/linnest-public-behavior.typ" "/build/.tmpbsHWZO/.clinnet/templates/linnest-public-behavior.svg" "--root" "/build/.tmpbsHWZO/.clinnet/templates"
  486. 127.52 s gammaloop-nextest-clinnet>
  487. 127.52 s gammaloop-nextest-clinnet> Typst stdout:
  488. 127.52 s gammaloop-nextest-clinnet>
  489. 127.52 s gammaloop-nextest-clinnet>
  490. 127.52 s gammaloop-nextest-clinnet> Typst stderr:
  491. 127.52 s gammaloop-nextest-clinnet>
  492. 127.52 s gammaloop-nextest-clinnet>
  493. 127.52 s gammaloop-nextest-clinnet> Location:
  494. 127.52 s gammaloop-nextest-clinnet> crates/clinnet/src/lib.rs:741:13
  495. 127.52 s gammaloop-nextest-clinnet> stack backtrace:
  496. 127.52 s gammaloop-nextest-clinnet> 0: __rustc::rust_begin_unwind
  497. 127.52 s gammaloop-nextest-clinnet> 1: core::panicking::panic_fmt
  498. 127.52 s gammaloop-nextest-clinnet> 2: core::result::unwrap_failed
  499. 127.52 s gammaloop-nextest-clinnet> 3: public_typst_behavior::render
  500. 127.52 s gammaloop-nextest-clinnet> 4: <std::sync::once::Once>::call_once_force::<<std::sync::once_lock::OnceLock<alloc::string::String>>::initialize<<std::sync::once_lock::OnceLock<alloc::string::String>>::get_or_init<public_typst_behavior::linnest_public_svg::{closure#0}>::{closure#0}, !>::{closure#0}>::{closure#0}
  501. 127.52 s gammaloop-nextest-clinnet> 5: <std::sys::sync::once::futex::Once>::call
  502. 127.52 s gammaloop-nextest-clinnet> 6: <std::sync::once_lock::OnceLock<alloc::string::String>>::initialize::<<std::sync::once_lock::OnceLock<alloc::string::String>>::get_or_init<public_typst_behavior::linnest_public_svg::{closure#0}>::{closure#0}, !>
  503. 127.52 s gammaloop-nextest-clinnet> 7: <public_typst_behavior::public_linnest_fixture_assertions_hold::{closure#0} as core::ops::function::FnOnce<()>>::call_once
  504. 127.52 s gammaloop-nextest-clinnet> note: Some details are omitted, run with `RUST_BACKTRACE=full` for a verbose backtrace.
  505. 127.52 s gammaloop-nextest-clinnet> =========================================
  506. 127.62 s [1 built (1 failed), 1 cerror: Cannot build '/nix/store/4pqspwvh8pi9s2vg9g6mfsggpl9ynwzx-gammaloop-nextest-clinnet.drv'.
  507. 127.62 s Reason: builder failed with exit code 100.
  508. 127.62 s Output paths:
  509. 127.62 s /nix/store/v9zka7gxdrym1pq03r0i4w2q43fgdwcq-gammaloop-nextest-clinnet
  510. 127.62 s Last 449 log lines:
  511. 127.62 s > Nextest worker budget: 16
  512. 127.62 s > Extracting 4 binaries (including 1 non-test binary), 1 build script output directory, and 1 linked path to /build/source
  513. 127.62 s > Extracted 16 files to /build/source in 0.08s
  514. 127.62 s > ------------
  515. 127.62 s > Nextest run ID 31610fd8-d687-4d31-8910-c2ba6d3eb88d with nextest profile: ci_gammaloop
  516. 127.62 s > Starting 38 tests across 3 binaries
  517. 127.62 s > FAIL [ 61.035s] (32/38) clinnet::public_typst_behavior public_linnest_endpoint_anchor_distances_stay_local
  518. 127.62 s > stdout ---
  519. 127.62 s >
  520. 127.62 s > running 1 test
  521. 127.62 s > test public_linnest_endpoint_anchor_distances_stay_local has been running for over 60 seconds
  522. 127.62 s > test public_linnest_endpoint_anchor_distances_stay_local ... FAILED
  523. 127.62 s >
  524. 127.62 s > failures:
  525. 127.62 s >
  526. 127.62 s > failures:
  527. 127.62 s > public_linnest_endpoint_anchor_distances_stay_local
  528. 127.62 s >
  529. 127.62 s > test result: FAILED. 0 passed; 1 failed; 0 ignored; 0 measured; 17 filtered out; finished in 61.02s
  530. 127.62 s >
  531. 127.62 s > stderr ---
  532. 127.62 s >
  533. 127.62 s > thread 'public_linnest_endpoint_anchor_distances_stay_local' (264) panicked at crates/clinnet/tests/public_typst_behavior.rs:81:55:
  534. 127.62 s > called `Result::unwrap()` on an `Err` value: typst failed while compiling template /build/.tmpW3gckD/.clinnet/templates/linnest-public-behavior.svg
  535. 127.62 s >
  536. 127.62 s > Command executed:
  537. 127.62 s > "typst" "c" "/build/.tmpW3gckD/.clinnet/templates/linnest-public-behavior.typ" "/build/.tmpW3gckD/.clinnet/templates/linnest-public-behavior.svg" "--root" "/build/.tmpW3gckD/.clinnet/templates"
  538. 127.62 s >
  539. 127.62 s > Typst stdout:
  540. 127.62 s >
  541. 127.62 s >
  542. 127.62 s > Typst stderr:
  543. 127.62 s >
  544. 127.62 s >
  545. 127.62 s > Location:
  546. 127.62 s > crates/clinnet/src/lib.rs:741:13
  547. 127.62 s > stack backtrace:
  548. 127.62 s > 0: __rustc::rust_begin_unwind
  549. 127.62 s > 1: core::panicking::panic_fmt
  550. 127.62 s > 2: core::result::unwrap_failed
  551. 127.62 s > 3: public_typst_behavior::render
  552. 127.62 s > 4: <std::sync::once::Once>::call_once_force::<<std::sync::once_lock::OnceLock<alloc::string::String>>::initialize<<std::sync::once_lock::OnceLock<alloc::string::String>>::get_or_init<public_typst_behavior::linnest_public_svg::{closure#0}>::{closure#0}, !>::{closure#0}>::{closure#0}
  553. 127.62 s > 5: <std::sys::sync::once::futex::Once>::call
  554. 127.62 s > 6: <std::sync::once_lock::OnceLock<alloc::string::String>>::initialize::<<std::sync::once_lock::OnceLock<alloc::string::String>>::get_or_init<public_typst_behavior::linnest_public_svg::{closure#0}>::{closure#0}, !>
  555. 127.62 s > 7: <public_typst_behavior::public_linnest_endpoint_anchor_distances_stay_local::{closure#0} as core::ops::function::FnOnce<()>>::call_once
  556. 127.62 s > note: Some details are omitted, run with `RUST_BACKTRACE=full` for a verbose backtrace.
  557. 127.62 s >
  558. 127.62 s > FAIL [ 63.913s] (33/38) clinnet::public_typst_behavior public_linnest_overlays_follow_the_unit
  559. 127.62 s > stdout ---
  560. 127.62 s >
  561. 127.62 s > running 1 test
  562. 127.62 s > test public_linnest_overlays_follow_the_unit has been running for over 60 seconds
  563. 127.62 s > test public_linnest_overlays_follow_the_unit ... FAILED
  564. 127.62 s >
  565. 127.62 s > failures:
  566. 127.62 s >
  567. 127.62 s > failures:
  568. 127.62 s > public_linnest_overlays_follow_the_unit
  569. 127.62 s >
  570. 127.62 s > test result: FAILED. 0 passed; 1 failed; 0 ignored; 0 measured; 17 filtered out; finished in 63.90s
  571. 127.62 s >
  572. 127.62 s > stderr ---
  573. 127.62 s >
  574. 127.62 s > thread 'public_linnest_overlays_follow_the_unit' (316) panicked at crates/clinnet/tests/public_typst_behavior.rs:81:55:
  575. 127.62 s > called `Result::unwrap()` on an `Err` value: typst failed while compiling template /build/.tmpWaRADP/.clinnet/templates/linnest-public-behavior.svg
  576. 127.62 s >
  577. 127.62 s > Command executed:
  578. 127.62 s > "typst" "c" "/build/.tmpWaRADP/.clinnet/templates/linnest-public-behavior.typ" "/build/.tmpWaRADP/.clinnet/templates/linnest-public-behavior.svg" "--root" "/build/.tmpWaRADP/.clinnet/templates"
  579. 127.62 s >
  580. 127.62 s > Typst stdout:
  581. 127.62 s >
  582. 127.62 s >
  583. 127.62 s > Typst stderr:
  584. 127.62 s >
  585. 127.62 s >
  586. 127.62 s > Location:
  587. 127.62 s > crates/clinnet/src/lib.rs:741:13
  588. 127.62 s > stack backtrace:
  589. 127.62 s > 0: __rustc::rust_begin_unwind
  590. 127.62 s > 1: core::panicking::panic_fmt
  591. 127.62 s > 2: core::result::unwrap_failed
  592. 127.62 s > 3: public_typst_behavior::render
  593. 127.62 s > 4: <std::sync::once::Once>::call_once_force::<<std::sync::once_lock::OnceLock<alloc::string::String>>::initialize<<std::sync::once_lock::OnceLock<alloc::string::String>>::get_or_init<public_typst_behavior::linnest_public_svg::{closure#0}>::{closure#0}, !>::{closure#0}>::{closure#0}
  594. 127.62 s > 5: <std::sys::sync::once::futex::Once>::call
  595. 127.62 s > 6: <std::sync::once_lock::OnceLock<alloc::string::String>>::initialize::<<std::sync::once_lock::OnceLock<alloc::string::String>>::get_or_init<public_typst_behavior::linnest_public_svg::{closure#0}>::{closure#0}, !>
  596. 127.62 s > 7: <public_typst_behavior::public_linnest_overlays_follow_the_unit::{closure#0} as core::ops::function::FnOnce<()>>::call_once
  597. 127.62 s > note: Some details are omitted, run with `RUST_BACKTRACE=full` for a verbose backtrace.
  598. 127.62 s >
  599. 127.62 s > FAIL [ 74.285s] (34/38) clinnet::public_typst_behavior public_linnest_fixture_assertions_hold
  600. 127.62 s > stdout ---
  601. 127.62 s >
  602. 127.62 s > running 1 test
  603. 127.62 s > test public_linnest_fixture_assertions_hold has been running for over 60 seconds
  604. 127.62 s > test public_linnest_fixture_assertions_hold ... FAILED
  605. 127.62 s >
  606. 127.62 s > failures:
  607. 127.62 s >
  608. 127.62 s > failures:
  609. 127.62 s > public_linnest_fixture_assertions_hold
  610. 127.62 s >
  611. 127.62 s > test result: FAILED. 0 passed; 1 failed; 0 ignored; 0 measured; 17 filtered out; finished in 74.28s
  612. 127.62 s >
  613. 127.62 s > stderr ---
  614. 127.62 s >
  615. 127.62 s > thread 'public_linnest_fixture_assertions_hold' (281) panicked at crates/clinnet/tests/public_typst_behavior.rs:81:55:
  616. 127.62 s > called `Result::unwrap()` on an `Err` value: typst failed while compiling template /build/.tmpbsHWZO/.clinnet/templates/linnest-public-behavior.svg
  617. 127.62 s >
  618. 127.62 s > Command executed:
  619. 127.62 s > "typst" "c" "/build/.tmpbsHWZO/.clinnet/templates/linnest-public-behavior.typ" "/build/.tmpbsHWZO/.clinnet/templates/linnest-public-behavior.svg" "--root" "/build/.tmpbsHWZO/.clinnet/templates"
  620. 127.62 s >
  621. 127.62 s > Typst stdout:
  622. 127.62 s >
  623. 127.62 s >
  624. 127.62 s > Typst stderr:
  625. 127.62 s >
  626. 127.62 s >
  627. 127.62 s > Location:
  628. 127.62 s > crates/clinnet/src/lib.rs:741:13
  629. 127.62 s > stack backtrace:
  630. 127.62 s > 0: __rustc::rust_begin_unwind
  631. 127.62 s > 1: core::panicking::panic_fmt
  632. 127.62 s > 2: core::result::unwrap_failed
  633. 127.62 s > 3: public_typst_behavior::render
  634. 127.62 s > 4: <std::sync::once::Once>::call_once_force::<<std::sync::once_lock::OnceLock<alloc::string::String>>::initialize<<std::sync::once_lock::OnceLock<alloc::string::String>>::get_or_init<public_typst_behavior::linnest_public_svg::{closure#0}>::{closure#0}, !>::{closure#0}>::{closure#0}
  635. 127.62 s > 5: <std::sys::sync::once::futex::Once>::call
  636. 127.62 s > 6: <std::sync::once_lock::OnceLock<alloc::string::String>>::initialize::<<std::sync::once_lock::OnceLock<alloc::string::String>>::get_or_init<public_typst_behavior::linnest_public_svg::{closure#0}>::{closure#0}, !>
  637. 127.62 s > 7: <public_typst_behavior::public_linnest_fixture_assertions_hold::{closure#0} as core::ops::function::FnOnce<()>>::call_once
  638. 127.62 s > note: Some details are omitted, run with `RUST_BACKTRACE=full` for a verbose backtrace.
  639. 127.62 s >
  640. 127.62 s > ------------
  641. 127.62 s > Summary [ 84.917s] 38 tests run: 35 passed, 3 failed, 0 skipped
  642. 127.62 s > FAIL [ 61.035s] (32/38) clinnet::public_typst_behavior public_linnest_endpoint_anchor_distances_stay_local
  643. 127.62 s > stdout ---
  644. 127.62 s >
  645. 127.62 s > running 1 test
  646. 127.62 s > test public_linnest_endpoint_anchor_distances_stay_local has been running for over 60 seconds
  647. 127.62 s > test public_linnest_endpoint_anchor_distances_stay_local ... FAILED
  648. 127.62 s >
  649. 127.62 s > failures:
  650. 127.62 s >
  651. 127.62 s > failures:
  652. 127.62 s > public_linnest_endpoint_anchor_distances_stay_local
  653. 127.62 s >
  654. 127.62 s > test result: FAILED. 0 passed; 1 failed; 0 ignored; 0 measured; 17 filtered out; finished in 61.02s
  655. 127.62 s >
  656. 127.62 s > stderr ---
  657. 127.62 s >
  658. 127.62 s > thread 'public_linnest_endpoint_anchor_distances_stay_local' (264) panicked at crates/clinnet/tests/public_typst_behavior.rs:81:55:
  659. 127.62 s > called `Result::unwrap()` on an `Err` value: typst failed while compiling template /build/.tmpW3gckD/.clinnet/templates/linnest-public-behavior.svg
  660. 127.62 s >
  661. 127.62 s > Command executed:
  662. 127.62 s > "typst" "c" "/build/.tmpW3gckD/.clinnet/templates/linnest-public-behavior.typ" "/build/.tmpW3gckD/.clinnet/templates/linnest-public-behavior.svg" "--root" "/build/.tmpW3gckD/.clinnet/templates"
  663. 127.62 s >
  664. 127.62 s > Typst stdout:
  665. 127.62 s >
  666. 127.62 s >
  667. 127.62 s > Typst stderr:
  668. 127.62 s >
  669. 127.62 s >
  670. 127.62 s > Location:
  671. 127.62 s > crates/clinnet/src/lib.rs:741:13
  672. 127.62 s > stack backtrace:
  673. 127.62 s > 0: __rustc::rust_begin_unwind
  674. 127.62 s > 1: core::panicking::panic_fmt
  675. 127.62 s > 2: core::result::unwrap_failed
  676. 127.62 s > 3: public_typst_behavior::render
  677. 127.62 s > 4: <std::sync::once::Once>::call_once_force::<<std::sync::once_lock::OnceLock<alloc::string::String>>::initialize<<std::sync::once_lock::OnceLock<alloc::string::String>>::get_or_init<public_typst_behavior::linnest_public_svg::{closure#0}>::{closure#0}, !>::{closure#0}>::{closure#0}
  678. 127.62 s > 5: <std::sys::sync::once::futex::Once>::call
  679. 127.62 s > 6: <std::sync::once_lock::OnceLock<alloc::string::String>>::initialize::<<std::sync::once_lock::OnceLock<alloc::string::String>>::get_or_init<public_typst_behavior::linnest_public_svg::{closure#0}>::{closure#0}, !>
  680. 127.62 s > 7: <public_typst_behavior::public_linnest_endpoint_anchor_distances_stay_local::{closure#0} as core::ops::function::FnOnce<()>>::call_once
  681. 127.62 s > note: Some details are omitted, run with `RUST_BACKTRACE=full` for a verbose backtrace.
  682. 127.62 s >
  683. 127.62 s > FAIL [ 63.913s] (33/38) clinnet::public_typst_behavior public_linnest_overlays_follow_the_unit
  684. 127.62 s > stdout ---
  685. 127.62 s >
  686. 127.62 s > running 1 test
  687. 127.62 s > test public_linnest_overlays_follow_the_unit has been running for over 60 seconds
  688. 127.62 s > test public_linnest_overlays_follow_the_unit ... FAILED
  689. 127.62 s >
  690. 127.62 s > failures:
  691. 127.62 s >
  692. 127.62 s > failures:
  693. 127.62 s > public_linnest_overlays_follow_the_unit
  694. 127.62 s >
  695. 127.62 s > test result: FAILED. 0 passed; 1 failed; 0 ignored; 0 measured; 17 filtered out; finished in 63.90s
  696. 127.62 s >
  697. 127.62 s > stderr ---
  698. 127.62 s >
  699. 127.62 s > thread 'public_linnest_overlays_follow_the_unit' (316) panicked at crates/clinnet/tests/public_typst_behavior.rs:81:55:
  700. 127.62 s > called `Result::unwrap()` on an `Err` value: typst failed while compiling template /build/.tmpWaRADP/.clinnet/templates/linnest-public-behavior.svg
  701. 127.62 s >
  702. 127.62 s > Command executed:
  703. 127.62 s > "typst" "c" "/build/.tmpWaRADP/.clinnet/templates/linnest-public-behavior.typ" "/build/.tmpWaRADP/.clinnet/templates/linnest-public-behavior.svg" "--root" "/build/.tmpWaRADP/.clinnet/templates"
  704. 127.62 s >
  705. 127.62 s > Typst stdout:
  706. 127.62 s >
  707. 127.62 s >
  708. 127.62 s > Typst stderr:
  709. 127.62 s >
  710. 127.62 s >
  711. 127.62 s > Location:
  712. 127.62 s > crates/clinnet/src/lib.rs:741:13
  713. 127.62 s > stack backtrace:
  714. 127.62 s > 0: __rustc::rust_begin_unwind
  715. 127.62 s > 1: core::panicking::panic_fmt
  716. 127.62 s > 2: core::result::unwrap_failed
  717. 127.62 s > 3: public_typst_behavior::render
  718. 127.62 s > 4: <std::sync::once::Once>::call_once_force::<<std::sync::once_lock::OnceLock<alloc::string::String>>::initialize<<std::sync::once_lock::OnceLock<alloc::string::String>>::get_or_init<public_typst_behavior::linnest_public_svg::{closure#0}>::{closure#0}, !>::{closure#0}>::{closure#0}
  719. 127.62 s > 5: <std::sys::sync::once::futex::Once>::call
  720. 127.62 s > 6: <std::sync::once_lock::OnceLock<alloc::string::String>>::initialize::<<std::sync::once_lock::OnceLock<alloc::string::String>>::get_or_init<public_typst_behavior::linnest_public_svg::{closure#0}>::{closure#0}, !>
  721. 127.62 s > 7: <public_typst_behavior::public_linnest_overlays_follow_the_unit::{closure#0} as core::ops::function::FnOnce<()>>::call_once
  722. 127.62 s > note: Some details are omitted, run with `RUST_BACKTRACE=full` for a verbose backtrace.
  723. 127.62 s >
  724. 127.62 s > FAIL [ 74.285s] (34/38) clinnet::public_typst_behavior public_linnest_fixture_assertions_hold
  725. 127.62 s > stdout ---
  726. 127.62 s >
  727. 127.62 s > running 1 test
  728. 127.62 s > test public_linnest_fixture_assertions_hold has been running for over 60 seconds
  729. 127.62 s > test public_linnest_fixture_assertions_hold ... FAILED
  730. 127.62 s >
  731. 127.62 s > failures:
  732. 127.62 s >
  733. 127.62 s > failures:
  734. 127.62 s > public_linnest_fixture_assertions_hold
  735. 127.62 s >
  736. 127.62 s > test result: FAILED. 0 passed; 1 failed; 0 ignored; 0 measured; 17 filtered out; finished in 74.28s
  737. 127.62 s >
  738. 127.62 s > stderr ---
  739. 127.62 s >
  740. 127.62 s > thread 'public_linnest_fixture_assertions_hold' (281) panicked at crates/clinnet/tests/public_typst_behavior.rs:81:55:
  741. 127.62 s > called `Result::unwrap()` on an `Err` value: typst failed while compiling template /build/.tmpbsHWZO/.clinnet/templates/linnest-public-behavior.svg
  742. 127.62 s >
  743. 127.62 s > Command executed:
  744. 127.62 s > "typst" "c" "/build/.tmpbsHWZO/.clinnet/templates/linnest-public-behavior.typ" "/build/.tmpbsHWZO/.clinnet/templates/linnest-public-behavior.svg" "--root" "/build/.tmpbsHWZO/.clinnet/templates"
  745. 127.62 s >
  746. 127.62 s > Typst stdout:
  747. 127.62 s >
  748. 127.62 s >
  749. 127.62 s > Typst stderr:
  750. 127.62 s >
  751. 127.62 s >
  752. 127.62 s > Location:
  753. 127.62 s > crates/clinnet/src/lib.rs:741:13
  754. 127.62 s > stack backtrace:
  755. 127.62 s > 0: __rustc::rust_begin_unwind
  756. 127.62 s > 1: core::panicking::panic_fmt
  757. 127.62 s > 2: core::result::unwrap_failed
  758. 127.62 s > 3: public_typst_behavior::render
  759. 127.62 s > 4: <std::sync::once::Once>::call_once_force::<<std::sync::once_lock::OnceLock<alloc::string::String>>::initialize<<std::sync::once_lock::OnceLock<alloc::string::String>>::get_or_init<public_typst_behavior::linnest_public_svg::{closure#0}>::{closure#0}, !>::{closure#0}>::{closure#0}
  760. 127.62 s > 5: <std::sys::sync::once::futex::Once>::call
  761. 127.62 s > 6: <std::sync::once_lock::OnceLock<alloc::string::String>>::initialize::<<std::sync::once_lock::OnceLock<alloc::string::String>>::get_or_init<public_typst_behavior::linnest_public_svg::{closure#0}>::{closure#0}, !>
  762. 127.62 s > 7: <public_typst_behavior::public_linnest_fixture_assertions_hold::{closure#0} as core::ops::function::FnOnce<()>>::call_once
  763. 127.62 s > note: Some details are omitted, run with `RUST_BACKTRACE=full` for a verbose backtrace.
  764. 127.62 s >
  765. 127.62 s > error: test run failed
  766. 127.62 s >
  767. 127.62 s > ========== nextest test summary ==========
  768. 127.62 s > report: target/nextest/ci_gammaloop/junit.xml
  769. 127.62 s > tests: 38, failures: 3, errors: 0
  770. 127.62 s >
  771. 127.62 s > 1. clinnet::public_typst_behavior::public_linnest_endpoint_anchor_distances_stay_local
  772. 127.62 s > failure: test failure with exit code 101
  773. 127.62 s > thread 'public_linnest_endpoint_anchor_distances_stay_local' (264) panicked at crates/clinnet/tests/public_typst_behavior.rs:81:55:
  774. 127.62 s > called `Result::unwrap()` on an `Err` value: typst failed while compiling template /build/.tmpW3gckD/.clinnet/templates/linnest-public-behavior.svg
  775. 127.62 s >
  776. 127.62 s > Command executed:
  777. 127.62 s > "typst" "c" "/build/.tmpW3gckD/.clinnet/templates/linnest-public-behavior.typ" "/build/.tmpW3gckD/.clinnet/templates/linnest-public-behavior.svg" "--root" "/build/.tmpW3gckD/.clinnet/templates"
  778. 127.62 s >
  779. 127.62 s > Typst stdout:
  780. 127.62 s >
  781. 127.62 s >
  782. 127.62 s > Typst stderr:
  783. 127.62 s >
  784. 127.62 s >
  785. 127.62 s > Location:
  786. 127.62 s > crates/clinnet/src/lib.rs:741:13
  787. 127.62 s > stack backtrace:
  788. 127.62 s > 0: __rustc::rust_begin_unwind
  789. 127.62 s > 1: core::panicking::panic_fmt
  790. 127.62 s > 2: core::result::unwrap_failed
  791. 127.62 s > 3: public_typst_behavior::render
  792. 127.62 s > 4: <std::sync::once::Once>::call_once_force::<<std::sync::once_lock::OnceLock<alloc::string::String>>::initialize<<std::sync::once_lock::OnceLock<alloc::string::String>>::get_or_init<public_typst_behavior::linnest_public_svg::{closure#0}>::{closure#0}, !>::{closure#0}>::{closure#0}
  793. 127.62 s > 5: <std::sys::sync::once::futex::Once>::call
  794. 127.62 s > 6: <std::sync::once_lock::OnceLock<alloc::string::String>>::initialize::<<std::sync::once_lock::OnceLock<alloc::string::String>>::get_or_init<public_typst_behavior::linnest_public_svg::{closure#0}>::{closure#0}, !>
  795. 127.62 s > 7: <public_typst_behavior::public_linnest_endpoint_anchor_distances_stay_local::{closure#0} as core::ops::function::FnOnce<()>>::call_once
  796. 127.62 s > note: Some details are omitted, run with `RUST_BACKTRACE=full` for a verbose backtrace.
  797. 127.62 s > system-out
  798. 127.62 s > running 1 test
  799. 127.62 s > test public_linnest_endpoint_anchor_distances_stay_local has been running for over 60 seconds
  800. 127.62 s > test public_linnest_endpoint_anchor_distances_stay_local ... FAILED
  801. 127.62 s >
  802. 127.62 s > failures:
  803. 127.62 s >
  804. 127.62 s > failures:
  805. 127.62 s > public_linnest_endpoint_anchor_distances_stay_local
  806. 127.62 s >
  807. 127.62 s > test result: FAILED. 0 passed; 1 failed; 0 ignored; 0 measured; 17 filtered out; finished in 61.02s
  808. 127.62 s > system-err
  809. 127.62 s > thread 'public_linnest_endpoint_anchor_distances_stay_local' (264) panicked at crates/clinnet/tests/public_typst_behavior.rs:81:55:
  810. 127.62 s > called `Result::unwrap()` on an `Err` value: typst failed while compiling template /build/.tmpW3gckD/.clinnet/templates/linnest-public-behavior.svg
  811. 127.62 s >
  812. 127.62 s > Command executed:
  813. 127.62 s > "typst" "c" "/build/.tmpW3gckD/.clinnet/templates/linnest-public-behavior.typ" "/build/.tmpW3gckD/.clinnet/templates/linnest-public-behavior.svg" "--root" "/build/.tmpW3gckD/.clinnet/templates"
  814. 127.62 s >
  815. 127.62 s > Typst stdout:
  816. 127.62 s >
  817. 127.62 s >
  818. 127.62 s > Typst stderr:
  819. 127.62 s >
  820. 127.62 s >
  821. 127.62 s > Location:
  822. 127.62 s > crates/clinnet/src/lib.rs:741:13
  823. 127.62 s > stack backtrace:
  824. 127.62 s > 0: __rustc::rust_begin_unwind
  825. 127.62 s > 1: core::panicking::panic_fmt
  826. 127.62 s > 2: core::result::unwrap_failed
  827. 127.62 s > 3: public_typst_behavior::render
  828. 127.62 s > 4: <std::sync::once::Once>::call_once_force::<<std::sync::once_lock::OnceLock<alloc::string::String>>::initialize<<std::sync::once_lock::OnceLock<alloc::string::String>>::get_or_init<public_typst_behavior::linnest_public_svg::{closure#0}>::{closure#0}, !>::{closure#0}>::{closure#0}
  829. 127.62 s > 5: <std::sys::sync::once::futex::Once>::call
  830. 127.62 s > 6: <std::sync::once_lock::OnceLock<alloc::string::String>>::initialize::<<std::sync::once_lock::OnceLock<alloc::string::String>>::get_or_init<public_typst_behavior::linnest_public_svg::{closure#0}>::{closure#0}, !>
  831. 127.62 s > 7: <public_typst_behavior::public_linnest_endpoint_anchor_distances_stay_local::{closure#0} as core::ops::function::FnOnce<()>>::call_once
  832. 127.62 s > note: Some details are omitted, run with `RUST_BACKTRACE=full` for a verbose backtrace.
  833. 127.62 s >
  834. 127.62 s > 2. clinnet::public_typst_behavior::public_linnest_overlays_follow_the_unit
  835. 127.62 s > failure: test failure with exit code 101
  836. 127.62 s > thread 'public_linnest_overlays_follow_the_unit' (316) panicked at crates/clinnet/tests/public_typst_behavior.rs:81:55:
  837. 127.62 s > called `Result::unwrap()` on an `Err` value: typst failed while compiling template /build/.tmpWaRADP/.clinnet/templates/linnest-public-behavior.svg
  838. 127.62 s >
  839. 127.62 s > Command executed:
  840. 127.62 s > "typst" "c" "/build/.tmpWaRADP/.clinnet/templates/linnest-public-behavior.typ" "/build/.tmpWaRADP/.clinnet/templates/linnest-public-behavior.svg" "--root" "/build/.tmpWaRADP/.clinnet/templates"
  841. 127.62 s >
  842. 127.62 s > Typst stdout:
  843. 127.62 s >
  844. 127.62 s >
  845. 127.62 s > Typst stderr:
  846. 127.62 s >
  847. 127.62 s >
  848. 127.62 s > Location:
  849. 127.62 s > crates/clinnet/src/lib.rs:741:13
  850. 127.62 s > stack backtrace:
  851. 127.62 s > 0: __rustc::rust_begin_unwind
  852. 127.62 s > 1: core::panicking::panic_fmt
  853. 127.62 s > 2: core::result::unwrap_failed
  854. 127.62 s > 3: public_typst_behavior::render
  855. 127.62 s > 4: <std::sync::once::Once>::call_once_force::<<std::sync::once_lock::OnceLock<alloc::string::String>>::initialize<<std::sync::once_lock::OnceLock<alloc::string::String>>::get_or_init<public_typst_behavior::linnest_public_svg::{closure#0}>::{closure#0}, !>::{closure#0}>::{closure#0}
  856. 127.62 s > 5: <std::sys::sync::once::futex::Once>::call
  857. 127.62 s > 6: <std::sync::once_lock::OnceLock<alloc::string::String>>::initialize::<<std::sync::once_lock::OnceLock<alloc::string::String>>::get_or_init<public_typst_behavior::linnest_public_svg::{closure#0}>::{closure#0}, !>
  858. 127.62 s > 7: <public_typst_behavior::public_linnest_overlays_follow_the_unit::{closure#0} as core::ops::function::FnOnce<()>>::call_once
  859. 127.62 s > note: Some details are omitted, run with `RUST_BACKTRACE=full` for a verbose backtrace.
  860. 127.62 s > system-out
  861. 127.62 s > running 1 test
  862. 127.62 s > test public_linnest_overlays_follow_the_unit has been running for over 60 seconds
  863. 127.62 s > test public_linnest_overlays_follow_the_unit ... FAILED
  864. 127.62 s >
  865. 127.62 s > failures:
  866. 127.62 s >
  867. 127.62 s > failures:
  868. 127.62 s > public_linnest_overlays_follow_the_unit
  869. 127.62 s >
  870. 127.62 s > test result: FAILED. 0 passed; 1 failed; 0 ignored; 0 measured; 17 filtered out; finished in 63.90s
  871. 127.62 s > system-err
  872. 127.62 s > thread 'public_linnest_overlays_follow_the_unit' (316) panicked at crates/clinnet/tests/public_typst_behavior.rs:81:55:
  873. 127.62 s > called `Result::unwrap()` on an `Err` value: typst failed while compiling template /build/.tmpWaRADP/.clinnet/templates/linnest-public-behavior.svg
  874. 127.62 s >
  875. 127.62 s > Command executed:
  876. 127.62 s > "typst" "c" "/build/.tmpWaRADP/.clinnet/templates/linnest-public-behavior.typ" "/build/.tmpWaRADP/.clinnet/templates/linnest-public-behavior.svg" "--root" "/build/.tmpWaRADP/.clinnet/templates"
  877. 127.62 s >
  878. 127.62 s > Typst stdout:
  879. 127.62 s >
  880. 127.62 s >
  881. 127.62 s > Typst stderr:
  882. 127.62 s >
  883. 127.62 s >
  884. 127.62 s > Location:
  885. 127.62 s > crates/clinnet/src/lib.rs:741:13
  886. 127.62 s > stack backtrace:
  887. 127.62 s > 0: __rustc::rust_begin_unwind
  888. 127.62 s > 1: core::panicking::panic_fmt
  889. 127.62 s > 2: core::result::unwrap_failed
  890. 127.62 s > 3: public_typst_behavior::render
  891. 127.62 s > 4: <std::sync::once::Once>::call_once_force::<<std::sync::once_lock::OnceLock<alloc::string::String>>::initialize<<std::sync::once_lock::OnceLock<alloc::string::String>>::get_or_init<public_typst_behavior::linnest_public_svg::{closure#0}>::{closure#0}, !>::{closure#0}>::{closure#0}
  892. 127.62 s > 5: <std::sys::sync::once::futex::Once>::call
  893. 127.62 s > 6: <std::sync::once_lock::OnceLock<alloc::string::String>>::initialize::<<std::sync::once_lock::OnceLock<alloc::string::String>>::get_or_init<public_typst_behavior::linnest_public_svg::{closure#0}>::{closure#0}, !>
  894. 127.62 s > 7: <public_typst_behavior::public_linnest_overlays_follow_the_unit::{closure#0} as core::ops::function::FnOnce<()>>::call_once
  895. 127.62 s > note: Some details are omitted, run with `RUST_BACKTRACE=full` for a verbose backtrace.
  896. 127.62 s >
  897. 127.62 s > 3. clinnet::public_typst_behavior::public_linnest_fixture_assertions_hold
  898. 127.62 s > failure: test failure with exit code 101
  899. 127.62 s > thread 'public_linnest_fixture_assertions_hold' (281) panicked at crates/clinnet/tests/public_typst_behavior.rs:81:55:
  900. 127.62 s > called `Result::unwrap()` on an `Err` value: typst failed while compiling template /build/.tmpbsHWZO/.clinnet/templates/linnest-public-behavior.svg
  901. 127.62 s >
  902. 127.62 s > Command executed:
  903. 127.62 s > "typst" "c" "/build/.tmpbsHWZO/.clinnet/templates/linnest-public-behavior.typ" "/build/.tmpbsHWZO/.clinnet/templates/linnest-public-behavior.svg" "--root" "/build/.tmpbsHWZO/.clinnet/templates"
  904. 127.62 s >
  905. 127.62 s > Typst stdout:
  906. 127.62 s >
  907. 127.62 s >
  908. 127.62 s > Typst stderr:
  909. 127.62 s >
  910. 127.62 s >
  911. 127.62 s > Location:
  912. 127.62 s > crates/clinnet/src/lib.rs:741:13
  913. 127.62 s > stack backtrace:
  914. 127.62 s > 0: __rustc::rust_begin_unwind
  915. 127.62 s > 1: core::panicking::panic_fmt
  916. 127.62 s > 2: core::result::unwrap_failed
  917. 127.62 s > 3: public_typst_behavior::render
  918. 127.62 s > 4: <std::sync::once::Once>::call_once_force::<<std::sync::once_lock::OnceLock<alloc::string::String>>::initialize<<std::sync::once_lock::OnceLock<alloc::string::String>>::get_or_init<public_typst_behavior::linnest_public_svg::{closure#0}>::{closure#0}, !>::{closure#0}>::{closure#0}
  919. 127.62 s > 5: <std::sys::sync::once::futex::Once>::call
  920. 127.62 s > 6: <std::sync::once_lock::OnceLock<alloc::string::String>>::initialize::<<std::sync::once_lock::OnceLock<alloc::string::String>>::get_or_init<public_typst_behavior::linnest_public_svg::{closure#0}>::{closure#0}, !>
  921. 127.62 s > 7: <public_typst_behavior::public_linnest_fixture_assertions_hold::{closure#0} as core::ops::function::FnOnce<()>>::call_once
  922. 127.62 s > note: Some details are omitted, run with `RUST_BACKTRACE=full` for a verbose backtrace.
  923. 127.62 s > system-out
  924. 127.62 s > running 1 test
  925. 127.62 s > test public_linnest_fixture_assertions_hold has been running for over 60 seconds
  926. 127.62 s > test public_linnest_fixture_assertions_hold ... FAILED
  927. 127.62 s >
  928. 127.62 s > failures:
  929. 127.62 s >
  930. 127.62 s > failures:
  931. 127.62 s > public_linnest_fixture_assertions_hold
  932. 127.62 s >
  933. 127.62 s > test result: FAILED. 0 passed; 1 failed; 0 ignored; 0 measured; 17 filtered out; finished in 74.28s
  934. 127.62 s > system-err
  935. 127.62 s > thread 'public_linnest_fixture_assertions_hold' (281) panicked at crates/clinnet/tests/public_typst_behavior.rs:81:55:
  936. 127.62 s > called `Result::unwrap()` on an `Err` value: typst failed while compiling template /build/.tmpbsHWZO/.clinnet/templates/linnest-public-behavior.svg
  937. 127.62 s >
  938. 127.62 s > Command executed:
  939. 127.62 s > "typst" "c" "/build/.tmpbsHWZO/.clinnet/templates/linnest-public-behavior.typ" "/build/.tmpbsHWZO/.clinnet/templates/linnest-public-behavior.svg" "--root" "/build/.tmpbsHWZO/.clinnet/templates"
  940. 127.62 s >
  941. 127.62 s > Typst stdout:
  942. 127.62 s >
  943. 127.62 s >
  944. 127.62 s > Typst stderr:
  945. 127.62 s >
  946. 127.62 s >
  947. 127.62 s > Location:
  948. 127.62 s > crates/clinnet/src/lib.rs:741:13
  949. 127.62 s > stack backtrace:
  950. 127.62 s > 0: __rustc::rust_begin_unwind
  951. 127.62 s > 1: core::panicking::panic_fmt
  952. 127.62 s > 2: core::result::unwrap_failed
  953. 127.62 s > 3: public_typst_behavior::render
  954. 127.62 s > 4: <std::sync::once::Once>::call_once_force::<<std::sync::once_lock::OnceLock<alloc::string::String>>::initialize<<std::sync::once_lock::OnceLock<alloc::string::String>>::get_or_init<public_typst_behavior::linnest_public_svg::{closure#0}>::{closure#0}, !>::{closure#0}>::{closure#0}
  955. 127.62 s > 5: <std::sys::sync::once::futex::Once>::call
  956. 127.62 s > 6: <std::sync::once_lock::OnceLock<alloc::string::String>>::initialize::<<std::sync::once_lock::OnceLock<alloc::string::String>>::get_or_init<public_typst_behavior::linnest_public_svg::{closure#0}>::{closure#0}, !>
  957. 127.62 s > 7: <public_typst_behavior::public_linnest_fixture_assertions_hold::{closure#0} as core::ops::function::FnOnce<()>>::call_once
  958. 127.62 s > note: Some details are omitted, run with `RUST_BACKTRACE=full` for a verbose backtrace.
  959. 127.62 s > =========================================
  960. 127.62 s For full logs, run:
  961. 127.62 s nix log /nix/store/4pqspwvh8pi9s2vg9g6mfsggpl9ynwzx-gammaloop-nextest-clinnet.drv
  962. 127.84 s Run failed.