test packages.x86_64-linux.nix-ci-check-gammaloop-nextest-spenso

Reproduce this run
Original Run
  1. 0.00 s $ /nix/store/bhv6xyvqw6gjs3j488gi1z6wdv18bdpa-coreutils-9.11/bin/timeout --kill-after=15s 7200s /nix/store/bxgja2ppiqi6w2bgn0r07d7mgnl1k6k2-nix-2.34.8/bin/nix --extra-experimental-features nix-command --extra-experimental-features flakes flake clone git+https://github.com/alphal00p/gammaloop --dest /tmp/nix-ci-worker/stable-pwd/repo/
  2. 0.07 s Cloning into '/tmp/nix-ci-worker/stable-pwd/repo'...
  3. 0.78 s remote: Enumerating objects: 162082, done.
  4. 0.90 s remote: Counting objects: 0% (1/16760) remote: Counting objects: 1% (168/16760) remote: Counting objects: 2% (336/16760) remote: Counting objects: 3% (503/16760) remote: Counting objects: 4% (671/16760) remote: Counting objects: 5% (838/16760) remote: Counting objects: 6% (1006/16760) remote: Counting objects: 7% (1174/16760) remote: Counting objects: 8% (1341/16760) remote: Counting objects: 9% (1509/16760) remote: Counting objects: 10% (1676/16760) remote: Counting objects: 11% (1844/16760) remote: Counting objects: 12% (2012/16760) remote: Counting objects: 13% (2179/16760) remote: Counting objects: 14% (2347/16760) remote: Counting objects: 15% (2514/16760) remote: Counting objects: 16% (2682/16760) remote: Counting objects: 17% (2850/16760) remote: Counting objects: 18% (3017/16760) remote: Counting objects: 19% (3185/16760) remote: Counting objects: 20% (3352/16760) remote: Counting objects: 21% (3520/16760) remote: Counting objects: 22% (3688/16760) remote: Counting objects: 23% (3855/16760) remote: Counting objects: 24% (4023/16760) remote: Counting objects: 25% (4190/16760) remote: Counting objects: 26% (4358/16760) remote: Counting objects: 27% (4526/16760) remote: Counting objects: 28% (4693/16760) remote: Counting objects: 29% (4861/16760) remote: Counting objects: 30% (5028/16760) remote: Counting objects: 31% (5196/16760) remote: Counting objects: 32% (5364/16760) remote: Counting objects: 33% (5531/16760) remote: Counting objects: 34% (5699/16760) remote: Counting objects: 35% (5866/16760) remote: Counting objects: 36% (6034/16760) remote: Counting objects: 37% (6202/16760) remote: Counting objects: 38% (6369/16760) remote: Counting objects: 39% (6537/16760) remote: Counting objects: 40% (6704/16760) remote: Counting objects: 41% (6872/16760) remote: Counting objects: 42% (7040/16760) remote: Counting objects: 43% (7207/16760) remote: Counting objects: 44% (7375/16760) remote: Counting objects: 45% (7542/16760) remote: Counting objects: 46% (7710/16760) remote: Counting objects: 47% (7878/16760) remote: Counting objects: 48% (8045/16760) remote: Counting objects: 49% (8213/16760) remote: Counting objects: 50% (8380/16760) remote: Counting objects: 51% (8548/16760) remote: Counting objects: 52% (8716/16760) remote: Counting objects: 53% (8883/16760) remote: Counting objects: 54% (9051/16760) remote: Counting objects: 55% (9218/16760) remote: Counting objects: 56% (9386/16760) remote: Counting objects: 57% (9554/16760) remote: Counting objects: 58% (9721/16760) remote: Counting objects: 59% (9889/16760) remote: Counting objects: 60% (10056/16760) remote: Counting objects: 61% (10224/16760) remote: Counting objects: 62% (10392/16760) remote: Counting objects: 63% (10559/16760) remote: Counting objects: 64% (10727/16760) remote: Counting objects: 65% (10894/16760) remote: Counting objects: 66% (11062/16760) remote: Counting objects: 67% (11230/16760) remote: Counting objects: 68% (11397/16760) remote: Counting objects: 69% (11565/16760) remote: Counting objects: 70% (11732/16760) remote: Counting objects: 71% (11900/16760) remote: Counting objects: 72% (12068/16760) remote: Counting objects: 73% (12235/16760) remote: Counting objects: 74% (12403/16760) remote: Counting objects: 75% (12570/16760) remote: Counting objects: 76% (12738/16760) remote: Counting objects: 77% (12906/16760) remote: Counting objects: 78% (13073/16760) remote: Counting objects: 79% (13241/16760) remote: Counting objects: 80% (13408/16760) remote: Counting objects: 81% (13576/16760) remote: Counting objects: 82% (13744/16760) remote: Counting objects: 83% (13911/16760) remote: Counting objects: 84% (14079/16760) remote: Counting objects: 85% (14246/16760) remote: Counting objects: 86% (14414/16760) remote: Counting objects: 87% (14582/16760) remote: Counting objects: 88% (14749/16760) remote: Counting objects: 89% (14917/16760) remote: Counting objects: 90% (15084/16760) remote: Counting objects: 91% (15252/16760) remote: Counting objects: 92% (15420/16760) remote: Counting objects: 93% (15587/16760) remote: Counting objects: 94% (15755/16760) remote: Counting objects: 95% (15922/16760) remote: Counting objects: 96% (16090/16760) remote: Counting objects: 97% (16258/16760) remote: Counting objects: 98% (16425/16760) remote: Counting objects: 99% (16593/16760) remote: Counting objects: 100% (16760/16760) remote: Counting objects: 100% (16760/16760), done.
  5. 6.60 s remote: Compressing objects: 0% (1/3833) remote: Compressing objects: 1% (39/3833) remote: Compressing objects: 2% (77/3833) remote: Compressing objects: 3% (115/3833) remote: Compressing objects: 4% (154/3833) remote: Compressing objects: 5% (192/3833) remote: Compressing objects: 6% (230/3833) remote: Compressing objects: 7% (269/3833) remote: Compressing objects: 8% (307/3833) remote: Compressing objects: 9% (345/3833) remote: Compressing objects: 10% (384/3833) remote: Compressing objects: 11% (422/3833) remote: Compressing objects: 12% (460/3833) remote: Compressing objects: 12% (471/3833) remote: Compressing objects: 13% (499/3833) remote: Compressing objects: 14% (537/3833) remote: Compressing objects: 14% (540/3833) remote: Compressing objects: 15% (575/3833) remote: Compressing objects: 16% (614/3833) remote: Compressing objects: 16% (633/3833) remote: Compressing objects: 17% (652/3833) remote: Compressing objects: 18% (690/3833) remote: Compressing objects: 19% (729/3833) remote: Compressing objects: 20% (767/3833) remote: Compressing objects: 20% (769/3833) remote: Compressing objects: 21% (805/3833) remote: Compressing objects: 22% (844/3833) remote: Compressing objects: 23% (882/3833) remote: Compressing objects: 24% (920/3833) remote: Compressing objects: 25% (959/3833) remote: Compressing objects: 26% (997/3833) remote: Compressing objects: 26% (999/3833) remote: Compressing objects: 27% (1035/3833) remote: Compressing objects: 28% (1074/3833) remote: Compressing objects: 29% (1112/3833) remote: Compressing objects: 30% (1150/3833) remote: Compressing objects: 31% (1189/3833) remote: Compressing objects: 32% (1227/3833) remote: Compressing objects: 33% (1265/3833) remote: Compressing objects: 34% (1304/3833) remote: Compressing objects: 35% (1342/3833) remote: Compressing objects: 36% (1380/3833) remote: Compressing objects: 37% (1419/3833) remote: Compressing objects: 38% (1457/3833) remote: Compressing objects: 39% (1495/3833) remote: Compressing objects: 40% (1534/3833) remote: Compressing objects: 41% (1572/3833) remote: Compressing objects: 42% (1610/3833) remote: Compressing objects: 43% (1649/3833) remote: Compressing objects: 44% (1687/3833) remote: Compressing objects: 45% (1725/3833) remote: Compressing objects: 46% (1764/3833) remote: Compressing objects: 47% (1802/3833) remote: Compressing objects: 48% (1840/3833) remote: Compressing objects: 49% (1879/3833) remote: Compressing objects: 50% (1917/3833) remote: Compressing objects: 51% (1955/3833) remote: Compressing objects: 52% (1994/3833) remote: Compressing objects: 53% (2032/3833) remote: Compressing objects: 54% (2070/3833) remote: Compressing objects: 55% (2109/3833) remote: Compressing objects: 56% (2147/3833) remote: Compressing objects: 57% (2185/3833) remote: Compressing objects: 58% (2224/3833) remote: Compressing objects: 59% (2262/3833) remote: Compressing objects: 60% (2300/3833) remote: Compressing objects: 61% (2339/3833) remote: Compressing objects: 62% (2377/3833) remote: Compressing objects: 63% (2415/3833) remote: Compressing objects: 64% (2454/3833) remote: Compressing objects: 65% (2492/3833) remote: Compressing objects: 66% (2530/3833) remote: Compressing objects: 67% (2569/3833) remote: Compressing objects: 68% (2607/3833) remote: Compressing objects: 69% (2645/3833) remote: Compressing objects: 70% (2684/3833) remote: Compressing objects: 71% (2722/3833) remote: Compressing objects: 72% (2760/3833) remote: Compressing objects: 73% (2799/3833) remote: Compressing objects: 74% (2837/3833) remote: Compressing objects: 75% (2875/3833) remote: Compressing objects: 76% (2914/3833) remote: Compressing objects: 77% (2952/3833) remote: Compressing objects: 78% (2990/3833) remote: Compressing objects: 79% (3029/3833) remote: Compressing objects: 80% (3067/3833) remote: Compressing objects: 81% (3105/3833) remote: Compressing objects: 82% (3144/3833) remote: Compressing objects: 83% (3182/3833) remote: Compressing objects: 84% (3220/3833) remote: Compressing objects: 85% (3259/3833) remote: Compressing objects: 86% (3297/3833) remote: Compressing objects: 87% (3335/3833) remote: Compressing objects: 88% (3374/3833) remote: Compressing objects: 89% (3412/3833) remote: Compressing objects: 90% (3450/3833) remote: Compressing objects: 91% (3489/3833) remote: Compressing objects: 92% (3527/3833) remote: Compressing objects: 93% (3565/3833) remote: Compressing objects: 94% (3604/3833) remote: Compressing objects: 95% (3642/3833) remote: Compressing objects: 96% (3680/3833) remote: Compressing objects: 97% (3719/3833) remote: Compressing objects: 98% (3757/3833) remote: Compressing objects: 99% (3795/3833) remote: Compressing objects: 100% (3833/3833) remote: Compressing objects: 100% (3833/3833), done.
  6. 21.93 s Receiving objects: 0% (1/162082) Receiving objects: 1% (1621/162082) Receiving objects: 2% (3242/162082) Receiving objects: 3% (4863/162082), 16.79 MiB | 33.57 MiB/s Receiving objects: 4% (6484/162082), 16.79 MiB | 33.57 MiB/s Receiving objects: 5% (8105/162082), 16.79 MiB | 33.57 MiB/s Receiving objects: 5% (8419/162082), 34.48 MiB | 34.47 MiB/s Receiving objects: 6% (9725/162082), 34.48 MiB | 34.47 MiB/s Receiving objects: 7% (11346/162082), 34.48 MiB | 34.47 MiB/s Receiving objects: 7% (12548/162082), 66.70 MiB | 32.72 MiB/s Receiving objects: 8% (12967/162082), 66.70 MiB | 32.72 MiB/s Receiving objects: 9% (14588/162082), 66.70 MiB | 32.72 MiB/s Receiving objects: 10% (16209/162082), 66.70 MiB | 32.72 MiB/s Receiving objects: 11% (17830/162082), 66.70 MiB | 32.72 MiB/s Receiving objects: 12% (19450/162082), 66.70 MiB | 32.72 MiB/s Receiving objects: 13% (21071/162082), 82.99 MiB | 32.70 MiB/s Receiving objects: 14% (22692/162082), 82.99 MiB | 32.70 MiB/s Receiving objects: 15% (24313/162082), 82.99 MiB | 32.70 MiB/s Receiving objects: 16% (25934/162082), 82.99 MiB | 32.70 MiB/s Receiving objects: 17% (27554/162082), 82.99 MiB | 32.70 MiB/s Receiving objects: 18% (29175/162082), 82.99 MiB | 32.70 MiB/s Receiving objects: 19% (30796/162082), 82.99 MiB | 32.70 MiB/s Receiving objects: 20% (32417/162082), 82.99 MiB | 32.70 MiB/s Receiving objects: 21% (34038/162082), 82.99 MiB | 32.70 MiB/s Receiving objects: 22% (35659/162082), 82.99 MiB | 32.70 MiB/s Receiving objects: 23% (37279/162082), 82.99 MiB | 32.70 MiB/s Receiving objects: 24% (38900/162082), 82.99 MiB | 32.70 MiB/s Receiving objects: 25% (40521/162082), 82.99 MiB | 32.70 MiB/s Receiving objects: 26% (42142/162082), 82.99 MiB | 32.70 MiB/s Receiving objects: 27% (43763/162082), 82.99 MiB | 32.70 MiB/s Receiving objects: 28% (45383/162082), 82.99 MiB | 32.70 MiB/s Receiving objects: 28% (45439/162082), 82.99 MiB | 32.70 MiB/s Receiving objects: 29% (47004/162082), 100.14 MiB | 32.96 MiB/s Receiving objects: 30% (48625/162082), 100.14 MiB | 32.96 MiB/s Receiving objects: 31% (50246/162082), 100.14 MiB | 32.96 MiB/s Receiving objects: 32% (51867/162082), 100.14 MiB | 32.96 MiB/s Receiving objects: 33% (53488/162082), 100.14 MiB | 32.96 MiB/s Receiving objects: 34% (55108/162082), 100.14 MiB | 32.96 MiB/s Receiving objects: 35% (56729/162082), 116.58 MiB | 32.79 MiB/s Receiving objects: 36% (58350/162082), 116.58 MiB | 32.79 MiB/s Receiving objects: 37% (59971/162082), 116.58 MiB | 32.79 MiB/s Receiving objects: 37% (60791/162082), 116.58 MiB | 32.79 MiB/s Receiving objects: 38% (61592/162082), 132.96 MiB | 32.56 MiB/s Receiving objects: 39% (63212/162082), 132.96 MiB | 32.56 MiB/s Receiving objects: 40% (64833/162082), 132.96 MiB | 32.56 MiB/s Receiving objects: 41% (66454/162082), 132.96 MiB | 32.56 MiB/s Receiving objects: 42% (68075/162082), 132.96 MiB | 32.56 MiB/s Receiving objects: 42% (68211/162082), 150.43 MiB | 32.82 MiB/s Receiving objects: 43% (69696/162082), 166.03 MiB | 32.56 MiB/s Receiving objects: 44% (71317/162082), 166.03 MiB | 32.56 MiB/s Receiving objects: 45% (72937/162082), 166.03 MiB | 32.56 MiB/s Receiving objects: 46% (74558/162082), 166.03 MiB | 32.56 MiB/s Receiving objects: 47% (76179/162082), 183.20 MiB | 32.34 MiB/s Receiving objects: 48% (77800/162082), 183.20 MiB | 32.34 MiB/s Receiving objects: 49% (79421/162082), 183.20 MiB | 32.34 MiB/s Receiving objects: 50% (81041/162082), 183.20 MiB | 32.34 MiB/s Receiving objects: 51% (82662/162082), 183.20 MiB | 32.34 MiB/s Receiving objects: 52% (84283/162082), 183.20 MiB | 32.34 MiB/s Receiving objects: 52% (85478/162082), 183.20 MiB | 32.34 MiB/s Receiving objects: 53% (85904/162082), 183.20 MiB | 32.34 MiB/s Receiving objects: 54% (87525/162082), 199.39 MiB | 32.29 MiB/s Receiving objects: 55% (89146/162082), 199.39 MiB | 32.29 MiB/s Receiving objects: 55% (89797/162082), 216.59 MiB | 32.67 MiB/s Receiving objects: 56% (90766/162082), 250.18 MiB | 32.59 MiB/s Receiving objects: 56% (91539/162082), 250.18 MiB | 32.59 MiB/s Receiving objects: 57% (92387/162082), 250.18 MiB | 32.59 MiB/s Receiving objects: 58% (94008/162082), 266.57 MiB | 32.51 MiB/s Receiving objects: 59% (95629/162082), 266.57 MiB | 32.51 MiB/s Receiving objects: 60% (97250/162082), 283.17 MiB | 32.75 MiB/s Receiving objects: 60% (98759/162082), 283.17 MiB | 32.75 MiB/s Receiving objects: 61% (98871/162082), 283.17 MiB | 32.75 MiB/s Receiving objects: 62% (100491/162082), 300.79 MiB | 32.78 MiB/s Receiving objects: 63% (102112/162082), 300.79 MiB | 32.78 MiB/s Receiving objects: 64% (103733/162082), 317.00 MiB | 32.80 MiB/s Receiving objects: 65% (105354/162082), 317.00 MiB | 32.80 MiB/s Receiving objects: 65% (105866/162082), 317.00 MiB | 32.80 MiB/s Receiving objects: 66% (106975/162082), 317.00 MiB | 32.80 MiB/s Receiving objects: 67% (108595/162082), 317.00 MiB | 32.80 MiB/s Receiving objects: 68% (110216/162082), 317.00 MiB | 32.80 MiB/s Receiving objects: 69% (111837/162082), 317.00 MiB | 32.80 MiB/s Receiving objects: 70% (113458/162082), 317.00 MiB | 32.80 MiB/s Receiving objects: 71% (115079/162082), 317.00 MiB | 32.80 MiB/s Receiving objects: 72% (116700/162082), 317.00 MiB | 32.80 MiB/s Receiving objects: 73% (118320/162082), 333.64 MiB | 32.60 MiB/s Receiving objects: 74% (119941/162082), 333.64 MiB | 32.60 MiB/s Receiving objects: 75% (121562/162082), 333.64 MiB | 32.60 MiB/s Receiving objects: 76% (123183/162082), 350.29 MiB | 32.90 MiB/s Receiving objects: 76% (124501/162082), 350.29 MiB | 32.90 MiB/s Receiving objects: 77% (124804/162082), 350.29 MiB | 32.90 MiB/s Receiving objects: 78% (126424/162082), 367.66 MiB | 32.94 MiB/s Receiving objects: 79% (128045/162082), 367.66 MiB | 32.94 MiB/s Receiving objects: 80% (129666/162082), 367.66 MiB | 32.94 MiB/s Receiving objects: 81% (131287/162082), 367.66 MiB | 32.94 MiB/s Receiving objects: 81% (131980/162082), 384.13 MiB | 32.55 MiB/s Receiving objects: 82% (132908/162082), 400.64 MiB | 32.61 MiB/s Receiving objects: 83% (134529/162082), 417.29 MiB | 32.86 MiB/s Receiving objects: 83% (135719/162082), 417.29 MiB | 32.86 MiB/s Receiving objects: 84% (136149/162082), 417.29 MiB | 32.86 MiB/s Receiving objects: 85% (137770/162082), 434.20 MiB | 32.93 MiB/s Receiving objects: 86% (139391/162082), 434.20 MiB | 32.93 MiB/s Receiving objects: 86% (140280/162082), 450.64 MiB | 32.56 MiB/s Receiving objects: 87% (141012/162082), 450.64 MiB | 32.56 MiB/s Receiving objects: 88% (142633/162082), 467.96 MiB | 32.72 MiB/s Receiving objects: 89% (144253/162082), 467.96 MiB | 32.72 MiB/s Receiving objects: 90% (145874/162082), 467.96 MiB | 32.72 MiB/s Receiving objects: 91% (147495/162082), 467.96 MiB | 32.72 MiB/s Receiving objects: 92% (149116/162082), 467.96 MiB | 32.72 MiB/s Receiving objects: 93% (150737/162082), 467.96 MiB | 32.72 MiB/s Receiving objects: 94% (152358/162082), 467.96 MiB | 32.72 MiB/s Receiving objects: 95% (153978/162082), 467.96 MiB | 32.72 MiB/s Receiving objects: 96% (155599/162082), 484.48 MiB | 32.88 MiB/s Receiving objects: 97% (157220/162082), 484.48 MiB | 32.88 MiB/s Receiving objects: 98% (158841/162082), 484.48 MiB | 32.88 MiB/s Receiving objects: 98% (159473/162082), 484.48 MiB | 32.88 MiB/s Receiving objects: 99% (160462/162082), 484.48 MiB | 32.88 MiB/s remote: Total 162082 (delta 14164), reused 13398 (delta 12909), pack-reused 145322 (from 3)
  7. 21.93 s Receiving objects: 100% (162082/162082), 500.46 MiB | 32.70 MiB/s Receiving objects: 100% (162082/162082), 500.71 MiB | 32.68 MiB/s, done.
  8. 24.04 s Resolving deltas: 0% (0/105802) Resolving deltas: 1% (1059/105802) Resolving deltas: 2% (2117/105802) Resolving deltas: 3% (3175/105802) Resolving deltas: 4% (4233/105802) Resolving deltas: 5% (5291/105802) Resolving deltas: 6% (6349/105802) Resolving deltas: 7% (7407/105802) Resolving deltas: 8% (8465/105802) Resolving deltas: 9% (9524/105802) Resolving deltas: 10% (10581/105802) Resolving deltas: 11% (11639/105802) Resolving deltas: 12% (12697/105802) Resolving deltas: 13% (13756/105802) Resolving deltas: 14% (14813/105802) Resolving deltas: 15% (15871/105802) Resolving deltas: 16% (16929/105802) Resolving deltas: 17% (17987/105802) Resolving deltas: 18% (19046/105802) Resolving deltas: 19% (20103/105802) Resolving deltas: 20% (21161/105802) Resolving deltas: 21% (22219/105802) Resolving deltas: 22% (23277/105802) Resolving deltas: 23% (24335/105802) Resolving deltas: 24% (25393/105802) Resolving deltas: 25% (26451/105802) Resolving deltas: 26% (27509/105802) Resolving deltas: 27% (28567/105802) Resolving deltas: 28% (29626/105802) Resolving deltas: 29% (30683/105802) Resolving deltas: 30% (31741/105802) Resolving deltas: 31% (32799/105802) Resolving deltas: 32% (33857/105802) Resolving deltas: 33% (34915/105802) Resolving deltas: 34% (35973/105802) Resolving deltas: 35% (37031/105802) Resolving deltas: 36% (38089/105802) Resolving deltas: 37% (39148/105802) Resolving deltas: 38% (40205/105802) Resolving deltas: 39% (41263/105802) Resolving deltas: 40% (42321/105802) Resolving deltas: 41% (43379/105802) Resolving deltas: 42% (44437/105802) Resolving deltas: 43% (45495/105802) Resolving deltas: 44% (46553/105802) Resolving deltas: 45% (47611/105802) Resolving deltas: 46% (48669/105802) Resolving deltas: 47% (49727/105802) Resolving deltas: 48% (50785/105802) Resolving deltas: 49% (51844/105802) Resolving deltas: 50% (52901/105802) Resolving deltas: 51% (53960/105802) Resolving deltas: 52% (55018/105802) Resolving deltas: 53% (56076/105802) Resolving deltas: 53% (56154/105802) Resolving deltas: 54% (57134/105802) Resolving deltas: 55% (58192/105802) Resolving deltas: 56% (59250/105802) Resolving deltas: 57% (60308/105802) Resolving deltas: 58% (61366/105802) Resolving deltas: 59% (62424/105802) Resolving deltas: 60% (63482/105802) Resolving deltas: 61% (64540/105802) Resolving deltas: 62% (65600/105802) Resolving deltas: 63% (66656/105802) Resolving deltas: 64% (67714/105802) Resolving deltas: 65% (68772/105802) Resolving deltas: 66% (69832/105802) Resolving deltas: 67% (70888/105802) Resolving deltas: 68% (71946/105802) Resolving deltas: 69% (73004/105802) Resolving deltas: 70% (74062/105802) Resolving deltas: 71% (75120/105802) Resolving deltas: 72% (76178/105802) Resolving deltas: 73% (77236/105802) Resolving deltas: 74% (78294/105802) Resolving deltas: 75% (79352/105802) Resolving deltas: 76% (80410/105802) Resolving deltas: 77% (81468/105802) Resolving deltas: 78% (82526/105802) Resolving deltas: 79% (83588/105802) Resolving deltas: 80% (84642/105802) Resolving deltas: 81% (85700/105802) Resolving deltas: 82% (86760/105802) Resolving deltas: 83% (87816/105802) Resolving deltas: 84% (88874/105802) Resolving deltas: 85% (89932/105802) Resolving deltas: 86% (90990/105802) Resolving deltas: 87% (92048/105802) Resolving deltas: 88% (93106/105802) Resolving deltas: 89% (94164/105802) Resolving deltas: 90% (95222/105802) Resolving deltas: 91% (96281/105802) Resolving deltas: 92% (97338/105802) Resolving deltas: 93% (98396/105802) Resolving deltas: 94% (99455/105802) Resolving deltas: 95% (100513/105802) Resolving deltas: 95% (101004/105802) Resolving deltas: 96% (101571/105802) Resolving deltas: 97% (102628/105802) Resolving deltas: 98% (103686/105802) Resolving deltas: 99% (104744/105802) Resolving deltas: 100% (105802/105802) Resolving deltas: 100% (105802/105802), done.
  9. 24.73 s Fetching commit 8959f063dd3a21d9dfa4be72260815fa7c625bde for feynkit ...
  10. 24.73 s $ /nix/store/b1wn5clix1mz4vpfih7x9cnj9qfh7c6h-git-2.54.0/bin/git fetch origin 8959f063dd3a21d9dfa4be72260815fa7c625bde
  11. 25.10 s From https://github.com/alphal00p/gammaloop
  12. 25.10 s * branch 8959f063dd3a21d9dfa4be72260815fa7c625bde -> FETCH_HEAD
  13. 25.11 s $ /nix/store/bhv6xyvqw6gjs3j488gi1z6wdv18bdpa-coreutils-9.11/bin/timeout --kill-after=15s 7200s /nix/store/b1wn5clix1mz4vpfih7x9cnj9qfh7c6h-git-2.54.0/bin/git -c advice.detachedHead=false checkout 8959f063dd3a21d9dfa4be72260815fa7c625bde
  14. 25.52 s HEAD is now at 8959f063d record indexed tensor qualification and remaining performance limits
  15. 25.53 s $ /nix/store/bhv6xyvqw6gjs3j488gi1z6wdv18bdpa-coreutils-9.11/bin/timeout --kill-after=15s 7200s /nix/store/bxgja2ppiqi6w2bgn0r07d7mgnl1k6k2-nix-2.34.8/bin/nix --extra-experimental-features nix-command --extra-experimental-features flakes --log-format internal-json run .#packages.x86_64-linux.nix-ci-check-gammaloop-nextest-spenso --print-build-logs
  16. 25.69 s warning: ignoring untrusted flake configuration setting 'extra-substituters'.
  17. 25.69 s Pass '--accept-flake-config' to trust it
  18. 25.69 s warning: ignoring untrusted flake configuration setting 'extra-trusted-public-keys'.
  19. 25.69 s Pass '--accept-flake-config' to trust it
  20. 37.57 s
  21. 37.83 s evaluating derivation 'gdo you want to allow configuration setting 'extra-substituters' to be set to 'https://cache.nix-ci.com' (y/N)? do you want to permanently mark this value as untrusted (y/N)? warning: ignoring untrusted flake configuration setting 'extra-substituters'.
  22. 37.83 s Pass '--accept-flake-config' to trust it
  23. 37.83 s do you want to allow configuration setting 'extra-trusted-public-keys' to be set to 'nix-ci:g3xV5BDTLtIBZr/A00IU1x0EtKKlb7YLgBN2SgYgM6A=' (y/N)? do you want to permanently mark this value as untrusted (y/N)? warning: ignoring untrusted flake configuration setting 'extra-trusted-public-keys'.
  24. 37.83 s Pass '--accept-flake-config' to trust it
  25. 50.36 s copying '/nix/store/vrm9 evaluating derivation 'g copying '/nix/store/vrm9 evaluating derivation 'g copying '/nix/store/vrm9 evaluating derivation 'g copying '/nix/store/vrm9 evaluating derivation 'g copying '/nix/store/vrm9 evaluating derivation 'g copying '/nix/store/vrm9 evaluating derivation 'g copying '/nix/store/vrm9 evaluating derivation 'g copying '/nix/store/vrm9 evaluating derivation 'g copying '/nix/store/vrm9 evaluating derivation 'g copying '/nix/store/vrm9 evaluating derivation 'g copying '/nix/store/vrm9 evaluating derivation 'g copying '/nix/store/vrm9 evaluating derivation 'g copying '/nix/store/vrm9 evaluating derivation 'g copying '/nix/store/vrm9 evaluating derivation 'g copying '/nix/store/vrm9 evaluating derivation 'g copying '/nix/store/vrm9 evaluating derivation 'g copying '/nix/store/vrm9 evaluating derivation 'g copying '/nix/store/vrm9 evaluating derivation 'g copying '/nix/store/vrm9 evaluating derivation 'g copying '/nix/store/vrm9 evaluating derivation 'g copying '/nix/store/vrm9 evaluating derivation 'g copying '/nix/store/vrm9 evaluating derivation 'g copying '/nix/store/vrm9 evaluating derivation 'g copying '/nix/store/vrm9 evaluating derivation 'g copying '/nix/store/vrm9 evaluating derivation 'g copying '/nix/store/vrm9 evaluating derivation 'g copying '/nix/store/vrm9 evaluating derivation 'g copying '/nix/store/vrm9 evaluating derivation 'g copying '/nix/store/vrm9 evaluating derivation 'g copying '/nix/store/vrm9 evaluating derivation 'g copying '/nix/store/vrm9 evaluating derivation 'g copying '/nix/store/vrm9 evaluating derivation 'g copying '/nix/store/vrm9 evaluating derivation 'g copying '/nix/store/vrm9 evaluating derivation 'g copying '/nix/store/vrm9 evaluating derivation 'g copying '/nix/store/vrm9 evaluating derivation 'g copying '/nix/store/vrm9 evaluating derivation 'g copying '/nix/store/vrm9 evaluating derivation 'g [0/1 built] [1/0/1 built] building ggammaloop-nextest-spenso> Nextest worker budget: 16
  26. 50.38 s gammaloop-nextest-spenso> Extracting 6 binaries (including 1 non-test binary) and 2 linked paths to /build/source
  27. 50.67 s gammaloop-nextest-spenso> Extracted 21 files to /build/source in 0.29s
  28. 50.69 s gammaloop-nextest-spenso> ------------
  29. 50.69 s gammaloop-nextest-spenso> Nextest run ID 9e584650-ec8f-471e-87bb-2e335a5b9fe3 with nextest profile: ci_gammaloop
  30. 50.69 s gammaloop-nextest-spenso> Starting 1068 tests across 5 binaries (24 tests skipped, including 2 tests via profile.default.default-filter)
  31. 77.57 s gammaloop-nextest-spenso> ------------
  32. 77.57 s gammaloop-nextest-spenso> Summary [ 26.884s] 1068 tests run: 1068 passed, 24 skipped
  33. 77.62 s gammaloop-nextest-spenso>
  34. 77.62 s gammaloop-nextest-spenso> ========== nextest test summary ==========
  35. 77.62 s gammaloop-nextest-spenso> report: target/nextest/ci_gammaloop/junit.xml
  36. 77.62 s gammaloop-nextest-spenso> tests: 1068, failures: 0, errors: 0
  37. 77.62 s gammaloop-nextest-spenso> No failing testcases found.
  38. 77.62 s gammaloop-nextest-spenso> =========================================
  39. 77.64 s gammaloop-nextest-spenso> Extracting 4 binaries (including 1 non-test binary) and 2 linked paths to /build/source
  40. 77.81 s gammaloop-nextest-spenso> Extracted 19 files to /build/source in 0.17s
  41. 77.83 s gammaloop-nextest-spenso> ------------
  42. 77.83 s gammaloop-nextest-spenso> Nextest run ID f1adcbf1-6c6b-4332-90f7-3e218a41e96a with nextest profile: ci_gammaloop
  43. 77.83 s gammaloop-nextest-spenso> Starting 393 tests across 3 binaries
  44. 79.21 s gammaloop-nextest-spenso> ------------
  45. 79.21 s gammaloop-nextest-spenso> Summary [ 1.380s] 393 tests run: 393 passed, 0 skipped
  46. 79.25 s gammaloop-nextest-spenso>
  47. 79.25 s gammaloop-nextest-spenso> ========== nextest test summary ==========
  48. 79.25 s gammaloop-nextest-spenso> report: target/nextest/ci_gammaloop/junit.xml
  49. 79.25 s gammaloop-nextest-spenso> tests: 393, failures: 0, errors: 0
  50. 79.25 s gammaloop-nextest-spenso> No failing testcases found.
  51. 79.25 s gammaloop-nextest-spenso> =========================================
  52. 79.27 s gammaloop-nextest-spenso> Extracting 11 binaries (including 1 non-test binary) and 2 linked paths to /build/source
  53. 79.96 s gammaloop-nextest-spenso> Extracted 26 files to /build/source in 0.69s
  54. 79.98 s gammaloop-nextest-spenso> ------------
  55. 79.98 s gammaloop-nextest-spenso> Nextest run ID 00f2e9a5-fd44-49c7-9524-2a44affbe4e7 with nextest profile: ci_gammaloop
  56. 79.98 s gammaloop-nextest-spenso> Starting 134 tests across 10 binaries (2 tests skipped)
  57. 116.93 s gammaloop-nextest-spenso> ------------
  58. 116.93 s gammaloop-nextest-spenso> Summary [ 36.950s] 134 tests run: 134 passed, 2 skipped
  59. 116.97 s gammaloop-nextest-spenso>
  60. 116.97 s gammaloop-nextest-spenso> ========== nextest test summary ==========
  61. 116.97 s gammaloop-nextest-spenso> report: target/nextest/ci_gammaloop/junit.xml
  62. 116.97 s gammaloop-nextest-spenso> tests: 134, failures: 0, errors: 0
  63. 116.97 s gammaloop-nextest-spenso> No failing testcases found.
  64. 116.97 s gammaloop-nextest-spenso> =========================================
  65. 116.98 s gammaloop-nextest-spenso> Extracting 2 binaries to /build/source
  66. 117.02 s gammaloop-nextest-spenso> Extracted 5 files to /build/source in 0.04s
  67. 117.03 s gammaloop-nextest-spenso> ------------
  68. 117.03 s gammaloop-nextest-spenso> Nextest run ID 5d04194b-14ab-4626-814c-4293b126445b with nextest profile: ci_gammaloop
  69. 117.03 s gammaloop-nextest-spenso> Starting 2 tests across 2 binaries
  70. 117.03 s gammaloop-nextest-spenso> ------------
  71. 117.03 s gammaloop-nextest-spenso> Summary [ 0.004s] 2 tests run: 2 passed, 0 skipped
  72. 117.07 s gammaloop-nextest-spenso>
  73. 117.07 s gammaloop-nextest-spenso> ========== nextest test summary ==========
  74. 117.07 s gammaloop-nextest-spenso> report: target/nextest/ci_gammaloop/junit.xml
  75. 117.07 s gammaloop-nextest-spenso> tests: 2, failures: 0, errors: 0
  76. 117.07 s gammaloop-nextest-spenso> No failing testcases found.
  77. 117.07 s gammaloop-nextest-spenso> =========================================
  78. 117.08 s gammaloop-nextest-spenso> Extracting 7 binaries (including 3 non-test binaries), 1 build script output directory, and 3 linked paths to /build/source
  79. 117.96 s gammaloop-nextest-spenso> Extracted 27 files to /build/source in 0.87s
  80. 117.97 s gammaloop-nextest-spenso> ------------
  81. 117.97 s gammaloop-nextest-spenso> Nextest run ID 7a68b861-3977-42b5-bb06-c2c9a1b02805 with nextest profile: ci_gammaloop
  82. 117.97 s gammaloop-nextest-spenso> Starting 146 tests across 4 binaries
  83. 118.17 s gammaloop-nextest-spenso> FAIL [ 0.021s] (126/146) spynso3 tests::tensor_indexing_stubs_document_logical_order
  84. 118.17 s gammaloop-nextest-spenso> stdout ---
  85. 118.17 s gammaloop-nextest-spenso>
  86. 118.17 s gammaloop-nextest-spenso> running 1 test
  87. 118.17 s gammaloop-nextest-spenso> test tests::tensor_indexing_stubs_document_logical_order ... FAILED
  88. 118.17 s gammaloop-nextest-spenso>
  89. 118.17 s gammaloop-nextest-spenso> failures:
  90. 118.17 s gammaloop-nextest-spenso>
  91. 118.17 s gammaloop-nextest-spenso> failures:
  92. 118.17 s gammaloop-nextest-spenso> tests::tensor_indexing_stubs_document_logical_order
  93. 118.17 s gammaloop-nextest-spenso>
  94. 118.17 s gammaloop-nextest-spenso> test result: FAILED. 0 passed; 1 failed; 0 ignored; 0 measured; 134 filtered out; finished in 0.01s
  95. 118.17 s gammaloop-nextest-spenso>
  96. 118.17 s gammaloop-nextest-spenso> stderr ---
  97. 118.17 s gammaloop-nextest-spenso>
  98. 118.17 s gammaloop-nextest-spenso> thread 'tests::tensor_indexing_stubs_document_logical_order' (5855) panicked at crates/spynso3/src/lib.rs:2334:9:
  99. 118.17 s gammaloop-nextest-spenso> assertion failed: getitem.iter().all(|method|
  100. 118.17 s gammaloop-nextest-spenso> {
  101. 118.17 s gammaloop-nextest-spenso> method.doc.contains("logical row-major") &&
  102. 118.17 s gammaloop-nextest-spenso> method.doc.contains("canonical storage-axis order is not exposed")
  103. 118.17 s gammaloop-nextest-spenso> })
  104. 118.17 s gammaloop-nextest-spenso> stack backtrace:
  105. 118.17 s gammaloop-nextest-spenso> 0: __rustc::rust_begin_unwind
  106. 118.17 s gammaloop-nextest-spenso> 1: core::panicking::panic_fmt
  107. 118.17 s gammaloop-nextest-spenso> 2: core::panicking::panic
  108. 118.17 s gammaloop-nextest-spenso> 3: spynso3::tests::tensor_indexing_stubs_document_logical_order
  109. 118.17 s gammaloop-nextest-spenso> 4: <spynso3::tests::tensor_indexing_stubs_document_logical_order::{closure#0} as core::ops::function::FnOnce<()>>::call_once
  110. 118.17 s gammaloop-nextest-spenso> note: Some details are omitted, run with `RUST_BACKTRACE=full` for a verbose backtrace.
  111. 118.17 s gammaloop-nextest-spenso>
  112. 118.22 s gammaloop-nextest-spenso> ------------
  113. 118.22 s gammaloop-nextest-spenso> Summary [ 0.250s] 146 tests run: 145 passed, 1 failed, 0 skipped
  114. 118.22 s gammaloop-nextest-spenso> FAIL [ 0.021s] (126/146) spynso3 tests::tensor_indexing_stubs_document_logical_order
  115. 118.22 s gammaloop-nextest-spenso> stdout ---
  116. 118.22 s gammaloop-nextest-spenso>
  117. 118.22 s gammaloop-nextest-spenso> running 1 test
  118. 118.22 s gammaloop-nextest-spenso> test tests::tensor_indexing_stubs_document_logical_order ... FAILED
  119. 118.22 s gammaloop-nextest-spenso>
  120. 118.22 s gammaloop-nextest-spenso> failures:
  121. 118.22 s gammaloop-nextest-spenso>
  122. 118.22 s gammaloop-nextest-spenso> failures:
  123. 118.22 s gammaloop-nextest-spenso> tests::tensor_indexing_stubs_document_logical_order
  124. 118.22 s gammaloop-nextest-spenso>
  125. 118.22 s gammaloop-nextest-spenso> test result: FAILED. 0 passed; 1 failed; 0 ignored; 0 measured; 134 filtered out; finished in 0.01s
  126. 118.22 s gammaloop-nextest-spenso>
  127. 118.22 s gammaloop-nextest-spenso> stderr ---
  128. 118.22 s gammaloop-nextest-spenso>
  129. 118.22 s gammaloop-nextest-spenso> thread 'tests::tensor_indexing_stubs_document_logical_order' (5855) panicked at crates/spynso3/src/lib.rs:2334:9:
  130. 118.22 s gammaloop-nextest-spenso> assertion failed: getitem.iter().all(|method|
  131. 118.22 s gammaloop-nextest-spenso> {
  132. 118.22 s gammaloop-nextest-spenso> method.doc.contains("logical row-major") &&
  133. 118.23 s gammaloop-nextest-spenso> method.doc.contains("canonical storage-axis order is not exposed")
  134. 118.23 s gammaloop-nextest-spenso> })
  135. 118.23 s gammaloop-nextest-spenso> stack backtrace:
  136. 118.23 s gammaloop-nextest-spenso> 0: __rustc::rust_begin_unwind
  137. 118.23 s gammaloop-nextest-spenso> 1: core::panicking::panic_fmt
  138. 118.23 s gammaloop-nextest-spenso> 2: core::panicking::panic
  139. 118.23 s gammaloop-nextest-spenso> 3: spynso3::tests::tensor_indexing_stubs_document_logical_order
  140. 118.23 s gammaloop-nextest-spenso> 4: <spynso3::tests::tensor_indexing_stubs_document_logical_order::{closure#0} as core::ops::function::FnOnce<()>>::call_once
  141. 118.23 s gammaloop-nextest-spenso> note: Some details are omitted, run with `RUST_BACKTRACE=full` for a verbose backtrace.
  142. 118.23 s gammaloop-nextest-spenso>
  143. 118.23 s gammaloop-nextest-spenso> error: test run failed
  144. 118.26 s gammaloop-nextest-spenso>
  145. 118.26 s gammaloop-nextest-spenso> ========== nextest test summary ==========
  146. 118.26 s gammaloop-nextest-spenso> report: target/nextest/ci_gammaloop/junit.xml
  147. 118.26 s gammaloop-nextest-spenso> tests: 146, failures: 1, errors: 0
  148. 118.26 s gammaloop-nextest-spenso>
  149. 118.26 s gammaloop-nextest-spenso> 1. spynso3::tests::tensor_indexing_stubs_document_logical_order
  150. 118.26 s gammaloop-nextest-spenso> failure: test failure with exit code 101
  151. 118.26 s gammaloop-nextest-spenso> thread 'tests::tensor_indexing_stubs_document_logical_order' (5855) panicked at crates/spynso3/src/lib.rs:2334:9:
  152. 118.26 s gammaloop-nextest-spenso> assertion failed: getitem.iter().all(|method|
  153. 118.26 s gammaloop-nextest-spenso> {
  154. 118.26 s gammaloop-nextest-spenso> method.doc.contains("logical row-major") &&
  155. 118.26 s gammaloop-nextest-spenso> method.doc.contains("canonical storage-axis order is not exposed")
  156. 118.26 s gammaloop-nextest-spenso> })
  157. 118.26 s gammaloop-nextest-spenso> stack backtrace:
  158. 118.26 s gammaloop-nextest-spenso> 0: __rustc::rust_begin_unwind
  159. 118.26 s gammaloop-nextest-spenso> 1: core::panicking::panic_fmt
  160. 118.26 s gammaloop-nextest-spenso> 2: core::panicking::panic
  161. 118.26 s gammaloop-nextest-spenso> 3: spynso3::tests::tensor_indexing_stubs_document_logical_order
  162. 118.26 s gammaloop-nextest-spenso> 4: <spynso3::tests::tensor_indexing_stubs_document_logical_order::{closure#0} as core::ops::function::FnOnce<()>>::call_once
  163. 118.26 s gammaloop-nextest-spenso> note: Some details are omitted, run with `RUST_BACKTRACE=full` for a verbose backtrace.
  164. 118.26 s gammaloop-nextest-spenso> system-out
  165. 118.26 s gammaloop-nextest-spenso> running 1 test
  166. 118.26 s gammaloop-nextest-spenso> test tests::tensor_indexing_stubs_document_logical_order ... FAILED
  167. 118.26 s gammaloop-nextest-spenso>
  168. 118.26 s gammaloop-nextest-spenso> failures:
  169. 118.26 s gammaloop-nextest-spenso>
  170. 118.26 s gammaloop-nextest-spenso> failures:
  171. 118.26 s gammaloop-nextest-spenso> tests::tensor_indexing_stubs_document_logical_order
  172. 118.26 s gammaloop-nextest-spenso>
  173. 118.26 s gammaloop-nextest-spenso> test result: FAILED. 0 passed; 1 failed; 0 ignored; 0 measured; 134 filtered out; finished in 0.01s
  174. 118.26 s gammaloop-nextest-spenso> system-err
  175. 118.26 s gammaloop-nextest-spenso> thread 'tests::tensor_indexing_stubs_document_logical_order' (5855) panicked at crates/spynso3/src/lib.rs:2334:9:
  176. 118.26 s gammaloop-nextest-spenso> assertion failed: getitem.iter().all(|method|
  177. 118.26 s gammaloop-nextest-spenso> {
  178. 118.26 s gammaloop-nextest-spenso> method.doc.contains("logical row-major") &&
  179. 118.26 s gammaloop-nextest-spenso> method.doc.contains("canonical storage-axis order is not exposed")
  180. 118.26 s gammaloop-nextest-spenso> })
  181. 118.26 s gammaloop-nextest-spenso> stack backtrace:
  182. 118.26 s gammaloop-nextest-spenso> 0: __rustc::rust_begin_unwind
  183. 118.26 s gammaloop-nextest-spenso> 1: core::panicking::panic_fmt
  184. 118.26 s gammaloop-nextest-spenso> 2: core::panicking::panic
  185. 118.26 s gammaloop-nextest-spenso> 3: spynso3::tests::tensor_indexing_stubs_document_logical_order
  186. 118.26 s gammaloop-nextest-spenso> 4: <spynso3::tests::tensor_indexing_stubs_document_logical_order::{closure#0} as core::ops::function::FnOnce<()>>::call_once
  187. 118.26 s gammaloop-nextest-spenso> note: Some details are omitted, run with `RUST_BACKTRACE=full` for a verbose backtrace.
  188. 118.26 s gammaloop-nextest-spenso> =========================================
  189. 118.27 s gammaloop-nextest-spenso> Extracting 1 binary and 1 linked path to /build/source
  190. 118.36 s gammaloop-nextest-spenso> Extracted 7 files to /build/source in 0.09s
  191. 118.37 s gammaloop-nextest-spenso> ------------
  192. 118.37 s gammaloop-nextest-spenso> Nextest run ID fd7331ba-5cd1-4a08-97e5-d14fb93dd5ac with nextest profile: ci_gammaloop
  193. 118.37 s gammaloop-nextest-spenso> Starting 4 tests across 1 binary
  194. 118.38 s gammaloop-nextest-spenso> ------------
  195. 118.38 s gammaloop-nextest-spenso> Summary [ 0.006s] 4 tests run: 4 passed, 0 skipped
  196. 118.41 s gammaloop-nextest-spenso>
  197. 118.41 s gammaloop-nextest-spenso> ========== nextest test summary ==========
  198. 118.41 s gammaloop-nextest-spenso> report: target/nextest/ci_gammaloop/junit.xml
  199. 118.41 s gammaloop-nextest-spenso> tests: 4, failures: 0, errors: 0
  200. 118.41 s gammaloop-nextest-spenso> No failing testcases found.
  201. 118.41 s gammaloop-nextest-spenso> =========================================
  202. 118.42 s gammaloop-nextest-spenso> Extracting 1 binary to /build/source
  203. 118.46 s gammaloop-nextest-spenso> Extracted 4 files to /build/source in 0.04s
  204. 118.47 s gammaloop-nextest-spenso> ------------
  205. 118.47 s gammaloop-nextest-spenso> Nextest run ID 2ffb9aad-84b4-4974-a2be-dc5ad1743e51 with nextest profile: ci_gammaloop
  206. 118.47 s gammaloop-nextest-spenso> Starting 2 tests across 1 binary
  207. 118.48 s gammaloop-nextest-spenso> ------------
  208. 118.48 s gammaloop-nextest-spenso> Summary [ 0.005s] 2 tests run: 2 passed, 0 skipped
  209. 118.51 s gammaloop-nextest-spenso>
  210. 118.51 s gammaloop-nextest-spenso> ========== nextest test summary ==========
  211. 118.51 s gammaloop-nextest-spenso> report: target/nextest/ci_gammaloop/junit.xml
  212. 118.51 s gammaloop-nextest-spenso> tests: 2, failures: 0, errors: 0
  213. 118.51 s gammaloop-nextest-spenso> No failing testcases found.
  214. 118.51 s gammaloop-nextest-spenso> =========================================
  215. 118.77 s error: Cannot build '/nix/store/zc1jmsz4gf36w3nhmcyr3l14f2xqrbm4-gammaloop-nextest-spenso.drv'.
  216. 118.77 s Reason: builder failed with exit code 100.
  217. 118.77 s Output paths:
  218. 118.77 s /nix/store/vpyzqis4243vddrs7f05fqsc90rf7nf5-gammaloop-nextest-spenso
  219. 118.77 s Last 190 log lines:
  220. 118.77 s > Nextest worker budget: 16
  221. 118.77 s > Extracting 6 binaries (including 1 non-test binary) and 2 linked paths to /build/source
  222. 118.77 s > Extracted 21 files to /build/source in 0.29s
  223. 118.77 s > ------------
  224. 118.77 s > Nextest run ID 9e584650-ec8f-471e-87bb-2e335a5b9fe3 with nextest profile: ci_gammaloop
  225. 118.77 s > Starting 1068 tests across 5 binaries (24 tests skipped, including 2 tests via profile.default.default-filter)
  226. 118.77 s > ------------
  227. 118.77 s > Summary [ 26.884s] 1068 tests run: 1068 passed, 24 skipped
  228. 118.77 s >
  229. 118.77 s > ========== nextest test summary ==========
  230. 118.77 s > report: target/nextest/ci_gammaloop/junit.xml
  231. 118.77 s > tests: 1068, failures: 0, errors: 0
  232. 118.77 s > No failing testcases found.
  233. 118.77 s > =========================================
  234. 118.77 s > Extracting 4 binaries (including 1 non-test binary) and 2 linked paths to /build/source
  235. 118.77 s > Extracted 19 files to /build/source in 0.17s
  236. 118.77 s > ------------
  237. 118.77 s > Nextest run ID f1adcbf1-6c6b-4332-90f7-3e218a41e96a with nextest profile: ci_gammaloop
  238. 118.77 s > Starting 393 tests across 3 binaries
  239. 118.77 s > ------------
  240. 118.77 s > Summary [ 1.380s] 393 tests run: 393 passed, 0 skipped
  241. 118.77 s >
  242. 118.77 s > ========== nextest test summary ==========
  243. 118.77 s > report: target/nextest/ci_gammaloop/junit.xml
  244. 118.77 s > tests: 393, failures: 0, errors: 0
  245. 118.77 s > No failing testcases found.
  246. 118.77 s > =========================================
  247. 118.77 s > Extracting 11 binaries (including 1 non-test binary) and 2 linked paths to /build/source
  248. 118.77 s > Extracted 26 files to /build/source in 0.69s
  249. 118.77 s > ------------
  250. 118.77 s > Nextest run ID 00f2e9a5-fd44-49c7-9524-2a44affbe4e7 with nextest profile: ci_gammaloop
  251. 118.77 s > Starting 134 tests across 10 binaries (2 tests skipped)
  252. 118.77 s > ------------
  253. 118.77 s > Summary [ 36.950s] 134 tests run: 134 passed, 2 skipped
  254. 118.77 s >
  255. 118.77 s > ========== nextest test summary ==========
  256. 118.77 s > report: target/nextest/ci_gammaloop/junit.xml
  257. 118.77 s > tests: 134, failures: 0, errors: 0
  258. 118.77 s > No failing testcases found.
  259. 118.77 s > =========================================
  260. 118.77 s > Extracting 2 binaries to /build/source
  261. 118.77 s > Extracted 5 files to /build/source in 0.04s
  262. 118.77 s > ------------
  263. 118.77 s > Nextest run ID 5d04194b-14ab-4626-814c-4293b126445b with nextest profile: ci_gammaloop
  264. 118.77 s > Starting 2 tests across 2 binaries
  265. 118.77 s > ------------
  266. 118.77 s > Summary [ 0.004s] 2 tests run: 2 passed, 0 skipped
  267. 118.77 s >
  268. 118.77 s > ========== nextest test summary ==========
  269. 118.77 s > report: target/nextest/ci_gammaloop/junit.xml
  270. 118.77 s > tests: 2, failures: 0, errors: 0
  271. 118.77 s > No failing testcases found.
  272. 118.77 s > =========================================
  273. 118.77 s > Extracting 7 binaries (including 3 non-test binaries), 1 build script output directory, and 3 linked paths to /build/source
  274. 118.77 s > Extracted 27 files to /build/source in 0.87s
  275. 118.77 s > ------------
  276. 118.77 s > Nextest run ID 7a68b861-3977-42b5-bb06-c2c9a1b02805 with nextest profile: ci_gammaloop
  277. 118.77 s > Starting 146 tests across 4 binaries
  278. 118.77 s > FAIL [ 0.021s] (126/146) spynso3 tests::tensor_indexing_stubs_document_logical_order
  279. 118.77 s > stdout ---
  280. 118.77 s >
  281. 118.77 s > running 1 test
  282. 118.77 s > test tests::tensor_indexing_stubs_document_logical_order ... FAILED
  283. 118.77 s >
  284. 118.77 s > failures:
  285. 118.77 s >
  286. 118.77 s > failures:
  287. 118.77 s > tests::tensor_indexing_stubs_document_logical_order
  288. 118.77 s >
  289. 118.77 s > test result: FAILED. 0 passed; 1 failed; 0 ignored; 0 measured; 134 filtered out; finished in 0.01s
  290. 118.77 s >
  291. 118.77 s > stderr ---
  292. 118.77 s >
  293. 118.77 s > thread 'tests::tensor_indexing_stubs_document_logical_order' (5855) panicked at crates/spynso3/src/lib.rs:2334:9:
  294. 118.77 s > assertion failed: getitem.iter().all(|method|
  295. 118.77 s > {
  296. 118.77 s > method.doc.contains("logical row-major") &&
  297. 118.77 s > method.doc.contains("canonical storage-axis order is not exposed")
  298. 118.77 s > })
  299. 118.77 s > stack backtrace:
  300. 118.77 s > 0: __rustc::rust_begin_unwind
  301. 118.77 s > 1: core::panicking::panic_fmt
  302. 118.77 s > 2: core::panicking::panic
  303. 118.77 s > 3: spynso3::tests::tensor_indexing_stubs_document_logical_order
  304. 118.77 s > 4: <spynso3::tests::tensor_indexing_stubs_document_logical_order::{closure#0} as core::ops::function::FnOnce<()>>::call_once
  305. 118.77 s > note: Some details are omitted, run with `RUST_BACKTRACE=full` for a verbose backtrace.
  306. 118.77 s >
  307. 118.77 s > ------------
  308. 118.77 s > Summary [ 0.250s] 146 tests run: 145 passed, 1 failed, 0 skipped
  309. 118.77 s > FAIL [ 0.021s] (126/146) spynso3 tests::tensor_indexing_stubs_document_logical_order
  310. 118.77 s > stdout ---
  311. 118.77 s >
  312. 118.77 s > running 1 test
  313. 118.77 s > test tests::tensor_indexing_stubs_document_logical_order ... FAILED
  314. 118.77 s >
  315. 118.77 s > failures:
  316. 118.77 s >
  317. 118.77 s > failures:
  318. 118.77 s > tests::tensor_indexing_stubs_document_logical_order
  319. 118.77 s >
  320. 118.77 s > test result: FAILED. 0 passed; 1 failed; 0 ignored; 0 measured; 134 filtered out; finished in 0.01s
  321. 118.77 s >
  322. 118.77 s > stderr ---
  323. 118.77 s >
  324. 118.77 s > thread 'tests::tensor_indexing_stubs_document_logical_order' (5855) panicked at crates/spynso3/src/lib.rs:2334:9:
  325. 118.77 s > assertion failed: getitem.iter().all(|method|
  326. 118.77 s > {
  327. 118.77 s > method.doc.contains("logical row-major") &&
  328. 118.77 s > method.doc.contains("canonical storage-axis order is not exposed")
  329. 118.77 s > })
  330. 118.77 s > stack backtrace:
  331. 118.77 s > 0: __rustc::rust_begin_unwind
  332. 118.77 s > 1: core::panicking::panic_fmt
  333. 118.77 s > 2: core::panicking::panic
  334. 118.77 s > 3: spynso3::tests::tensor_indexing_stubs_document_logical_order
  335. 118.77 s > 4: <spynso3::tests::tensor_indexing_stubs_document_logical_order::{closure#0} as core::ops::function::FnOnce<()>>::call_once
  336. 118.77 s > note: Some details are omitted, run with `RUST_BACKTRACE=full` for a verbose backtrace.
  337. 118.77 s >
  338. 118.77 s > error: test run failed
  339. 118.77 s >
  340. 118.77 s > ========== nextest test summary ==========
  341. 118.77 s > report: target/nextest/ci_gammaloop/junit.xml
  342. 118.77 s > tests: 146, failures: 1, errors: 0
  343. 118.77 s >
  344. 118.77 s > 1. spynso3::tests::tensor_indexing_stubs_document_logical_order
  345. 118.77 s > failure: test failure with exit code 101
  346. 118.77 s > thread 'tests::tensor_indexing_stubs_document_logical_order' (5855) panicked at crates/spynso3/src/lib.rs:2334:9:
  347. 118.77 s > assertion failed: getitem.iter().all(|method|
  348. 118.77 s > {
  349. 118.77 s > method.doc.contains("logical row-major") &&
  350. 118.77 s > method.doc.contains("canonical storage-axis order is not exposed")
  351. 118.77 s > })
  352. 118.77 s > stack backtrace:
  353. 118.77 s > 0: __rustc::rust_begin_unwind
  354. 118.77 s > 1: core::panicking::panic_fmt
  355. 118.77 s > 2: core::panicking::panic
  356. 118.77 s > 3: spynso3::tests::tensor_indexing_stubs_document_logical_order
  357. 118.77 s > 4: <spynso3::tests::tensor_indexing_stubs_document_logical_order::{closure#0} as core::ops::function::FnOnce<()>>::call_once
  358. 118.77 s > note: Some details are omitted, run with `RUST_BACKTRACE=full` for a verbose backtrace.
  359. 118.77 s > system-out
  360. 118.77 s > running 1 test
  361. 118.77 s > test tests::tensor_indexing_stubs_document_logical_order ... FAILED
  362. 118.77 s >
  363. 118.77 s > failures:
  364. 118.77 s >
  365. 118.77 s > failures:
  366. 118.77 s > tests::tensor_indexing_stubs_document_logical_order
  367. 118.77 s >
  368. 118.77 s > test result: FAILED. 0 passed; 1 failed; 0 ignored; 0 measured; 134 filtered out; finished in 0.01s
  369. 118.77 s > system-err
  370. 118.77 s > thread 'tests::tensor_indexing_stubs_document_logical_order' (5855) panicked at crates/spynso3/src/lib.rs:2334:9:
  371. 118.77 s > assertion failed: getitem.iter().all(|method|
  372. 118.77 s > {
  373. 118.77 s > method.doc.contains("logical row-major") &&
  374. 118.77 s > method.doc.contains("canonical storage-axis order is not exposed")
  375. 118.77 s > })
  376. 118.77 s > stack backtrace:
  377. 118.77 s > 0: __rustc::rust_begin_unwind
  378. 118.77 s > 1: core::panicking::panic_fmt
  379. 118.77 s > 2: core::panicking::panic
  380. 118.77 s > 3: spynso3::tests::tensor_indexing_stubs_document_logical_order
  381. 118.77 s > 4: <spynso3::tests::tensor_indexing_stubs_document_logical_order::{closure#0} as core::ops::function::FnOnce<()>>::call_once
  382. 118.77 s > note: Some details are omitted, run with `RUST_BACKTRACE=full` for a verbose backtrace.
  383. 118.77 s > =========================================
  384. 118.77 s > Extracting 1 binary and 1 linked path to /build/source
  385. 118.77 s > Extracted 7 files to /build/source in 0.09s
  386. 118.77 s > ------------
  387. 118.77 s > Nextest run ID fd7331ba-5cd1-4a08-97e5-d14fb93dd5ac with nextest profile: ci_gammaloop
  388. 118.77 s > Starting 4 tests across 1 binary
  389. 118.77 s > ------------
  390. 118.77 s > Summary [ 0.006s] 4 tests run: 4 passed, 0 skipped
  391. 118.77 s >
  392. 118.77 s > ========== nextest test summary ==========
  393. 118.77 s > report: target/nextest/ci_gammaloop/junit.xml
  394. 118.77 s > tests: 4, failures: 0, errors: 0
  395. 118.77 s > No failing testcases found.
  396. 118.77 s > =========================================
  397. 118.77 s > Extracting 1 binary to /build/source
  398. 118.77 s > Extracted 4 files to /build/source in 0.04s
  399. 118.77 s > ------------
  400. 118.77 s > Nextest run ID 2ffb9aad-84b4-4974-a2be-dc5ad1743e51 with nextest profile: ci_gammaloop
  401. 118.77 s > Starting 2 tests across 1 binary
  402. 118.77 s > ------------
  403. 118.77 s > Summary [ 0.005s] 2 tests run: 2 passed, 0 skipped
  404. 118.77 s >
  405. 118.77 s > ========== nextest test summary ==========
  406. 118.77 s > report: target/nextest/ci_gammaloop/junit.xml
  407. 118.77 s > tests: 2, failures: 0, errors: 0
  408. 118.77 s > No failing testcases found.
  409. 118.77 s > =========================================
  410. 118.77 s For full logs, run:
  411. 118.77 s nix log /nix/store/zc1jmsz4gf36w3nhmcyr3l14f2xqrbm4-gammaloop-nextest-spenso.drv
  412. 119.01 s [0 built (1 failed)]Run failed.