1. 0.00 s $ /nix/store/bhv6xyvqw6gjs3j488gi1z6wdv18bdpa-coreutils-9.11/bin/timeout --kill-after=15s 7200s /nix/store/bxgja2ppiqi6w2bgn0r07d7mgnl1k6k2-nix-2.34.8/bin/nix --extra-experimental-features nix-command --extra-experimental-features flakes flake clone git+https://github.com/alphal00p/gammaloop --dest /tmp/nix-ci-worker/stable-pwd/repo/
  2. 0.11 s Cloning into '/tmp/nix-ci-worker/stable-pwd/repo'...
  3. 0.87 s remote: Enumerating objects: 162082, done.
  4. 0.99 s remote: Counting objects: 0% (1/16760) remote: Counting objects: 1% (168/16760) remote: Counting objects: 2% (336/16760) remote: Counting objects: 3% (503/16760) remote: Counting objects: 4% (671/16760) remote: Counting objects: 5% (838/16760) remote: Counting objects: 6% (1006/16760) remote: Counting objects: 7% (1174/16760) remote: Counting objects: 8% (1341/16760) remote: Counting objects: 9% (1509/16760) remote: Counting objects: 10% (1676/16760) remote: Counting objects: 11% (1844/16760) remote: Counting objects: 12% (2012/16760) remote: Counting objects: 13% (2179/16760) remote: Counting objects: 14% (2347/16760) remote: Counting objects: 15% (2514/16760) remote: Counting objects: 16% (2682/16760) remote: Counting objects: 17% (2850/16760) remote: Counting objects: 18% (3017/16760) remote: Counting objects: 19% (3185/16760) remote: Counting objects: 20% (3352/16760) remote: Counting objects: 21% (3520/16760) remote: Counting objects: 22% (3688/16760) remote: Counting objects: 23% (3855/16760) remote: Counting objects: 24% (4023/16760) remote: Counting objects: 25% (4190/16760) remote: Counting objects: 26% (4358/16760) remote: Counting objects: 27% (4526/16760) remote: Counting objects: 28% (4693/16760) remote: Counting objects: 29% (4861/16760) remote: Counting objects: 30% (5028/16760) remote: Counting objects: 31% (5196/16760) remote: Counting objects: 32% (5364/16760) remote: Counting objects: 33% (5531/16760) remote: Counting objects: 34% (5699/16760) remote: Counting objects: 35% (5866/16760) remote: Counting objects: 36% (6034/16760) remote: Counting objects: 37% (6202/16760) remote: Counting objects: 38% (6369/16760) remote: Counting objects: 39% (6537/16760) remote: Counting objects: 40% (6704/16760) remote: Counting objects: 41% (6872/16760) remote: Counting objects: 42% (7040/16760) remote: Counting objects: 43% (7207/16760) remote: Counting objects: 44% (7375/16760) remote: Counting objects: 45% (7542/16760) remote: Counting objects: 46% (7710/16760) remote: Counting objects: 47% (7878/16760) remote: Counting objects: 48% (8045/16760) remote: Counting objects: 49% (8213/16760) remote: Counting objects: 50% (8380/16760) remote: Counting objects: 51% (8548/16760) remote: Counting objects: 52% (8716/16760) remote: Counting objects: 53% (8883/16760) remote: Counting objects: 54% (9051/16760) remote: Counting objects: 55% (9218/16760) remote: Counting objects: 56% (9386/16760) remote: Counting objects: 57% (9554/16760) remote: Counting objects: 58% (9721/16760) remote: Counting objects: 59% (9889/16760) remote: Counting objects: 60% (10056/16760) remote: Counting objects: 61% (10224/16760) remote: Counting objects: 62% (10392/16760) remote: Counting objects: 63% (10559/16760) remote: Counting objects: 64% (10727/16760) remote: Counting objects: 65% (10894/16760) remote: Counting objects: 66% (11062/16760) remote: Counting objects: 67% (11230/16760) remote: Counting objects: 68% (11397/16760) remote: Counting objects: 69% (11565/16760) remote: Counting objects: 70% (11732/16760) remote: Counting objects: 71% (11900/16760) remote: Counting objects: 72% (12068/16760) remote: Counting objects: 73% (12235/16760) remote: Counting objects: 74% (12403/16760) remote: Counting objects: 75% (12570/16760) remote: Counting objects: 76% (12738/16760) remote: Counting objects: 77% (12906/16760) remote: Counting objects: 78% (13073/16760) remote: Counting objects: 79% (13241/16760) remote: Counting objects: 80% (13408/16760) remote: Counting objects: 81% (13576/16760) remote: Counting objects: 82% (13744/16760) remote: Counting objects: 83% (13911/16760) remote: Counting objects: 84% (14079/16760) remote: Counting objects: 85% (14246/16760) remote: Counting objects: 86% (14414/16760) remote: Counting objects: 87% (14582/16760) remote: Counting objects: 88% (14749/16760) remote: Counting objects: 89% (14917/16760) remote: Counting objects: 90% (15084/16760) remote: Counting objects: 91% (15252/16760) remote: Counting objects: 92% (15420/16760) remote: Counting objects: 93% (15587/16760) remote: Counting objects: 94% (15755/16760) remote: Counting objects: 95% (15922/16760) remote: Counting objects: 96% (16090/16760) remote: Counting objects: 97% (16258/16760) remote: Counting objects: 98% (16425/16760) remote: Counting objects: 99% (16593/16760) remote: Counting objects: 100% (16760/16760) remote: Counting objects: 100% (16760/16760), done.
  5. 6.70 s remote: Compressing objects: 0% (1/3833) remote: Compressing objects: 1% (39/3833) remote: Compressing objects: 2% (77/3833) remote: Compressing objects: 3% (115/3833) remote: Compressing objects: 4% (154/3833) remote: Compressing objects: 5% (192/3833) remote: Compressing objects: 6% (230/3833) remote: Compressing objects: 7% (269/3833) remote: Compressing objects: 8% (307/3833) remote: Compressing objects: 9% (345/3833) remote: Compressing objects: 10% (384/3833) remote: Compressing objects: 11% (422/3833) remote: Compressing objects: 12% (460/3833) remote: Compressing objects: 12% (491/3833) remote: Compressing objects: 13% (499/3833) remote: Compressing objects: 14% (537/3833) remote: Compressing objects: 14% (539/3833) remote: Compressing objects: 15% (575/3833) remote: Compressing objects: 16% (614/3833) remote: Compressing objects: 16% (622/3833) remote: Compressing objects: 17% (652/3833) remote: Compressing objects: 18% (690/3833) remote: Compressing objects: 19% (729/3833) remote: Compressing objects: 19% (764/3833) remote: Compressing objects: 20% (767/3833) remote: Compressing objects: 21% (805/3833) remote: Compressing objects: 22% (844/3833) remote: Compressing objects: 23% (882/3833) remote: Compressing objects: 24% (920/3833) remote: Compressing objects: 25% (959/3833) remote: Compressing objects: 25% (991/3833) remote: Compressing objects: 26% (997/3833) remote: Compressing objects: 27% (1035/3833) remote: Compressing objects: 28% (1074/3833) remote: Compressing objects: 29% (1112/3833) remote: Compressing objects: 30% (1150/3833) remote: Compressing objects: 31% (1189/3833) remote: Compressing objects: 32% (1227/3833) remote: Compressing objects: 33% (1265/3833) remote: Compressing objects: 34% (1304/3833) remote: Compressing objects: 35% (1342/3833) remote: Compressing objects: 36% (1380/3833) remote: Compressing objects: 37% (1419/3833) remote: Compressing objects: 38% (1457/3833) remote: Compressing objects: 39% (1495/3833) remote: Compressing objects: 40% (1534/3833) remote: Compressing objects: 41% (1572/3833) remote: Compressing objects: 42% (1610/3833) remote: Compressing objects: 43% (1649/3833) remote: Compressing objects: 44% (1687/3833) remote: Compressing objects: 45% (1725/3833) remote: Compressing objects: 46% (1764/3833) remote: Compressing objects: 47% (1802/3833) remote: Compressing objects: 48% (1840/3833) remote: Compressing objects: 49% (1879/3833) remote: Compressing objects: 50% (1917/3833) remote: Compressing objects: 51% (1955/3833) remote: Compressing objects: 52% (1994/3833) remote: Compressing objects: 53% (2032/3833) remote: Compressing objects: 54% (2070/3833) remote: Compressing objects: 55% (2109/3833) remote: Compressing objects: 56% (2147/3833) remote: Compressing objects: 57% (2185/3833) remote: Compressing objects: 58% (2224/3833) remote: Compressing objects: 59% (2262/3833) remote: Compressing objects: 60% (2300/3833) remote: Compressing objects: 61% (2339/3833) remote: Compressing objects: 62% (2377/3833) remote: Compressing objects: 63% (2415/3833) remote: Compressing objects: 64% (2454/3833) remote: Compressing objects: 65% (2492/3833) remote: Compressing objects: 66% (2530/3833) remote: Compressing objects: 67% (2569/3833) remote: Compressing objects: 68% (2607/3833) remote: Compressing objects: 69% (2645/3833) remote: Compressing objects: 70% (2684/3833) remote: Compressing objects: 71% (2722/3833) remote: Compressing objects: 72% (2760/3833) remote: Compressing objects: 73% (2799/3833) remote: Compressing objects: 74% (2837/3833) remote: Compressing objects: 75% (2875/3833) remote: Compressing objects: 76% (2914/3833) remote: Compressing objects: 77% (2952/3833) remote: Compressing objects: 78% (2990/3833) remote: Compressing objects: 79% (3029/3833) remote: Compressing objects: 80% (3067/3833) remote: Compressing objects: 81% (3105/3833) remote: Compressing objects: 82% (3144/3833) remote: Compressing objects: 83% (3182/3833) remote: Compressing objects: 84% (3220/3833) remote: Compressing objects: 85% (3259/3833) remote: Compressing objects: 86% (3297/3833) remote: Compressing objects: 87% (3335/3833) remote: Compressing objects: 88% (3374/3833) remote: Compressing objects: 89% (3412/3833) remote: Compressing objects: 90% (3450/3833) remote: Compressing objects: 91% (3489/3833) remote: Compressing objects: 92% (3527/3833) remote: Compressing objects: 93% (3565/3833) remote: Compressing objects: 94% (3604/3833) remote: Compressing objects: 95% (3642/3833) remote: Compressing objects: 96% (3680/3833) remote: Compressing objects: 97% (3719/3833) remote: Compressing objects: 98% (3757/3833) remote: Compressing objects: 99% (3795/3833) remote: Compressing objects: 100% (3833/3833) remote: Compressing objects: 100% (3833/3833), done.
  6. 22.48 s Receiving objects: 0% (1/162082) Receiving objects: 1% (1621/162082) Receiving objects: 2% (3242/162082) Receiving objects: 3% (4863/162082), 15.66 MiB | 31.31 MiB/s Receiving objects: 4% (6484/162082), 15.66 MiB | 31.31 MiB/s Receiving objects: 4% (7837/162082), 15.66 MiB | 31.31 MiB/s Receiving objects: 5% (8105/162082), 33.18 MiB | 33.17 MiB/s Receiving objects: 6% (9725/162082), 33.18 MiB | 33.17 MiB/s Receiving objects: 7% (11346/162082), 33.18 MiB | 33.17 MiB/s Receiving objects: 7% (12018/162082), 49.36 MiB | 32.15 MiB/s Receiving objects: 8% (12967/162082), 65.77 MiB | 32.33 MiB/s Receiving objects: 9% (14588/162082), 65.77 MiB | 32.33 MiB/s Receiving objects: 10% (16209/162082), 65.77 MiB | 32.33 MiB/s Receiving objects: 11% (17830/162082), 65.77 MiB | 32.33 MiB/s Receiving objects: 12% (19450/162082), 65.77 MiB | 32.33 MiB/s Receiving objects: 13% (21071/162082), 76.89 MiB | 30.35 MiB/s Receiving objects: 14% (22692/162082), 76.89 MiB | 30.35 MiB/s Receiving objects: 15% (24313/162082), 76.89 MiB | 30.35 MiB/s Receiving objects: 16% (25934/162082), 76.89 MiB | 30.35 MiB/s Receiving objects: 17% (27554/162082), 76.89 MiB | 30.35 MiB/s Receiving objects: 18% (29175/162082), 76.89 MiB | 30.35 MiB/s Receiving objects: 19% (30796/162082), 76.89 MiB | 30.35 MiB/s Receiving objects: 20% (32417/162082), 76.89 MiB | 30.35 MiB/s Receiving objects: 21% (34038/162082), 76.89 MiB | 30.35 MiB/s Receiving objects: 22% (35659/162082), 76.89 MiB | 30.35 MiB/s Receiving objects: 23% (37279/162082), 76.89 MiB | 30.35 MiB/s Receiving objects: 24% (38900/162082), 76.89 MiB | 30.35 MiB/s Receiving objects: 25% (40521/162082), 76.89 MiB | 30.35 MiB/s Receiving objects: 26% (42142/162082), 76.89 MiB | 30.35 MiB/s Receiving objects: 27% (43763/162082), 76.89 MiB | 30.35 MiB/s Receiving objects: 27% (44898/162082), 76.89 MiB | 30.35 MiB/s Receiving objects: 28% (45383/162082), 76.89 MiB | 30.35 MiB/s Receiving objects: 29% (47004/162082), 97.24 MiB | 31.93 MiB/s Receiving objects: 30% (48625/162082), 97.24 MiB | 31.93 MiB/s Receiving objects: 31% (50246/162082), 97.24 MiB | 31.93 MiB/s Receiving objects: 32% (51867/162082), 97.24 MiB | 31.93 MiB/s Receiving objects: 33% (53488/162082), 113.64 MiB | 32.04 MiB/s Receiving objects: 34% (55108/162082), 113.64 MiB | 32.04 MiB/s Receiving objects: 35% (56729/162082), 113.64 MiB | 32.04 MiB/s Receiving objects: 36% (58350/162082), 113.64 MiB | 32.04 MiB/s Receiving objects: 36% (59926/162082), 113.64 MiB | 32.04 MiB/s Receiving objects: 37% (59971/162082), 129.88 MiB | 32.11 MiB/s Receiving objects: 38% (61592/162082), 129.88 MiB | 32.11 MiB/s Receiving objects: 39% (63212/162082), 129.88 MiB | 32.11 MiB/s Receiving objects: 40% (64833/162082), 129.88 MiB | 32.11 MiB/s Receiving objects: 41% (66454/162082), 129.88 MiB | 32.11 MiB/s Receiving objects: 42% (68075/162082), 129.88 MiB | 32.11 MiB/s Receiving objects: 42% (68210/162082), 162.56 MiB | 32.32 MiB/s Receiving objects: 43% (69696/162082), 162.56 MiB | 32.32 MiB/s Receiving objects: 44% (71317/162082), 162.56 MiB | 32.32 MiB/s Receiving objects: 45% (72937/162082), 162.56 MiB | 32.32 MiB/s Receiving objects: 46% (74558/162082), 162.56 MiB | 32.32 MiB/s Receiving objects: 47% (76179/162082), 179.06 MiB | 31.92 MiB/s Receiving objects: 48% (77800/162082), 179.06 MiB | 31.92 MiB/s Receiving objects: 49% (79421/162082), 179.06 MiB | 31.92 MiB/s Receiving objects: 50% (81041/162082), 179.06 MiB | 31.92 MiB/s Receiving objects: 51% (82662/162082), 179.06 MiB | 31.92 MiB/s Receiving objects: 51% (83931/162082), 179.06 MiB | 31.92 MiB/s Receiving objects: 52% (84283/162082), 179.06 MiB | 31.92 MiB/s Receiving objects: 53% (85904/162082), 195.47 MiB | 32.22 MiB/s Receiving objects: 54% (87525/162082), 195.47 MiB | 32.22 MiB/s Receiving objects: 55% (89146/162082), 195.47 MiB | 32.22 MiB/s Receiving objects: 55% (89772/162082), 211.25 MiB | 31.91 MiB/s Receiving objects: 56% (90766/162082), 244.16 MiB | 32.30 MiB/s Receiving objects: 56% (91144/162082), 244.16 MiB | 32.30 MiB/s Receiving objects: 57% (92387/162082), 260.33 MiB | 32.26 MiB/s Receiving objects: 58% (94008/162082), 260.33 MiB | 32.26 MiB/s Receiving objects: 59% (95629/162082), 276.79 MiB | 32.30 MiB/s Receiving objects: 60% (97250/162082), 276.79 MiB | 32.30 MiB/s Receiving objects: 60% (97867/162082), 276.79 MiB | 32.30 MiB/s Receiving objects: 61% (98871/162082), 292.74 MiB | 31.95 MiB/s Receiving objects: 62% (100491/162082), 292.74 MiB | 31.95 MiB/s Receiving objects: 63% (102112/162082), 308.79 MiB | 31.96 MiB/s Receiving objects: 64% (103733/162082), 308.79 MiB | 31.96 MiB/s Receiving objects: 64% (103993/162082), 308.79 MiB | 31.96 MiB/s Receiving objects: 65% (105354/162082), 308.79 MiB | 31.96 MiB/s Receiving objects: 66% (106975/162082), 325.82 MiB | 32.09 MiB/s Receiving objects: 67% (108595/162082), 325.82 MiB | 32.09 MiB/s Receiving objects: 68% (110216/162082), 325.82 MiB | 32.09 MiB/s Receiving objects: 69% (111837/162082), 325.82 MiB | 32.09 MiB/s Receiving objects: 70% (113458/162082), 325.82 MiB | 32.09 MiB/s Receiving objects: 71% (115079/162082), 325.82 MiB | 32.09 MiB/s Receiving objects: 72% (116700/162082), 325.82 MiB | 32.09 MiB/s Receiving objects: 73% (118320/162082), 325.82 MiB | 32.09 MiB/s Receiving objects: 74% (119941/162082), 342.11 MiB | 32.06 MiB/s Receiving objects: 75% (121562/162082), 342.11 MiB | 32.06 MiB/s Receiving objects: 75% (121740/162082), 342.11 MiB | 32.06 MiB/s Receiving objects: 76% (123183/162082), 342.11 MiB | 32.06 MiB/s Receiving objects: 77% (124804/162082), 358.33 MiB | 32.33 MiB/s Receiving objects: 78% (126424/162082), 358.33 MiB | 32.33 MiB/s Receiving objects: 79% (128045/162082), 358.33 MiB | 32.33 MiB/s Receiving objects: 80% (129666/162082), 374.89 MiB | 32.38 MiB/s Receiving objects: 81% (131287/162082), 374.89 MiB | 32.38 MiB/s Receiving objects: 81% (131977/162082), 374.89 MiB | 32.38 MiB/s Receiving objects: 82% (132908/162082), 407.32 MiB | 32.13 MiB/s Receiving objects: 82% (134163/162082), 407.32 MiB | 32.13 MiB/s Receiving objects: 83% (134529/162082), 407.32 MiB | 32.13 MiB/s Receiving objects: 84% (136149/162082), 423.69 MiB | 32.11 MiB/s Receiving objects: 85% (137770/162082), 423.69 MiB | 32.11 MiB/s Receiving objects: 86% (139391/162082), 439.81 MiB | 32.18 MiB/s Receiving objects: 86% (140279/162082), 439.81 MiB | 32.18 MiB/s Receiving objects: 87% (141012/162082), 455.92 MiB | 32.16 MiB/s Receiving objects: 88% (142633/162082), 472.72 MiB | 32.27 MiB/s Receiving objects: 89% (144253/162082), 472.72 MiB | 32.27 MiB/s Receiving objects: 90% (145874/162082), 472.72 MiB | 32.27 MiB/s Receiving objects: 91% (147495/162082), 472.72 MiB | 32.27 MiB/s Receiving objects: 92% (149116/162082), 472.72 MiB | 32.27 MiB/s Receiving objects: 93% (150737/162082), 472.72 MiB | 32.27 MiB/s Receiving objects: 93% (151362/162082), 472.72 MiB | 32.27 MiB/s Receiving objects: 94% (152358/162082), 472.72 MiB | 32.27 MiB/s Receiving objects: 95% (153978/162082), 472.72 MiB | 32.27 MiB/s Receiving objects: 96% (155599/162082), 472.72 MiB | 32.27 MiB/s Receiving objects: 97% (157220/162082), 472.72 MiB | 32.27 MiB/s Receiving objects: 98% (158841/162082), 488.71 MiB | 32.20 MiB/s Receiving objects: 99% (160462/162082), 488.71 MiB | 32.20 MiB/s remote: Total 162082 (delta 14164), reused 13398 (delta 12909), pack-reused 145322 (from 3)
  7. 22.48 s Receiving objects: 100% (162082/162082), 499.90 MiB | 31.10 MiB/s Receiving objects: 100% (162082/162082), 500.71 MiB | 31.76 MiB/s, done.
  8. 24.57 s Resolving deltas: 0% (0/105802) Resolving deltas: 1% (1059/105802) Resolving deltas: 2% (2117/105802) Resolving deltas: 3% (3175/105802) Resolving deltas: 4% (4233/105802) Resolving deltas: 5% (5291/105802) Resolving deltas: 6% (6350/105802) Resolving deltas: 7% (7409/105802) Resolving deltas: 8% (8465/105802) Resolving deltas: 9% (9523/105802) Resolving deltas: 10% (10581/105802) Resolving deltas: 11% (11639/105802) Resolving deltas: 12% (12698/105802) Resolving deltas: 13% (13756/105802) Resolving deltas: 14% (14813/105802) Resolving deltas: 15% (15871/105802) Resolving deltas: 16% (16931/105802) Resolving deltas: 17% (17987/105802) Resolving deltas: 18% (19045/105802) Resolving deltas: 19% (20103/105802) Resolving deltas: 20% (21161/105802) Resolving deltas: 21% (22219/105802) Resolving deltas: 22% (23278/105802) Resolving deltas: 23% (24335/105802) Resolving deltas: 24% (25393/105802) Resolving deltas: 25% (26453/105802) Resolving deltas: 26% (27509/105802) Resolving deltas: 27% (28571/105802) Resolving deltas: 28% (29625/105802) Resolving deltas: 29% (30683/105802) Resolving deltas: 30% (31742/105802) Resolving deltas: 31% (32799/105802) Resolving deltas: 32% (33857/105802) Resolving deltas: 33% (34919/105802) Resolving deltas: 34% (35973/105802) Resolving deltas: 35% (37031/105802) Resolving deltas: 36% (38089/105802) Resolving deltas: 37% (39147/105802) Resolving deltas: 38% (40205/105802) Resolving deltas: 39% (41263/105802) Resolving deltas: 40% (42321/105802) Resolving deltas: 41% (43379/105802) Resolving deltas: 42% (44437/105802) Resolving deltas: 43% (45495/105802) Resolving deltas: 44% (46553/105802) Resolving deltas: 45% (47613/105802) Resolving deltas: 46% (48669/105802) Resolving deltas: 47% (49727/105802) Resolving deltas: 48% (50785/105802) Resolving deltas: 49% (51843/105802) Resolving deltas: 50% (52901/105802) Resolving deltas: 51% (53960/105802) Resolving deltas: 52% (55018/105802) Resolving deltas: 53% (56076/105802) Resolving deltas: 53% (56174/105802) Resolving deltas: 54% (57134/105802) Resolving deltas: 55% (58192/105802) Resolving deltas: 56% (59250/105802) Resolving deltas: 57% (60308/105802) Resolving deltas: 58% (61366/105802) Resolving deltas: 59% (62424/105802) Resolving deltas: 60% (63482/105802) Resolving deltas: 61% (64540/105802) Resolving deltas: 62% (65598/105802) Resolving deltas: 63% (66656/105802) Resolving deltas: 64% (67714/105802) Resolving deltas: 65% (68773/105802) Resolving deltas: 66% (69830/105802) Resolving deltas: 67% (70890/105802) Resolving deltas: 68% (71946/105802) Resolving deltas: 69% (73004/105802) Resolving deltas: 70% (74062/105802) Resolving deltas: 71% (75120/105802) Resolving deltas: 72% (76178/105802) Resolving deltas: 73% (77236/105802) Resolving deltas: 74% (78294/105802) Resolving deltas: 75% (79353/105802) Resolving deltas: 76% (80410/105802) Resolving deltas: 77% (81468/105802) Resolving deltas: 78% (82527/105802) Resolving deltas: 79% (83584/105802) Resolving deltas: 80% (84642/105802) Resolving deltas: 81% (85700/105802) Resolving deltas: 82% (86758/105802) Resolving deltas: 83% (87816/105802) Resolving deltas: 84% (88874/105802) Resolving deltas: 85% (89933/105802) Resolving deltas: 86% (90993/105802) Resolving deltas: 87% (92048/105802) Resolving deltas: 88% (93106/105802) Resolving deltas: 89% (94164/105802) Resolving deltas: 90% (95222/105802) Resolving deltas: 91% (96280/105802) Resolving deltas: 92% (97338/105802) Resolving deltas: 93% (98396/105802) Resolving deltas: 94% (99454/105802) Resolving deltas: 95% (100512/105802) Resolving deltas: 96% (101570/105802) Resolving deltas: 97% (102628/105802) Resolving deltas: 97% (103225/105802) Resolving deltas: 98% (103687/105802) Resolving deltas: 99% (104745/105802) Resolving deltas: 100% (105802/105802) Resolving deltas: 100% (105802/105802), done.
  9. 25.34 s Fetching commit 8959f063dd3a21d9dfa4be72260815fa7c625bde for feynkit ...
  10. 25.34 s $ /nix/store/b1wn5clix1mz4vpfih7x9cnj9qfh7c6h-git-2.54.0/bin/git fetch origin 8959f063dd3a21d9dfa4be72260815fa7c625bde
  11. 25.72 s From https://github.com/alphal00p/gammaloop
  12. 25.72 s * branch 8959f063dd3a21d9dfa4be72260815fa7c625bde -> FETCH_HEAD
  13. 25.73 s $ /nix/store/bhv6xyvqw6gjs3j488gi1z6wdv18bdpa-coreutils-9.11/bin/timeout --kill-after=15s 7200s /nix/store/b1wn5clix1mz4vpfih7x9cnj9qfh7c6h-git-2.54.0/bin/git -c advice.detachedHead=false checkout 8959f063dd3a21d9dfa4be72260815fa7c625bde
  14. 26.15 s HEAD is now at 8959f063d record indexed tensor qualification and remaining performance limits
  15. 26.16 s $ /nix/store/bhv6xyvqw6gjs3j488gi1z6wdv18bdpa-coreutils-9.11/bin/timeout --kill-after=15s 7200s /nix/store/bxgja2ppiqi6w2bgn0r07d7mgnl1k6k2-nix-2.34.8/bin/nix --extra-experimental-features nix-command --extra-experimental-features flakes --log-format internal-json run .#packages.x86_64-linux.nix-ci-check-gammaloop-nextest-docs --print-build-logs
  16. 26.27 s warning: ignoring untrusted flake configuration setting 'extra-substituters'.
  17. 26.27 s Pass '--accept-flake-config' to trust it
  18. 26.27 s warning: ignoring untrusted flake configuration setting 'extra-trusted-public-keys'.
  19. 26.27 s Pass '--accept-flake-config' to trust it
  20. 64.51 s
  21. 64.73 s evaluating derivation 'gdo you want to allow configuration setting 'extra-substituters' to be set to 'https://cache.nix-ci.com' (y/N)? do you want to permanently mark this value as untrusted (y/N)? warning: ignoring untrusted flake configuration setting 'extra-substituters'.
  22. 64.73 s Pass '--accept-flake-config' to trust it
  23. 64.73 s do you want to allow configuration setting 'extra-trusted-public-keys' to be set to 'nix-ci:g3xV5BDTLtIBZr/A00IU1x0EtKKlb7YLgBN2SgYgM6A=' (y/N)? do you want to permanently mark this value as untrusted (y/N)? warning: ignoring untrusted flake configuration setting 'extra-trusted-public-keys'.
  24. 64.73 s Pass '--accept-flake-config' to trust it
  25. 108.04 s copying '/nix/store/vrm9 evaluating derivation 'g copying '/nix/store/vrm9 evaluating derivation 'g copying '/nix/store/vrm9 evaluating derivation 'g copying '/nix/store/vrm9 evaluating derivation 'g copying '/nix/store/vrm9 evaluating derivation 'g copying '/nix/store/vrm9 evaluating derivation 'g copying '/nix/store/vrm9 evaluating derivation 'g copying '/nix/store/vrm9 evaluating derivation 'g copying '/nix/store/vrm9 evaluating derivation 'g copying '/nix/store/vrm9 evaluating derivation 'g copying '/nix/store/vrm9 evaluating derivation 'g copying '/nix/store/vrm9 evaluating derivation 'g copying '/nix/store/vrm9 evaluating derivation 'g copying '/nix/store/vrm9 evaluating derivation 'g copying '/nix/store/vrm9 evaluating derivation 'g copying '/nix/store/vrm9 evaluating derivation 'g copying '/nix/store/vrm9 evaluating derivation 'g copying '/nix/store/vrm9 evaluating derivation 'g copying '/nix/store/vrm9 evaluating derivation 'g copying '/nix/store/vrm9 evaluating derivation 'g copying '/nix/store/vrm9 evaluating derivation 'g copying '/nix/store/vrm9 evaluating derivation 'g copying '/nix/store/vrm9 evaluating derivation 'g copying '/nix/store/vrm9 evaluating derivation 'g copying '/nix/store/vrm9 evaluating derivation 'g copying '/nix/store/vrm9 evaluating derivation 'g copying '/nix/store/vrm9 evaluating derivation 'g copying '/nix/store/vrm9 evaluating derivation 'g copying '/nix/store/vrm9 evaluating derivation 'g copying '/nix/store/vrm9 evaluating derivation 'g copying '/nix/store/vrm9 evaluating derivation 'g copying '/nix/store/vrm9 evaluating derivation 'g copying '/nix/store/vrm9 evaluating derivation 'g copying '/nix/store/vrm9 evaluating derivation 'g copying '/nix/store/vrm9 evaluating derivation 'g copying '/nix/store/vrm9 evaluating derivation 'g copying '/nix/store/vrm9 evaluating derivation 'g copying '/nix/store/vrm9 evaluating derivation 'g copying '/nix/store/vrm9 evaluating derivation 'g copying '/nix/store/vrm9 evaluating derivation 'g copying '/nix/store/vrm9 evaluating derivation 'g copying '/nix/store/vrm9 evaluating derivation 'g copying '/nix/store/vrm9 evaluating derivation 'g copying '/nix/store/vrm9 evaluating derivation 'g copying '/nix/store/vrm9 evaluating derivation 'g copying '/nix/store/vrm9 evaluating derivation 'g copying '/nix/store/vrm9 evaluating derivation 'g copying '/nix/store/vrm9 evaluating derivation 'g copying '/nix/store/vrm9 evaluating derivation 'g copying '/nix/store/vrm9 evaluating derivation 'g copying '/nix/store/vrm9 evaluating derivation 'g copying '/nix/store/vrm9 evaluating derivation 'g copying '/nix/store/vrm9 evaluating derivation 'g copying '/nix/store/vrm9 evaluating derivation 'g copying '/nix/store/vrm9 evaluating derivation 'g copying '/nix/store/vrm9 evaluating derivation 'g copying '/nix/store/vrm9 evaluating derivation 'g copying '/nix/store/vrm9 evaluating derivation 'g copying '/nix/store/vrm9 evaluating derivation 'g copying '/nix/store/vrm9 evaluating derivation 'g copying '/nix/store/vrm9 evaluating derivation 'g copying '/nix/store/vrm9 evaluating derivation 'g copying '/nix/store/vrm9 evaluating derivation 'g copying '/nix/store/vrm9 evaluating derivation 'g copying '/nix/store/vrm9 evaluating derivation 'g copying '/nix/store/vrm9 evaluating derivation 'g copying '/nix/store/vrm9 evaluating derivation 'g copying '/nix/store/vrm9 evaluating derivation 'g copying '/nix/store/vrm9 evaluating derivation 'g copying '/nix/store/vrm9 evaluating derivation 'g copying '/nix/store/vrm9 evaluating derivation 'g copying '/nix/store/vrm9 evaluating derivation 'g copying '/nix/store/vrm9 evaluating derivation 'g copying '/nix/store/vrm9 evaluating derivation 'g copying '/nix/store/vrm9 evaluating derivation 'g copying '/nix/store/vrm9 evaluating derivation 'g copying '/nix/store/vrm9 evaluating derivation 'g copying '/nix/store/vrm9 evaluating derivation 'g copying '/nix/store/vrm9 evaluating derivation 'g copying '/nix/store/vrm9 evaluating derivation 'g copying '/nix/store/vrm9 evaluating derivation 'g copying '/nix/store/vrm9 evaluating derivation 'g copying '/nix/store/vrm9 evaluating derivation 'g copying '/nix/store/vrm9 evaluating derivation 'g copying '/nix/store/vrm9 evaluating derivation 'g copying '/nix/store/vrm9 evaluating derivation 'g copying '/nix/store/vrm9 evaluating derivation 'g copying '/nix/store/vrm9 evaluating derivation 'g copying '/nix/store/vrm9 evaluating derivation 'g copying '/nix/store/vrm9 evaluating derivation 'g copying '/nix/store/vrm9 evaluating derivation 'g copying '/nix/store/vrm9 evaluating derivation 'g copying '/nix/store/vrm9 evaluating derivation 'g copying '/nix/store/vrm9 evaluating derivation 'g copying '/nix/store/vrm9 evaluating derivation 'g copying '/nix/store/vrm9 evaluating derivation 'g copying '/nix/store/vrm9 evaluating derivation 'g copying '/nix/store/vrm9 evaluating derivation 'g copying '/nix/store/vrm9 evaluating derivation 'g copying '/nix/store/vrm9 evaluating derivation 'g copying '/nix/store/vrm9 evaluating derivation 'g copying '/nix/store/vrm9 evaluating derivation 'g copying '/nix/store/vrm9 evaluating derivation 'g copying '/nix/store/vrm9 evaluating derivation 'g copying '/nix/store/vrm9 evaluating derivation 'g copying '/nix/store/vrm9 evaluating derivation 'g copying '/nix/store/vrm9 evaluating derivation 'g copying '/nix/store/vrm9 evaluating derivation 'g copying '/nix/store/vrm9 evaluating derivation 'g copying '/nix/store/vrm9 evaluating derivation 'g copying '/nix/store/vrm9 evaluating derivation 'g copying '/nix/store/vrm9 evaluating derivation 'g copying '/nix/store/vrm9 evaluating derivation 'g copying '/nix/store/vrm9 evaluating derivation 'g copying '/nix/store/vrm9 evaluating derivation 'g copying '/nix/store/vrm9 evaluating derivation 'g copying '/nix/store/vrm9 evaluating derivation 'g copying '/nix/store/vrm9 evaluating derivation 'g copying '/nix/store/vrm9 evaluating derivation 'g copying '/nix/store/vrm9 evaluating derivation 'g copying '/nix/store/vrm9 evaluating derivation 'g copying '/nix/store/vrm9 evaluating derivation 'g copying '/nix/store/vrm9 evaluating derivation 'g copying '/nix/store/vrm9 evaluating derivation 'g copying '/nix/store/vrm9 evaluating derivation 'g copying '/nix/store/vrm9 evaluating derivation 'g copying '/nix/store/vrm9 evaluating derivation 'g copying '/nix/store/vrm9 evaluating derivation 'g copying '/nix/store/vrm9 evaluating derivation 'g copying '/nix/store/vrm9 evaluating derivation 'g copying '/nix/store/vrm9 evaluating derivation 'g copying '/nix/store/vrm9 evaluating derivation 'g copying '/nix/store/vrm9 evaluating derivation 'g copying '/nix/store/vrm9 evaluating derivation 'g copying '/nix/store/vrm9 evaluating derivation 'g copying '/nix/store/vrm9 evaluating derivation 'g copying '/nix/store/vrm9 evaluating derivation 'g copying '/nix/store/vrm9 evaluating derivation 'g copying '/nix/store/vrm9 evaluating derivation 'g copying '/nix/store/vrm9 evaluating derivation 'g copying '/nix/store/vrm9 evaluating derivation 'g copying '/nix/store/vrm9 evaluating derivation 'g copying '/nix/store/vrm9 evaluating derivation 'g copying '/nix/store/vrm9 evaluating derivation 'g copying '/nix/store/vrm9 evaluating derivation 'g copying '/nix/store/vrm9 evaluating derivation 'g copying '/nix/store/vrm9 evaluating derivation 'g copying '/nix/store/vrm9 evaluating derivation 'g copying '/nix/store/vrm9 evaluating derivation 'g copying '/nix/store/vrm9 evaluating derivation 'g copying '/nix/store/vrm9 evaluating derivation 'g copying '/nix/store/vrm9 evaluating derivation 'g copying '/nix/store/vrm9 evaluating derivation 'g copying '/nix/store/vrm9 evaluating derivation 'g copying '/nix/store/vrm9 evaluating derivation 'g copying '/nix/store/vrm9 evaluating derivation 'g copying '/nix/store/vrm9 evaluating derivation 'g copying '/nix/store/vrm9 evaluating derivation 'g copying '/nix/store/vrm9 evaluating derivation 'g copying '/nix/store/vrm9 evaluating derivation 'g copying '/nix/store/vrm9 evaluating derivation 'g copying '/nix/store/vrm9 evaluating derivation 'g copying '/nix/store/vrm9 evaluating derivation 'g copying '/nix/store/vrm9 evaluating derivation 'g copying '/nix/store/vrm9 evaluating derivation 'g copying '/nix/store/vrm9 evaluating derivation 'g copying '/nix/store/vrm9 evaluating derivation 'g copying '/nix/store/vrm9 evaluating derivation 'g copying '/nix/store/vrm9 evaluating derivation 'g copying '/nix/store/vrm9 evaluating derivation 'g copying '/nix/store/vrm9 evaluating derivation 'g copying '/nix/store/vrm9 evaluating derivation 'g copying '/nix/store/vrm9 evaluating derivation 'g copying '/nix/store/vrm9 evaluating derivation 'g copying '/nix/store/vrm9 evaluating derivation 'g copying '/nix/store/vrm9 evaluating derivation 'g copying '/nix/store/vrm9 evaluating derivation 'g copying '/nix/store/vrm9 evaluating derivation 'g copying '/nix/store/vrm9 evaluating derivation 'g copying '/nix/store/vrm9 evaluating derivation 'g copying '/nix/store/vrm9 evaluating derivation 'g copying '/nix/store/vrm9 evaluating derivation 'g copying '/nix/store/vrm9 evaluating derivation 'g copying '/nix/store/vrm9 evaluating derivation 'g copying '/nix/store/vrm9 evaluating derivation 'g copying '/nix/store/vrm9 evaluating derivation 'g copying '/nix/store/vrm9 evaluating derivation 'g copying '/nix/store/vrm9 evaluating derivation 'g querying info about miss querying gammaloop-nexte [82.5 KiB DL] querying i [0/35 built, 16/0/123 cobuilder.pl> structuredAttrs is enabled
  26. 108.06 s [1/0/33 built, 16/12/129 [1/0/33 built, 16/14/129builder.pl> Running phase: patchPhase
  27. 108.07 s [1/0/32 built, 16/18/129builder.pl> Running phase: updateAutotoolsGnuConfigScriptsPhase
  28. 108.07 s [1/0/32 built, 16/19/129builder.pl> Running phase: configurePhase
  29. 108.09 s builder.pl> no configure script, doing nothing
  30. 108.09 s builder.pl> Running phase: buildPhase
  31. 108.09 s builder.pl> Running phase: checkPhase
  32. 108.10 s builder.pl> Running phase: installPhase
  33. 108.10 s builder.pl> no Makefile or custom installPhase, doing nothing
  34. 108.10 s [1/0/32 built, 15/20/129 [1/0/32 built, 16/20/129builder.pl> Running phase: fixupPhase
  35. 108.12 s builder.pl> shrinking RPATHs of ELF executables and libraries in /nix/store/8l4s0n61pskzsgr2ccdfj70fd3vcz0gv-builder.pl
  36. 108.12 s [1/0/28 built, 16/26/129builder.pl> checking for references to /build/ in /nix/store/8l4s0n61pskzsgr2ccdfj70fd3vcz0gv-builder.pl...
  37. 108.13 s builder.pl> patching script interpreter paths in /nix/store/8l4s0n61pskzsgr2ccdfj70fd3vcz0gv-builder.pl
  38. 108.17 s [1/0/27 built, 16/27/129builder.pl (post)> Uploading to the NixCI cache: /nix/store/8l4s0n61pskzsgr2ccdfj70fd3vcz0gv-builder.pl
  39. 108.23 s builder.pl (post)> warning: 'warn-short-path-literals' is deprecated, use 'lint-short-path-literals = ignore' instead
  40. 108.26 s builder.pl (post)> copying 0 paths...
  41. 108.33 s builder.pl (post)> warning: 'warn-short-path-literals' is deprecated, use 'lint-short-path-literals = ignore' instead
  42. 108.38 s builder.pl (post)> copying 0 paths...
  43. 109.53 s [1/27 built, 12/40/129 c [1/22 built, 16/52/129 c [1/16 built, 10/65/129 c [1/15 built, 7/69/129 co [1/15 built, 10/70/129 c [1/15 built, 8/74/129 co [1/15 built, 7/76/129 co [1/15 built, 6/77/129 co [1/15 built, 16/78/129 c [1/15 built, 16/83/129 c [1/14 built, 16/88/129 c [1/14 built, 16/93/129 c [1/14 built, 12/101/129 [1/14 built, 10/107/129 [1/14 built, 8/112/129 c [1/14 built, 8/113/129 c [1/14 built, 10/114/129 [1/14 built, 9/115/129 c [1/12 built, 7/118/129 c [1/1/12 built, 7/118/129builder.pl> Running phase: patchPhase
  44. 109.54 s builder.pl> Running phase: updateAutotoolsGnuConfigScriptsPhase
  45. 109.54 s builder.pl> Running phase: configurePhase
  46. 109.55 s builder.pl> no configure script, doing nothing
  47. 109.55 s builder.pl> Running phase: buildPhase
  48. 109.56 s builder.pl> Running phase: checkPhase
  49. 109.57 s builder.pl> Running phase: installPhase
  50. 109.57 s builder.pl> no Makefile or custom installPhase, doing nothing
  51. 109.57 s builder.pl> Running phase: fixupPhase
  52. 109.58 s builder.pl> shrinking RPATHs of ELF executables and libraries in /nix/store/zzmspl8wdn2a3ancrz8dg3kci887nw6d-builder.pl
  53. 109.58 s builder.pl> checking for references to /build/ in /nix/store/zzmspl8wdn2a3ancrz8dg3kci887nw6d-builder.pl...
  54. 109.59 s builder.pl> patching script interpreter paths in /nix/store/zzmspl8wdn2a3ancrz8dg3kci887nw6d-builder.pl
  55. 109.63 s builder.pl (post)> Uploading to the NixCI cache: /nix/store/zzmspl8wdn2a3ancrz8dg3kci887nw6d-builder.pl
  56. 109.68 s builder.pl (post)> warning: 'warn-short-path-literals' is deprecated, use 'lint-short-path-literals = ignore' instead
  57. 109.71 s builder.pl (post)> copying 0 paths...
  58. 109.78 s builder.pl (post)> warning: 'warn-short-path-literals' is deprecated, use 'lint-short-path-literals = ignore' instead
  59. 109.97 s builder.pl (post)> copying 0 paths...
  60. 110.07 s [2/10 built, 5/121/129 c [1/2/10 built, 5/121/129python3> structuredAttrs is enabled
  61. 110.12 s [2/2/9 built, 4/122/129 gammaloop-nextest-binaries-docs (post)> Uploading to the NixCI cache: /nix/store/09dflkfmbb737lmzjjm9r37s8dsvvs85-gammaloop-nextest-binaries-docs
  62. 110.16 s gammaloop-nextest-binaries-docs (post)> warning: 'warn-short-path-literals' is deprecated, use 'lint-short-path-literals = ignore' instead
  63. 110.19 s gammaloop-nextest-binaries-docs (post)> copying 0 paths...
  64. 110.25 s gammaloop-nextest-binaries-docs (post)> warning: 'warn-short-path-literals' is deprecated, use 'lint-short-path-literals = ignore' instead
  65. 110.78 s gammaloop-nextest-binaries-docs (post)> copying 132 paths...
  66. 110.79 s gammaloop-nextest-binaries-docs (post)> copying path '/nix/store/1sz1l1nkpvrb4d3lyc1fqrpwji4djj9q-gammaloop-ci-consumer-alphal00p-docs-macros-Cargo.toml.drv' to 'https://cache.nix-ci.com'...
  67. 110.79 s gammaloop-nextest-binaries-docs (post)> copying path '/nix/store/2gndszg5xg9pa6z0c28639aywcbmry02-lib.rs' to 'https://cache.nix-ci.com'...
  68. 110.79 s gammaloop-nextest-binaries-docs (post)> copying path '/nix/store/0jm84k8v1z2gy75rhz8khr0vkr4idhxl-python' to 'https://cache.nix-ci.com'...
  69. 110.79 s gammaloop-nextest-binaries-docs (post)> copying path '/nix/store/05dzfrixjbs8r7n27fcgxlb2lpla15nq-gammaloop-ci-test-dependencies-af7a65a287a68871-Cargo.toml.drv' to 'https://cache.nix-ci.com'...
  70. 110.79 s gammaloop-nextest-binaries-docs (post)> copying path '/nix/store/1h1kjw9p70qg22ncc01zbb0dyc4isgjx-gammaloop-ci-consumer-alphal00p-docs-builder-Cargo.toml.drv' to 'https://cache.nix-ci.com'...
  71. 110.79 s gammaloop-nextest-binaries-docs (post)> copying path '/nix/store/4q5v8s8yb3gs966hvy4p60p3lriajdci-gammaloop-ci-test-binary-dependencies-9fe7ede979bdcacd-alphal00p-docs-builder-dev-dependency.toml.drv' to 'https://cache.nix-ci.com'...
  72. 110.79 s gammaloop-nextest-binaries-docs (post)> copying path '/nix/store/2lswdjv3ymxn7zn9nnvj708ib9hd4y51-reduction.rs' to 'https://cache.nix-ci.com'...
  73. 110.79 s gammaloop-nextest-binaries-docs (post)> copying path '/nix/store/57w5hqbrhanwhyqyvaanab6h188l7yrx-gammaloop-ci-test-dependencies-4052d721f3844397-Cargo.toml.drv' to 'https://cache.nix-ci.com'...
  74. 110.79 s gammaloop-nextest-binaries-docs (post)> copying path '/nix/store/2b5dh48rj2ccigxwj0cki69537yrgy15-gammaloop-ci-test-binary-dependencies-af7a65a287a68871-Cargo.toml.drv' to 'https://cache.nix-ci.com'...
  75. 110.79 s gammaloop-nextest-binaries-docs (post)> copying path '/nix/store/4iiwxpwxcgb0n92w1p735bv90xlbbg4i-mod.rs' to 'https://cache.nix-ci.com'...
  76. 110.79 s gammaloop-nextest-binaries-docs (post)> copying path '/nix/store/2g91lzb44ld4via7l0a7dkyr78lahyh2-gammaloop-ci-test-dependencies-4d9caea84e60f802-Cargo.toml.drv' to 'https://cache.nix-ci.com'...
  77. 110.79 s gammaloop-nextest-binaries-docs (post)> copying path '/nix/store/25bfpfaiz81hh12iydv90apvrliwx8gp-lib.rs' to 'https://cache.nix-ci.com'...
  78. 110.79 s gammaloop-nextest-binaries-docs (post)> copying path '/nix/store/5234ahjn787qg41ncywghdahzizsb84d-process.rs' to 'https://cache.nix-ci.com'...
  79. 110.79 s gammaloop-nextest-binaries-docs (post)> copying path '/nix/store/27azbbpd9dxhjmpa8kviacnfaqfxhm83-gammaloop-ci-consumer-alphal00p-docs-examples-Cargo.toml.drv' to 'https://cache.nix-ci.com'...
  80. 110.79 s gammaloop-nextest-binaries-docs (post)> copying path '/nix/store/6zv8a2k31y335w4y52vlm9jflga240wc-builder.rs' to 'https://cache.nix-ci.com'...
  81. 110.79 s gammaloop-nextest-binaries-docs (post)> copying path '/nix/store/2fipxnxpr1p0lzcjkkq9h9q2l8m67q90-gammaloop-ci-test-binary-dependencies-af7a65a287a68871-alphal00p-docs-examples-dev-dependency.toml.drv' to 'https://cache.nix-ci.com'...
  82. 110.98 s gammaloop-nextest-binaries-docs (post)> copying path '/nix/store/7cr5ijgh1wfrq8zwy05gsbpm9fa4dnj6-dense.rs' to 'https://cache.nix-ci.com'...
  83. 110.98 s gammaloop-nextest-binaries-docs (post)> copying path '/nix/store/7n07q27yw28dsjif9v6f9i0ygpw3k2rc-gammaloop-ci-test-dependencies-6d53902ba346d136-Cargo.toml.drv' to 'https://cache.nix-ci.com'...
  84. 110.99 s gammaloop-nextest-binaries-docs (post)> copying path '/nix/store/7w4367gppqrkwy5bxb7jqbg3i5ycbyr4-gammaloop-ci-consumer-alphal00p-docs-builder-Cargo.toml.drv' to 'https://cache.nix-ci.com'...
  85. 111.00 s gammaloop-nextest-binaries-docs (post)> copying path '/nix/store/8kcri10w8q1fszylr1c7zqm767k21v2n-gammaloop-ci-consumer-alphal00p-docs-schema-Cargo.toml.drv' to 'https://cache.nix-ci.com'...
  86. 111.00 s gammaloop-nextest-binaries-docs (post)> copying path '/nix/store/8q4f16a17rlvrm0pwqp6yqzg2nhx67lf-mod.rs' to 'https://cache.nix-ci.com'...
  87. 111.00 s gammaloop-nextest-binaries-docs (post)> copying path '/nix/store/947jrm09zds0yqyy9hjnk0g7yc634m0l-gammaloop-ci-test-binary-dependencies-9fe7ede979bdcacd-Cargo.toml.drv' to 'https://cache.nix-ci.com'...
  88. 111.01 s gammaloop-nextest-binaries-docs (post)> copying path '/nix/store/9g8i5vdjbq9dva4dsd7xy5d0p68rnpdi-gammaloop-ci-consumer-alphal00p-docs-macros-Cargo.toml.drv' to 'https://cache.nix-ci.com'...
  89. 111.02 s gammaloop-nextest-binaries-docs (post)> copying path '/nix/store/9rqyq6kcvkg0361qf9zj1ki9z0lkzdvv-mod.rs' to 'https://cache.nix-ci.com'...
  90. 111.02 s gammaloop-nextest-binaries-docs (post)> copying path '/nix/store/a1amn479b5h421pn0cf3y8l8ql79klpw-integrate.rs' to 'https://cache.nix-ci.com'...
  91. 111.02 s gammaloop-nextest-binaries-docs (post)> copying path '/nix/store/a3b6f4l19rm8gwy52bb9zy6pgj4mmlss-source' to 'https://cache.nix-ci.com'...
  92. 111.04 s gammaloop-nextest-binaries-docs (post)> copying path '/nix/store/aiargdsbhprk782mpy34zda5rnmjw9wa-source' to 'https://cache.nix-ci.com'...
  93. 111.05 s gammaloop-nextest-binaries-docs (post)> copying path '/nix/store/b26jgff95bbrk9wgvxw2qwkxifj4lkvj-lib.rs' to 'https://cache.nix-ci.com'...
  94. 111.06 s gammaloop-nextest-binaries-docs (post)> copying path '/nix/store/b4yg18ilmfncyrf4rs7b9wfwjdb4k02z-gammaloop-ci-consumer-alphal00p-docs-catalogs-Cargo.toml.drv' to 'https://cache.nix-ci.com'...
  95. 111.10 s gammaloop-nextest-binaries-docs (post)> copying path '/nix/store/bdg9n9x157nfpy3z1z667l0mhmz7pmkr-integrand_info.rs' to 'https://cache.nix-ci.com'...
  96. 111.11 s gammaloop-nextest-binaries-docs (post)> copying path '/nix/store/c58y3za8mgp0wilp2b198ddjw290987v-lib.rs' to 'https://cache.nix-ci.com'...
  97. 111.14 s gammaloop-nextest-binaries-docs (post)> copying path '/nix/store/ccwfwqr7fkcd6g1n3wchv8fdb3lkpnnc-gammaloop-ci-consumer-alphal00p-docs-schema-Cargo.toml.drv' to 'https://cache.nix-ci.com'...
  98. 111.14 s gammaloop-nextest-binaries-docs (post)> copying path '/nix/store/d05lkrj37fyz5a3icn8hx2byl2gd63wr-gammaloop-ci-test-binary-dependencies-3aaa664f10485d63-alphal00p-docs-python-exporter-dev-dependency.toml.drv' to 'https://cache.nix-ci.com'...
  99. 111.16 s gammaloop-nextest-binaries-docs (post)> copying path '/nix/store/d703b3lk4cm039rj45h97k9hp3s71f0r-products' to 'https://cache.nix-ci.com'...
  100. 111.17 s gammaloop-nextest-binaries-docs (post)> copying path '/nix/store/dk3mzkxfircq66mchf3c88n5842vqvi2-source' to 'https://cache.nix-ci.com'...
  101. 111.17 s gammaloop-nextest-binaries-docs (post)> copying path '/nix/store/f9w032dij74y1wxyr8wll43bm36q5gxa-examples.toml' to 'https://cache.nix-ci.com'...
  102. 111.17 s gammaloop-nextest-binaries-docs (post)> copying path '/nix/store/fqibb5kxsl4bdlszg2yyr4fs5367q56q-source' to 'https://cache.nix-ci.com'...
  103. 111.21 s gammaloop-nextest-binaries-docs (post)> copying path '/nix/store/g74ccjdlj376a0pz34jr0hjhwz0abiaj-lib.rs' to 'https://cache.nix-ci.com'...
  104. 111.23 s gammaloop-nextest-binaries-docs (post)> copying path '/nix/store/gv45kw7savj7c20h1vr3lp4xzyjcgpzi-lib.rs' to 'https://cache.nix-ci.com'...
  105. 111.25 s gammaloop-nextest-binaries-docs (post)> copying path '/nix/store/h529wv11jdj6gnlfawijrfl3hpzks6h0-involution.rs' to 'https://cache.nix-ci.com'...
  106. 111.26 s gammaloop-nextest-binaries-docs (post)> copying path '/nix/store/h5c286hxm09y1j5xgdihl95pspr98vhm-source' to 'https://cache.nix-ci.com'...
  107. 111.27 s gammaloop-nextest-binaries-docs (post)> copying path '/nix/store/hhiy40csli429l5gd4bfpjmnss3bfc3y-source' to 'https://cache.nix-ci.com'...
  108. 111.28 s gammaloop-nextest-binaries-docs (post)> copying path '/nix/store/hsxckkarvqgrrg2sga088adxgf0zgca3-state.rs' to 'https://cache.nix-ci.com'...
  109. 111.29 s gammaloop-nextest-binaries-docs (post)> copying path '/nix/store/ih4rs715vmy5kd060nzb1wbp1q3mdnq4-model.rs' to 'https://cache.nix-ci.com'...
  110. 111.29 s gammaloop-nextest-binaries-docs (post)> copying path '/nix/store/j5sslwa6gnp34szzg068qk2plg5yzh5w-gammaloop-ci-consumer-alphal00p-docs-catalogs-Cargo.toml.drv' to 'https://cache.nix-ci.com'...
  111. 111.30 s gammaloop-nextest-binaries-docs (post)> copying path '/nix/store/j8cwimhgnvcalqgkjh2calfp9awrz3s9-cook.rs' to 'https://cache.nix-ci.com'...
  112. 111.33 s gammaloop-nextest-binaries-docs (post)> copying path '/nix/store/jcx4kj3nr6vny041946rlaxziya65x5m-source' to 'https://cache.nix-ci.com'...
  113. 111.37 s gammaloop-nextest-binaries-docs (post)> copying path '/nix/store/jl3y9hwsd102634wyjj0q8asjw76sp73-source' to 'https://cache.nix-ci.com'...
  114. 111.39 s gammaloop-nextest-binaries-docs (post)> copying path '/nix/store/k9bkkcg076wzc1wyn7g3kk4q3ixqrrmd-gammaloop-ci-consumer-alphal00p-docs-examples-Cargo.toml.drv' to 'https://cache.nix-ci.com'...
  115. 111.46 s gammaloop-nextest-binaries-docs (post)> copying path '/nix/store/kqpx9mcmsr6zbalh9b6kcyxwz89kqkwp-source.drv' to 'https://cache.nix-ci.com'...
  116. 111.48 s gammaloop-nextest-binaries-docs (post)> copying path '/nix/store/l817w5bp4nss2qj5gqp8q19y1i04fcqj-subgraph.rs' to 'https://cache.nix-ci.com'...
  117. 111.54 s gammaloop-nextest-binaries-docs (post)> copying path '/nix/store/l8kzwzn444n8p2j7nisp30g8kdwas1vb-source' to 'https://cache.nix-ci.com'...
  118. 111.54 s gammaloop-nextest-binaries-docs (post)> copying path '/nix/store/lc0q08s4xsmybq2xbw5afrx5j3wpg00w-tree.rs' to 'https://cache.nix-ci.com'...
  119. 111.57 s gammaloop-nextest-binaries-docs (post)> copying path '/nix/store/m0myxh98hi81f9zzsj96k3lc3kdsgrgz-mod.rs' to 'https://cache.nix-ci.com'...
  120. 111.63 s gammaloop-nextest-binaries-docs (post)> copying path '/nix/store/mfkgifncvlfmpky3pk7lm5dw8r4qvjkf-source' to 'https://cache.nix-ci.com'...
  121. 111.63 s gammaloop-nextest-binaries-docs (post)> copying path '/nix/store/mvj8q2jab7ivdiqb6h50khgrj7mfynnj-structure.rs' to 'https://cache.nix-ci.com'...
  122. 111.63 s gammaloop-nextest-binaries-docs (post)> copying path '/nix/store/nc1rzr49r7980wv020z7v350aj7i7as2-source' to 'https://cache.nix-ci.com'...
  123. 111.64 s gammaloop-nextest-binaries-docs (post)> copying path '/nix/store/p4yy4h9nkwnp1gw3sk748v7dmmr34z97-parametric.rs' to 'https://cache.nix-ci.com'...
  124. 111.69 s gammaloop-nextest-binaries-docs (post)> copying path '/nix/store/p812v792v7l89xq76x7vj1mw0j2sm5fw-generate.rs' to 'https://cache.nix-ci.com'...
  125. 111.77 s gammaloop-nextest-binaries-docs (post)> copying path '/nix/store/pi9nbnhdbb332dv4hbzkgqj4cd7mmv3f-source' to 'https://cache.nix-ci.com'...
  126. 111.79 s gammaloop-nextest-binaries-docs (post)> copying path '/nix/store/pk5dj7bmcjy9akby8wi12z09h03g7g16-epsilon.rs' to 'https://cache.nix-ci.com'...
  127. 111.82 s gammaloop-nextest-binaries-docs (post)> copying path '/nix/store/psxqjcksxihinx1qb14ah6pddv86rqzd-source' to 'https://cache.nix-ci.com'...
  128. 111.88 s gammaloop-nextest-binaries-docs (post)> copying path '/nix/store/q8dw9bffwrm4l0nxfiadds8h1ixsr2wq-sparse.rs' to 'https://cache.nix-ci.com'...
  129. 111.98 s gammaloop-nextest-binaries-docs (post)> copying path '/nix/store/qhr7d8c97nvm81g8qciqvbdq7ik9mq3a-lib.rs' to 'https://cache.nix-ci.com'...
  130. 111.99 s gammaloop-nextest-binaries-docs (post)> copying path '/nix/store/qpjfpa4dp7h2iacccqlcb2qd1s6yb7ps-gammaloop-ci-test-binary-dependencies-3aaa664f10485d63-Cargo.toml.drv' to 'https://cache.nix-ci.com'...
  131. 112.05 s gammaloop-nextest-binaries-docs (post)> copying path '/nix/store/qvvvpid6lng5vl9s78d15xc2lix9r8m9-source' to 'https://cache.nix-ci.com'...
  132. 112.21 s gammaloop-nextest-binaries-docs (post)> copying path '/nix/store/r5k5kr3sy2hmj76cs0nfrxzyyjchim57-pyproject.toml' to 'https://cache.nix-ci.com'...
  133. 112.36 s gammaloop-nextest-binaries-docs (post)> copying path '/nix/store/rarph8yjq5r983lzr64bnqiivwgqxzvh-representations.rs' to 'https://cache.nix-ci.com'...
  134. 112.39 s gammaloop-nextest-binaries-docs (post)> copying path '/nix/store/rh07ybxk1acacsk7c6y2l9fqc9idkliz-source' to 'https://cache.nix-ci.com'...
  135. 112.59 s gammaloop-nextest-binaries-docs (post)> copying path '/nix/store/s6yqmhx7bhngvippwfg81dwlk78kxqhg-momentum.rs' to 'https://cache.nix-ci.com'...
  136. 112.77 s gammaloop-nextest-binaries-docs (post)> copying path '/nix/store/swgwvi57lmihiydn0ds5kwxp57mkj19l-source' to 'https://cache.nix-ci.com'...
  137. 113.30 s gammaloop-nextest-binaries-docs (post)> copying path '/nix/store/swsgzic8ppzqgi859jv8cq1bd5rh89y0-source' to 'https://cache.nix-ci.com'...
  138. 113.81 s gammaloop-nextest-binaries-docs (post)> copying path '/nix/store/v5kcv550i27nkiknx2zvk4xymzvljif4-source' to 'https://cache.nix-ci.com'...
  139. 113.85 s gammaloop-nextest-binaries-docs (post)> copying path '/nix/store/w3qnzqs8kyvhzp2h1pfsq2m76xd97wvy-lib.rs' to 'https://cache.nix-ci.com'...
  140. 114.04 s gammaloop-nextest-binaries-docs (post)> copying path '/nix/store/wq6c0x4dgyvhwajhy109ix9inszwf9gw-source.drv' to 'https://cache.nix-ci.com'...
  141. 114.08 s gammaloop-nextest-binaries-docs (post)> copying path '/nix/store/x31nc0dpfyxjr6wk43y2r8qbsmxj7s0y-symbolic_parallelism.rs' to 'https://cache.nix-ci.com'...
  142. 114.08 s gammaloop-nextest-binaries-docs (post)> copying path '/nix/store/x6ysaxrlhxwfpj38zrs4m1cvfddyi439-model.rs' to 'https://cache.nix-ci.com'...
  143. 114.22 s gammaloop-nextest-binaries-docs (post)> copying path '/nix/store/xgf9hkgb52qmak1yxadjkqnrpwyzn35m-generation.rs' to 'https://cache.nix-ci.com'...
  144. 114.24 s gammaloop-nextest-binaries-docs (post)> copying path '/nix/store/xry0x9ahlhrwxxhcvs4dr0xknmqdwm00-source' to 'https://cache.nix-ci.com'...
  145. 114.26 s gammaloop-nextest-binaries-docs (post)> copying path '/nix/store/xwblykc6l2933ak4whgf0kdwzx2imbc4-session.rs' to 'https://cache.nix-ci.com'...
  146. 114.40 s gammaloop-nextest-binaries-docs (post)> copying path '/nix/store/z2sr1q91b55v5lm7l5fqdd5a7cih0ryz-gammaloop-crate-test-dependencies-3aaa664f10485d63-inputs.drv' to 'https://cache.nix-ci.com'...
  147. 114.44 s gammaloop-nextest-binaries-docs (post)> copying path '/nix/store/z72w3g7bifmf65x36c1mp5dsx6c2l40a-gammaloop-ci-test-dependencies-9fe7ede979bdcacd-Cargo.toml.drv' to 'https://cache.nix-ci.com'...
  148. 114.45 s gammaloop-nextest-binaries-docs (post)> copying path '/nix/store/z7ki32937rkawypyswpq6pw5jnck8d5h-gammaloop-ci-test-dependencies-3aaa664f10485d63-Cargo.toml.drv' to 'https://cache.nix-ci.com'...
  149. 114.49 s gammaloop-nextest-binaries-docs (post)> copying path '/nix/store/zfn8hdsjh8lfpnngwv9abqnr8fqzi3bx-contract.rs' to 'https://cache.nix-ci.com'...
  150. 114.55 s gammaloop-nextest-binaries-docs (post)> copying path '/nix/store/8p325r5rpbhg4dwl7diql5llmrk8jlar-source.drv' to 'https://cache.nix-ci.com'...
  151. 114.58 s gammaloop-nextest-binaries-docs (post)> copying path '/nix/store/azxrazblw2phmw7vg5bf5r63rsdj0g08-gammaloop-crate-alphal00p-docs-macros-dependency-deps-deps-0.1.0.drv' to 'https://cache.nix-ci.com'...
  152. 114.60 s gammaloop-nextest-binaries-docs (post)> copying path '/nix/store/spv6g6az8c5r0qdim63ldr4d9r3x187y-source.drv' to 'https://cache.nix-ci.com'...
  153. 114.70 s gammaloop-nextest-binaries-docs (post)> copying path '/nix/store/fay60277mryyxnwpqrcxymp2r3kdy8gf-source.drv' to 'https://cache.nix-ci.com'...
  154. 114.71 s gammaloop-nextest-binaries-docs (post)> copying path '/nix/store/q0icj0sajhcpq7swz3c6gxq56yrdqc93-gammaloop-crate-test-dependencies-3aaa664f10485d63-deps-0.1.0.drv' to 'https://cache.nix-ci.com'...
  155. 114.74 s gammaloop-nextest-binaries-docs (post)> copying path '/nix/store/l6y5kjfc6dnax1wsdra0iq7wlxbpl4px-gammaloop-crate-alphal00p-docs-schema-dependency-deps-deps-0.1.0.drv' to 'https://cache.nix-ci.com'...
  156. 114.87 s gammaloop-nextest-binaries-docs (post)> copying path '/nix/store/ydmrv2bbvfr638fdn9yqs4xhfiz09sf7-gammaloop-crate-test-binaries-alphal00p-docs-python-exporter-3aaa664f10485d63-deps-0.1.0.drv' to 'https://cache.nix-ci.com'...
  157. 114.91 s gammaloop-nextest-binaries-docs (post)> copying path '/nix/store/vrj1rpmchm9x6pddx6x0iqfh9517z6xh-gammaloop-crate-alphal00p-docs-schema-dependency-deps-0.1.0.drv' to 'https://cache.nix-ci.com'...
  158. 115.04 s gammaloop-nextest-binaries-docs (post)> copying path '/nix/store/lja4swc2lg1s1mjbz0gz0cnj5p82gh4g-gammaloop-nextest-binaries-docs-alphal00p-docs-python-exporter-0.1.0.drv' to 'https://cache.nix-ci.com'...
  159. 115.07 s gammaloop-nextest-binaries-docs (post)> copying path '/nix/store/xqmih78iqh8242yi82y6sqydh471al6k-gammaloop-crate-alphal00p-docs-builder-dependency-deps-inputs.drv' to 'https://cache.nix-ci.com'...
  160. 115.07 s gammaloop-nextest-binaries-docs (post)> copying path '/nix/store/kbxql8bhx8090di48cqlby6b1fsgzacm-gammaloop-crate-test-dependencies-4052d721f3844397-inputs.drv' to 'https://cache.nix-ci.com'...
  161. 115.21 s gammaloop-nextest-binaries-docs (post)> copying path '/nix/store/afx6xigbbb7rwrwq06x4mrk45h2cmpk3-gammaloop-crate-alphal00p-docs-builder-dependency-deps-deps-0.1.0.drv' to 'https://cache.nix-ci.com'...
  162. 115.21 s gammaloop-nextest-binaries-docs (post)> copying path '/nix/store/v1p1m50kg07aq7jkd74xcy12dmwbjlma-gammaloop-crate-test-dependencies-4052d721f3844397-deps-0.1.0.drv' to 'https://cache.nix-ci.com'...
  163. 115.35 s gammaloop-nextest-binaries-docs (post)> copying path '/nix/store/659nzfljazz3hj276jj2m2zz9ncb7ll8-gammaloop-crate-test-binaries-alphal00p-docs-schema-4052d721f3844397-deps-0.1.0.drv' to 'https://cache.nix-ci.com'...
  164. 115.36 s gammaloop-nextest-binaries-docs (post)> copying path '/nix/store/mbjq3hrh7aryl64zx66gna67apxwi4fs-gammaloop-crate-alphal00p-docs-builder-dependency-inputs.drv' to 'https://cache.nix-ci.com'...
  165. 115.49 s gammaloop-nextest-binaries-docs (post)> copying path '/nix/store/qfd1x2a3cd28mvhy3nd91grk04c701dc-gammaloop-crate-alphal00p-docs-builder-dependency-deps-0.1.0.drv' to 'https://cache.nix-ci.com'...
  166. 115.50 s gammaloop-nextest-binaries-docs (post)> copying path '/nix/store/53xikvyvg702606m9y7lycb5z0ny41jq-gammaloop-nextest-binaries-docs-alphal00p-docs-schema-0.1.0.drv' to 'https://cache.nix-ci.com'...
  167. 115.64 s gammaloop-nextest-binaries-docs (post)> copying path '/nix/store/yd0k051khvqa704sa2zz5lg3fqf02gf4-gammaloop-crate-test-dependencies-9fe7ede979bdcacd-inputs.drv' to 'https://cache.nix-ci.com'...
  168. 115.75 s gammaloop-nextest-binaries-docs (post)> copying path '/nix/store/jggmvp2bknk1nv6041vnqp4cd00bnmcx-source.drv' to 'https://cache.nix-ci.com'...
  169. 115.75 s gammaloop-nextest-binaries-docs (post)> copying path '/nix/store/hyqcb25yhh2cnpqkqg4fapn5m6sjq1qp-source.drv' to 'https://cache.nix-ci.com'...
  170. 115.75 s gammaloop-nextest-binaries-docs (post)> copying path '/nix/store/ab630vpssmbjz6qv2bsbm3nrfdhrxknq-source.drv' to 'https://cache.nix-ci.com'...
  171. 115.75 s gammaloop-nextest-binaries-docs (post)> copying path '/nix/store/1wqwgk07r08mkhbpf3dzgyp26gwylkrh-source.drv' to 'https://cache.nix-ci.com'...
  172. 115.77 s gammaloop-nextest-binaries-docs (post)> copying path '/nix/store/vi8b0lwp20r0vb1907z2ycg31an7ky76-gammaloop-crate-test-dependencies-9fe7ede979bdcacd-deps-0.1.0.drv' to 'https://cache.nix-ci.com'...
  173. 115.88 s gammaloop-nextest-binaries-docs (post)> copying path '/nix/store/j5dh9psamzirwxhq6vg8mk5bwfw1yni0-gammaloop-crate-alphal00p-docs-macros-dependency-deps-0.1.0.drv' to 'https://cache.nix-ci.com'...
  174. 116.02 s gammaloop-nextest-binaries-docs (post)> copying path '/nix/store/3rzhzxh4jjal1jnxaidpa3q143w26826-gammaloop-crate-test-dependencies-6d53902ba346d136-inputs.drv' to 'https://cache.nix-ci.com'...
  175. 116.02 s gammaloop-nextest-binaries-docs (post)> copying path '/nix/store/xba98g5zwgwh4h4ga0arinyfv916g6i5-gammaloop-crate-alphal00p-docs-catalogs-dependency-deps-inputs.drv' to 'https://cache.nix-ci.com'...
  176. 116.15 s gammaloop-nextest-binaries-docs (post)> copying path '/nix/store/dpv2flv15nmxz7lgpabyvx3w8vxly96a-gammaloop-crate-test-dependencies-6d53902ba346d136-deps-0.1.0.drv' to 'https://cache.nix-ci.com'...
  177. 116.16 s gammaloop-nextest-binaries-docs (post)> copying path '/nix/store/8x8fa0bxwc14m9f4sf69051qjxyflmhq-gammaloop-crate-alphal00p-docs-catalogs-dependency-deps-deps-0.1.0.drv' to 'https://cache.nix-ci.com'...
  178. 116.17 s gammaloop-nextest-binaries-docs (post)> copying path '/nix/store/zppkvlhsdrvw4f3v2l5k1829rcfyjcbg-source.drv' to 'https://cache.nix-ci.com'...
  179. 116.29 s gammaloop-nextest-binaries-docs (post)> copying path '/nix/store/hbhpcbk20ghll32albhzxp5lq0wfwcrl-gammaloop-crate-test-binaries-alphal00p-docs-macros-6d53902ba346d136-deps-0.1.0.drv' to 'https://cache.nix-ci.com'...
  180. 116.31 s gammaloop-nextest-binaries-docs (post)> copying path '/nix/store/pgiqlnaw1n0dcfwmixnag116zap70rk3-gammaloop-crate-alphal00p-docs-catalogs-dependency-inputs.drv' to 'https://cache.nix-ci.com'...
  181. 116.42 s gammaloop-nextest-binaries-docs (post)> copying path '/nix/store/4bwlcs09nhli5bvg2jvgggz7j3xg2fyi-gammaloop-nextest-binaries-docs-alphal00p-docs-macros-0.1.0.drv' to 'https://cache.nix-ci.com'...
  182. 116.43 s gammaloop-nextest-binaries-docs (post)> copying path '/nix/store/81z3j1x1bvz4cr8qylsr91q4xifpspv3-gammaloop-crate-alphal00p-docs-catalogs-dependency-deps-0.1.0.drv' to 'https://cache.nix-ci.com'...
  183. 116.58 s gammaloop-nextest-binaries-docs (post)> copying path '/nix/store/xzkslplw8s2bkfbrmi0fjii0xvbf3vrh-gammaloop-crate-test-dependencies-4d9caea84e60f802-inputs.drv' to 'https://cache.nix-ci.com'...
  184. 116.58 s gammaloop-nextest-binaries-docs (post)> copying path '/nix/store/i3y6jg2m84ja2g984wg9fh3nrmiyhpsf-gammaloop-crate-alphal00p-docs-examples-dependency-deps-inputs.drv' to 'https://cache.nix-ci.com'...
  185. 116.72 s gammaloop-nextest-binaries-docs (post)> copying path '/nix/store/86p6z7igcykyfi5nimcm8g8hc06sv4rp-gammaloop-crate-test-dependencies-4d9caea84e60f802-deps-0.1.0.drv' to 'https://cache.nix-ci.com'...
  186. 116.74 s gammaloop-nextest-binaries-docs (post)> copying path '/nix/store/whjmac635vy7a563layrqb0232s6p8f2-gammaloop-crate-alphal00p-docs-examples-dependency-deps-deps-0.1.0.drv' to 'https://cache.nix-ci.com'...
  187. 116.88 s gammaloop-nextest-binaries-docs (post)> copying path '/nix/store/54rfdi5yyyaby1scq8iv0b014zmmbxfb-gammaloop-crate-test-binaries-alphal00p-docs-builder-9fe7ede979bdcacd-deps-0.1.0.drv' to 'https://cache.nix-ci.com'...
  188. 116.89 s gammaloop-nextest-binaries-docs (post)> copying path '/nix/store/vj2x6aym14c8q67a8cy2iswgjsj165jp-gammaloop-crate-alphal00p-docs-examples-dependency-inputs.drv' to 'https://cache.nix-ci.com'...
  189. 117.02 s gammaloop-nextest-binaries-docs (post)> copying path '/nix/store/24rvvrrvi39rpkjzpmcdqmvmn27s4n9g-gammaloop-nextest-binaries-docs-alphal00p-docs-builder-0.1.0.drv' to 'https://cache.nix-ci.com'...
  190. 117.02 s gammaloop-nextest-binaries-docs (post)> copying path '/nix/store/5il28plp7x1m23h583a15d4hmyp5xcvq-gammaloop-crate-alphal00p-docs-examples-dependency-deps-0.1.0.drv' to 'https://cache.nix-ci.com'...
  191. 117.11 s gammaloop-nextest-binaries-docs (post)> copying path '/nix/store/i8lvs2q32c9vac00yfvnzxrb3sc335zd-gammaloop-crate-test-binaries-alphal00p-docs-catalogs-4d9caea84e60f802-deps-0.1.0.drv' to 'https://cache.nix-ci.com'...
  192. 117.18 s gammaloop-nextest-binaries-docs (post)> copying path '/nix/store/25fzpry25y010n5qk9yim35lmwa45gcg-gammaloop-crate-test-dependencies-af7a65a287a68871-inputs.drv' to 'https://cache.nix-ci.com'...
  193. 117.28 s gammaloop-nextest-binaries-docs (post)> copying path '/nix/store/bsx4i5y6rg9gb7xyj9vaiqjzwlidr4zn-gammaloop-nextest-binaries-docs-alphal00p-docs-catalogs-0.1.0.drv' to 'https://cache.nix-ci.com'...
  194. 125.46 s gammaloop-nextest-binaries-docs (post)> copying path '/nix/store/x81r3yqyz55qsx4y4cxxx3yjc6r2bjs8-gammaloop-crate-test-dependencies-af7a65a287a68871-deps-0.1.0.drv' to 'https://cache.nix-ci.com'...
  195. 125.60 s gammaloop-nextest-binaries-docs (post)> copying path '/nix/store/4dzrcfl5y500y77vbx9iqpibbkpd2i5p-gammaloop-crate-test-binaries-alphal00p-docs-examples-af7a65a287a68871-deps-0.1.0.drv' to 'https://cache.nix-ci.com'...
  196. 126.38 s gammaloop-nextest-binaries-docs (post)> copying path '/nix/store/nfmzkr5jy9h2s0wl8yx4r5a2by8x7c0y-gammaloop-nextest-binaries-docs-alphal00p-docs-examples-0.1.0.drv' to 'https://cache.nix-ci.com'...
  197. 126.51 s gammaloop-nextest-binaries-docs (post)> copying path '/nix/store/kmfmm7z0kz4rr047jry7xrckfy7sawfn-gammaloop-nextest-binaries-docs.drv' to 'https://cache.nix-ci.com'...
  198. 126.72 s python3> created 227 symlinks in user environment
  199. 126.76 s [1/3/9 built, 126/129 co [1/3/8 built, 2/126/129 python3 (post)> Uploading to the NixCI cache: /nix/store/f6fan92527vlpn6frzipn50020yw45nw-python3-3.13.15-env
  200. 126.82 s python3 (post)> warning: 'warn-short-path-literals' is deprecated, use 'lint-short-path-literals = ignore' instead
  201. 126.86 s python3 (post)> copying 0 paths...
  202. 126.91 s python3 (post)> warning: 'warn-short-path-literals' is deprecated, use 'lint-short-path-literals = ignore' instead
  203. 127.00 s python3 (post)> copying 0 paths...
  204. 127.07 s [4/8 built, 2/127/129 cotypst> structuredAttrs is enabled
  205. 127.13 s [1/4/6 built, 129 copiedtypst> created 10 symlinks in user environment
  206. 127.22 s typst (post)> Uploading to the NixCI cache: /nix/store/5f1a3n27fy3y8pf6snxr2sbzwhk9brr2-typst-0.15.1-env
  207. 127.26 s typst (post)> warning: 'warn-short-path-literals' is deprecated, use 'lint-short-path-literals = ignore' instead
  208. 127.29 s typst (post)> copying 0 paths...
  209. 127.34 s typst (post)> warning: 'warn-short-path-literals' is deprecated, use 'lint-short-path-literals = ignore' instead
  210. 127.58 s typst (post)> copying 0 paths...
  211. 128.14 s [5/7 built, 129 copied ( [1/5/6 built, 129 copiedgammaloop-nextest-docs> Nextest worker budget: 16
  212. 128.15 s gammaloop-nextest-docs> Extracting 5 binaries (including 3 non-test binaries) and 1 linked path to /build/source
  213. 128.37 s gammaloop-nextest-docs> Extracted 14 files to /build/source in 0.22s
  214. 128.38 s gammaloop-nextest-docs> ------------
  215. 128.38 s gammaloop-nextest-docs> Nextest run ID ae779cb1-9250-486b-8dd6-db50429a359f with nextest profile: ci_gammaloop
  216. 128.38 s gammaloop-nextest-docs> Starting 98 tests across 2 binaries
  217. 128.41 s gammaloop-nextest-docs> FAIL [ 0.014s] (15/98) alphal00p-docs-builder tests::developer_architecture_is_classified_searchable_and_source_backed
  218. 128.41 s gammaloop-nextest-docs> stdout ---
  219. 128.41 s gammaloop-nextest-docs>
  220. 128.41 s gammaloop-nextest-docs> running 1 test
  221. 128.41 s gammaloop-nextest-docs> test tests::developer_architecture_is_classified_searchable_and_source_backed ... FAILED
  222. 128.41 s gammaloop-nextest-docs>
  223. 128.41 s gammaloop-nextest-docs> failures:
  224. 128.41 s gammaloop-nextest-docs>
  225. 128.41 s gammaloop-nextest-docs> failures:
  226. 128.41 s gammaloop-nextest-docs> tests::developer_architecture_is_classified_searchable_and_source_backed
  227. 128.41 s gammaloop-nextest-docs>
  228. 128.41 s gammaloop-nextest-docs> test result: FAILED. 0 passed; 1 failed; 0 ignored; 0 measured; 97 filtered out; finished in 0.01s
  229. 128.41 s gammaloop-nextest-docs>
  230. 128.41 s gammaloop-nextest-docs> stderr ---
  231. 128.41 s gammaloop-nextest-docs>
  232. 128.41 s gammaloop-nextest-docs> thread 'tests::developer_architecture_is_classified_searchable_and_source_backed' (230) panicked at crates/alphal00p-docs-builder/src/lib.rs:12846:14:
  233. 128.41 s gammaloop-nextest-docs> called `Result::unwrap()` on an `Err` value: failed to copy documentation asset crates/spynso3/typst/STIXTwoMath-Regular.woff2
  234. 128.41 s gammaloop-nextest-docs>
  235. 128.41 s gammaloop-nextest-docs> Caused by:
  236. 128.41 s gammaloop-nextest-docs> No such file or directory (os error 2)
  237. 128.41 s gammaloop-nextest-docs>
  238. 128.41 s gammaloop-nextest-docs> Location:
  239. 128.41 s gammaloop-nextest-docs> crates/alphal00p-docs-builder/src/lib.rs:2320:18
  240. 128.41 s gammaloop-nextest-docs> stack backtrace:
  241. 128.41 s gammaloop-nextest-docs> 0: __rustc::rust_begin_unwind
  242. 128.41 s gammaloop-nextest-docs> 1: core::panicking::panic_fmt
  243. 128.41 s gammaloop-nextest-docs> 2: core::result::unwrap_failed
  244. 128.41 s gammaloop-nextest-docs> 3: alphal00p_docs_builder::tests::developer_architecture_is_classified_searchable_and_source_backed
  245. 128.41 s gammaloop-nextest-docs> 4: <alphal00p_docs_builder::tests::developer_architecture_is_classified_searchable_and_source_backed::{closure#0} as core::ops::function::FnOnce<()>>::call_once
  246. 128.41 s gammaloop-nextest-docs> note: Some details are omitted, run with `RUST_BACKTRACE=full` for a verbose backtrace.
  247. 128.41 s gammaloop-nextest-docs>
  248. 128.42 s gammaloop-nextest-docs> FAIL [ 0.015s] (19/98) alphal00p-docs-builder tests::every_product_orients_rust_to_native_rustdoc_and_keeps_legacy_redirects
  249. 128.42 s gammaloop-nextest-docs> stdout ---
  250. 128.42 s gammaloop-nextest-docs>
  251. 128.42 s gammaloop-nextest-docs> running 1 test
  252. 128.42 s gammaloop-nextest-docs> test tests::every_product_orients_rust_to_native_rustdoc_and_keeps_legacy_redirects ... FAILED
  253. 128.42 s gammaloop-nextest-docs>
  254. 128.42 s gammaloop-nextest-docs> failures:
  255. 128.42 s gammaloop-nextest-docs>
  256. 128.42 s gammaloop-nextest-docs> failures:
  257. 128.42 s gammaloop-nextest-docs> tests::every_product_orients_rust_to_native_rustdoc_and_keeps_legacy_redirects
  258. 128.42 s gammaloop-nextest-docs>
  259. 128.42 s gammaloop-nextest-docs> test result: FAILED. 0 passed; 1 failed; 0 ignored; 0 measured; 97 filtered out; finished in 0.01s
  260. 128.42 s gammaloop-nextest-docs>
  261. 128.42 s gammaloop-nextest-docs> stderr ---
  262. 128.42 s gammaloop-nextest-docs>
  263. 128.42 s gammaloop-nextest-docs> thread 'tests::every_product_orients_rust_to_native_rustdoc_and_keeps_legacy_redirects' (260) panicked at crates/alphal00p-docs-builder/src/lib.rs:12650:46:
  264. 128.42 s gammaloop-nextest-docs> called `Result::unwrap()` on an `Err` value: failed to copy documentation asset crates/spynso3/typst/STIXTwoMath-Regular.woff2
  265. 128.42 s gammaloop-nextest-docs>
  266. 128.42 s gammaloop-nextest-docs> Caused by:
  267. 128.42 s gammaloop-nextest-docs> No such file or directory (os error 2)
  268. 128.42 s gammaloop-nextest-docs>
  269. 128.42 s gammaloop-nextest-docs> Location:
  270. 128.42 s gammaloop-nextest-docs> crates/alphal00p-docs-builder/src/lib.rs:2320:18
  271. 128.42 s gammaloop-nextest-docs> stack backtrace:
  272. 128.42 s gammaloop-nextest-docs> 0: __rustc::rust_begin_unwind
  273. 128.42 s gammaloop-nextest-docs> 1: core::panicking::panic_fmt
  274. 128.42 s gammaloop-nextest-docs> 2: core::result::unwrap_failed
  275. 128.42 s gammaloop-nextest-docs> 3: alphal00p_docs_builder::tests::every_product_orients_rust_to_native_rustdoc_and_keeps_legacy_redirects
  276. 128.42 s gammaloop-nextest-docs> 4: <alphal00p_docs_builder::tests::every_product_orients_rust_to_native_rustdoc_and_keeps_legacy_redirects::{closure#0} as core::ops::function::FnOnce<()>>::call_once
  277. 128.42 s gammaloop-nextest-docs> note: Some details are omitted, run with `RUST_BACKTRACE=full` for a verbose backtrace.
  278. 128.42 s gammaloop-nextest-docs>
  279. 128.47 s gammaloop-nextest-docs> FAIL [ 0.012s] (44/98) alphal00p-docs-builder tests::portal_and_developer_pages_use_federated_search_and_feedback
  280. 128.47 s gammaloop-nextest-docs> stdout ---
  281. 128.47 s gammaloop-nextest-docs>
  282. 128.47 s gammaloop-nextest-docs> running 1 test
  283. 128.47 s gammaloop-nextest-docs> test tests::portal_and_developer_pages_use_federated_search_and_feedback ... FAILED
  284. 128.47 s gammaloop-nextest-docs>
  285. 128.47 s gammaloop-nextest-docs> failures:
  286. 128.47 s gammaloop-nextest-docs>
  287. 128.47 s gammaloop-nextest-docs> failures:
  288. 128.47 s gammaloop-nextest-docs> tests::portal_and_developer_pages_use_federated_search_and_feedback
  289. 128.47 s gammaloop-nextest-docs>
  290. 128.47 s gammaloop-nextest-docs> test result: FAILED. 0 passed; 1 failed; 0 ignored; 0 measured; 97 filtered out; finished in 0.01s
  291. 128.47 s gammaloop-nextest-docs>
  292. 128.47 s gammaloop-nextest-docs> stderr ---
  293. 128.47 s gammaloop-nextest-docs>
  294. 128.47 s gammaloop-nextest-docs> thread 'tests::portal_and_developer_pages_use_federated_search_and_feedback' (386) panicked at crates/alphal00p-docs-builder/src/lib.rs:9747:14:
  295. 128.47 s gammaloop-nextest-docs> called `Result::unwrap()` on an `Err` value: failed to copy documentation asset crates/spynso3/typst/STIXTwoMath-Regular.woff2
  296. 128.47 s gammaloop-nextest-docs>
  297. 128.47 s gammaloop-nextest-docs> Caused by:
  298. 128.47 s gammaloop-nextest-docs> No such file or directory (os error 2)
  299. 128.47 s gammaloop-nextest-docs>
  300. 128.47 s gammaloop-nextest-docs> Location:
  301. 128.47 s gammaloop-nextest-docs> crates/alphal00p-docs-builder/src/lib.rs:2320:18
  302. 128.47 s gammaloop-nextest-docs> stack backtrace:
  303. 128.47 s gammaloop-nextest-docs> 0: __rustc::rust_begin_unwind
  304. 128.47 s gammaloop-nextest-docs> 1: core::panicking::panic_fmt
  305. 128.47 s gammaloop-nextest-docs> 2: core::result::unwrap_failed
  306. 128.47 s gammaloop-nextest-docs> 3: alphal00p_docs_builder::tests::write_test_portal
  307. 128.47 s gammaloop-nextest-docs> 4: alphal00p_docs_builder::tests::portal_and_developer_pages_use_federated_search_and_feedback
  308. 128.47 s gammaloop-nextest-docs> 5: <alphal00p_docs_builder::tests::portal_and_developer_pages_use_federated_search_and_feedback::{closure#0} as core::ops::function::FnOnce<()>>::call_once
  309. 128.47 s gammaloop-nextest-docs> note: Some details are omitted, run with `RUST_BACKTRACE=full` for a verbose backtrace.
  310. 128.47 s gammaloop-nextest-docs>
  311. 128.47 s gammaloop-nextest-docs> FAIL [ 0.012s] (45/98) alphal00p-docs-builder tests::portal_task_chooser_routes_each_goal_to_the_registered_quickstart
  312. 128.47 s gammaloop-nextest-docs> stdout ---
  313. 128.47 s gammaloop-nextest-docs>
  314. 128.47 s gammaloop-nextest-docs> running 1 test
  315. 128.47 s gammaloop-nextest-docs> test tests::portal_task_chooser_routes_each_goal_to_the_registered_quickstart ... FAILED
  316. 128.47 s gammaloop-nextest-docs>
  317. 128.47 s gammaloop-nextest-docs> failures:
  318. 128.47 s gammaloop-nextest-docs>
  319. 128.47 s gammaloop-nextest-docs> failures:
  320. 128.47 s gammaloop-nextest-docs> tests::portal_task_chooser_routes_each_goal_to_the_registered_quickstart
  321. 128.47 s gammaloop-nextest-docs>
  322. 128.47 s gammaloop-nextest-docs> test result: FAILED. 0 passed; 1 failed; 0 ignored; 0 measured; 97 filtered out; finished in 0.01s
  323. 128.47 s gammaloop-nextest-docs>
  324. 128.47 s gammaloop-nextest-docs> stderr ---
  325. 128.47 s gammaloop-nextest-docs>
  326. 128.47 s gammaloop-nextest-docs> thread 'tests::portal_task_chooser_routes_each_goal_to_the_registered_quickstart' (401) panicked at crates/alphal00p-docs-builder/src/lib.rs:9747:14:
  327. 128.47 s gammaloop-nextest-docs> called `Result::unwrap()` on an `Err` value: failed to copy documentation asset crates/spynso3/typst/STIXTwoMath-Regular.woff2
  328. 128.47 s gammaloop-nextest-docs>
  329. 128.47 s gammaloop-nextest-docs> Caused by:
  330. 128.47 s gammaloop-nextest-docs> No such file or directory (os error 2)
  331. 128.47 s gammaloop-nextest-docs>
  332. 128.47 s gammaloop-nextest-docs> Location:
  333. 128.47 s gammaloop-nextest-docs> crates/alphal00p-docs-builder/src/lib.rs:2320:18
  334. 128.47 s gammaloop-nextest-docs> stack backtrace:
  335. 128.47 s gammaloop-nextest-docs> 0: __rustc::rust_begin_unwind
  336. 128.47 s gammaloop-nextest-docs> 1: core::panicking::panic_fmt
  337. 128.47 s gammaloop-nextest-docs> 2: core::result::unwrap_failed
  338. 128.47 s gammaloop-nextest-docs> 3: alphal00p_docs_builder::tests::write_test_portal
  339. 128.47 s gammaloop-nextest-docs> 4: alphal00p_docs_builder::tests::portal_task_chooser_routes_each_goal_to_the_registered_quickstart
  340. 128.47 s gammaloop-nextest-docs> 5: <alphal00p_docs_builder::tests::portal_task_chooser_routes_each_goal_to_the_registered_quickstart::{closure#0} as core::ops::function::FnOnce<()>>::call_once
  341. 128.47 s gammaloop-nextest-docs> note: Some details are omitted, run with `RUST_BACKTRACE=full` for a verbose backtrace.
  342. 128.47 s gammaloop-nextest-docs>
  343. 128.47 s gammaloop-nextest-docs> FAIL [ 0.015s] (46/98) alphal00p-docs-builder tests::portal_emits_routes_and_valid_assets
  344. 128.47 s gammaloop-nextest-docs> stdout ---
  345. 128.47 s gammaloop-nextest-docs>
  346. 128.47 s gammaloop-nextest-docs> running 1 test
  347. 128.47 s gammaloop-nextest-docs> test tests::portal_emits_routes_and_valid_assets ... FAILED
  348. 128.47 s gammaloop-nextest-docs>
  349. 128.47 s gammaloop-nextest-docs> failures:
  350. 128.47 s gammaloop-nextest-docs>
  351. 128.47 s gammaloop-nextest-docs> failures:
  352. 128.47 s gammaloop-nextest-docs> tests::portal_emits_routes_and_valid_assets
  353. 128.47 s gammaloop-nextest-docs>
  354. 128.47 s gammaloop-nextest-docs> test result: FAILED. 0 passed; 1 failed; 0 ignored; 0 measured; 97 filtered out; finished in 0.01s
  355. 128.47 s gammaloop-nextest-docs>
  356. 128.47 s gammaloop-nextest-docs> stderr ---
  357. 128.47 s gammaloop-nextest-docs>
  358. 128.47 s gammaloop-nextest-docs> thread 'tests::portal_emits_routes_and_valid_assets' (398) panicked at crates/alphal00p-docs-builder/src/lib.rs:9747:14:
  359. 128.47 s gammaloop-nextest-docs> called `Result::unwrap()` on an `Err` value: failed to copy documentation asset crates/spynso3/typst/STIXTwoMath-Regular.woff2
  360. 128.47 s gammaloop-nextest-docs>
  361. 128.47 s gammaloop-nextest-docs> Caused by:
  362. 128.47 s gammaloop-nextest-docs> No such file or directory (os error 2)
  363. 128.47 s gammaloop-nextest-docs>
  364. 128.47 s gammaloop-nextest-docs> Location:
  365. 128.47 s gammaloop-nextest-docs> crates/alphal00p-docs-builder/src/lib.rs:2320:18
  366. 128.47 s gammaloop-nextest-docs> stack backtrace:
  367. 128.47 s gammaloop-nextest-docs> 0: __rustc::rust_begin_unwind
  368. 128.47 s gammaloop-nextest-docs> 1: core::panicking::panic_fmt
  369. 128.47 s gammaloop-nextest-docs> 2: core::result::unwrap_failed
  370. 128.47 s gammaloop-nextest-docs> 3: alphal00p_docs_builder::tests::write_test_portal
  371. 128.47 s gammaloop-nextest-docs> 4: alphal00p_docs_builder::tests::portal_emits_routes_and_valid_assets
  372. 128.47 s gammaloop-nextest-docs> 5: <alphal00p_docs_builder::tests::portal_emits_routes_and_valid_assets::{closure#0} as core::ops::function::FnOnce<()>>::call_once
  373. 128.47 s gammaloop-nextest-docs> note: Some details are omitted, run with `RUST_BACKTRACE=full` for a verbose backtrace.
  374. 128.47 s gammaloop-nextest-docs>
  375. 128.54 s gammaloop-nextest-docs> FAIL [ 0.012s] (79/98) alphal00p-docs-builder tests::site_assets_replace_read_only_generated_files
  376. 128.54 s gammaloop-nextest-docs> stdout ---
  377. 128.54 s gammaloop-nextest-docs>
  378. 128.54 s gammaloop-nextest-docs> running 1 test
  379. 128.54 s gammaloop-nextest-docs> test tests::site_assets_replace_read_only_generated_files ... FAILED
  380. 128.54 s gammaloop-nextest-docs>
  381. 128.54 s gammaloop-nextest-docs> failures:
  382. 128.54 s gammaloop-nextest-docs>
  383. 128.54 s gammaloop-nextest-docs> failures:
  384. 128.54 s gammaloop-nextest-docs> tests::site_assets_replace_read_only_generated_files
  385. 128.54 s gammaloop-nextest-docs>
  386. 128.54 s gammaloop-nextest-docs> test result: FAILED. 0 passed; 1 failed; 0 ignored; 0 measured; 97 filtered out; finished in 0.01s
  387. 128.54 s gammaloop-nextest-docs>
  388. 128.54 s gammaloop-nextest-docs> stderr ---
  389. 128.54 s gammaloop-nextest-docs>
  390. 128.54 s gammaloop-nextest-docs> thread 'tests::site_assets_replace_read_only_generated_files' (658) panicked at crates/alphal00p-docs-builder/src/lib.rs:12396:50:
  391. 128.54 s gammaloop-nextest-docs> called `Result::unwrap()` on an `Err` value: failed to copy documentation asset crates/spynso3/typst/STIXTwoMath-Regular.woff2
  392. 128.54 s gammaloop-nextest-docs>
  393. 128.54 s gammaloop-nextest-docs> Caused by:
  394. 128.54 s gammaloop-nextest-docs> No such file or directory (os error 2)
  395. 128.54 s gammaloop-nextest-docs>
  396. 128.54 s gammaloop-nextest-docs> Location:
  397. 128.54 s gammaloop-nextest-docs> crates/alphal00p-docs-builder/src/lib.rs:2320:18
  398. 128.54 s gammaloop-nextest-docs> stack backtrace:
  399. 128.54 s gammaloop-nextest-docs> 0: __rustc::rust_begin_unwind
  400. 128.54 s gammaloop-nextest-docs> 1: core::panicking::panic_fmt
  401. 128.54 s gammaloop-nextest-docs> 2: core::result::unwrap_failed
  402. 128.54 s gammaloop-nextest-docs> 3: alphal00p_docs_builder::tests::site_assets_replace_read_only_generated_files
  403. 128.54 s gammaloop-nextest-docs> 4: <alphal00p_docs_builder::tests::site_assets_replace_read_only_generated_files::{closure#0} as core::ops::function::FnOnce<()>>::call_once
  404. 128.54 s gammaloop-nextest-docs> note: Some details are omitted, run with `RUST_BACKTRACE=full` for a verbose backtrace.
  405. 128.54 s gammaloop-nextest-docs>
  406. 128.57 s gammaloop-nextest-docs> FAIL [ 0.185s] (87/98) alphal00p-docs-builder tests::checked_in_registry_is_valid
  407. 128.57 s gammaloop-nextest-docs> stdout ---
  408. 128.57 s gammaloop-nextest-docs>
  409. 128.57 s gammaloop-nextest-docs> running 1 test
  410. 128.57 s gammaloop-nextest-docs> test tests::checked_in_registry_is_valid ... FAILED
  411. 128.57 s gammaloop-nextest-docs>
  412. 128.57 s gammaloop-nextest-docs> failures:
  413. 128.57 s gammaloop-nextest-docs>
  414. 128.57 s gammaloop-nextest-docs> failures:
  415. 128.57 s gammaloop-nextest-docs> tests::checked_in_registry_is_valid
  416. 128.57 s gammaloop-nextest-docs>
  417. 128.57 s gammaloop-nextest-docs> test result: FAILED. 0 passed; 1 failed; 0 ignored; 0 measured; 97 filtered out; finished in 0.18s
  418. 128.57 s gammaloop-nextest-docs>
  419. 128.57 s gammaloop-nextest-docs> stderr ---
  420. 128.57 s gammaloop-nextest-docs>
  421. 128.57 s gammaloop-nextest-docs> thread 'tests::checked_in_registry_is_valid' (199) panicked at crates/alphal00p-docs-builder/src/lib.rs:12351:50:
  422. 128.57 s gammaloop-nextest-docs> called `Result::unwrap()` on an `Err` value: required documentation source is missing: /build/source/crates/spynso3/typst/STIXTwoMath-Regular.woff2
  423. 128.57 s gammaloop-nextest-docs>
  424. 128.57 s gammaloop-nextest-docs> Location:
  425. 128.57 s gammaloop-nextest-docs> crates/alphal00p-docs-builder/src/lib.rs:5166:9
  426. 128.57 s gammaloop-nextest-docs> stack backtrace:
  427. 128.57 s gammaloop-nextest-docs> 0: __rustc::rust_begin_unwind
  428. 128.57 s gammaloop-nextest-docs> 1: core::panicking::panic_fmt
  429. 128.57 s gammaloop-nextest-docs> 2: core::result::unwrap_failed
  430. 128.57 s gammaloop-nextest-docs> 3: alphal00p_docs_builder::tests::checked_in_registry_is_valid
  431. 128.57 s gammaloop-nextest-docs> 4: <alphal00p_docs_builder::tests::checked_in_registry_is_valid::{closure#0} as core::ops::function::FnOnce<()>>::call_once
  432. 128.57 s gammaloop-nextest-docs> note: Some details are omitted, run with `RUST_BACKTRACE=full` for a verbose backtrace.
  433. 128.57 s gammaloop-nextest-docs>
  434. 128.57 s gammaloop-nextest-docs> FAIL [ 0.191s] (88/98) alphal00p-docs-builder provenance_tests::each_build_captures_one_revision_before_rendering
  435. 128.57 s gammaloop-nextest-docs> stdout ---
  436. 128.57 s gammaloop-nextest-docs>
  437. 128.57 s gammaloop-nextest-docs> running 1 test
  438. 128.57 s gammaloop-nextest-docs>
  439. 128.57 s gammaloop-nextest-docs> running 1 test
  440. 128.57 s gammaloop-nextest-docs> test provenance_tests::each_build_captures_one_revision_before_rendering ... FAILED
  441. 128.57 s gammaloop-nextest-docs>
  442. 128.57 s gammaloop-nextest-docs> failures:
  443. 128.57 s gammaloop-nextest-docs>
  444. 128.57 s gammaloop-nextest-docs> failures:
  445. 128.57 s gammaloop-nextest-docs> provenance_tests::each_build_captures_one_revision_before_rendering
  446. 128.57 s gammaloop-nextest-docs>
  447. 128.57 s gammaloop-nextest-docs> test result: FAILED. 0 passed; 1 failed; 0 ignored; 0 measured; 97 filtered out; finished in 0.17s
  448. 128.57 s gammaloop-nextest-docs>
  449. 128.57 s gammaloop-nextest-docs> test provenance_tests::each_build_captures_one_revision_before_rendering ... FAILED
  450. 128.57 s gammaloop-nextest-docs>
  451. 128.57 s gammaloop-nextest-docs> failures:
  452. 128.57 s gammaloop-nextest-docs>
  453. 128.57 s gammaloop-nextest-docs> failures:
  454. 128.57 s gammaloop-nextest-docs> provenance_tests::each_build_captures_one_revision_before_rendering
  455. 128.57 s gammaloop-nextest-docs>
  456. 128.57 s gammaloop-nextest-docs> test result: FAILED. 0 passed; 1 failed; 0 ignored; 0 measured; 97 filtered out; finished in 0.18s
  457. 128.57 s gammaloop-nextest-docs>
  458. 128.57 s gammaloop-nextest-docs> stderr ---
  459. 128.57 s gammaloop-nextest-docs>
  460. 128.57 s gammaloop-nextest-docs> thread 'provenance_tests::each_build_captures_one_revision_before_rendering' (229) panicked at crates/alphal00p-docs-builder/src/provenance_tests.rs:297:14:
  461. 128.57 s gammaloop-nextest-docs> called `Result::unwrap()` on an `Err` value: required documentation source is missing: /build/source/target/nix-ci-tmp/.tmpjZ2Q5a/checkout/crates/spynso3/typst/STIXTwoMath-Regular.woff2
  462. 128.57 s gammaloop-nextest-docs>
  463. 128.57 s gammaloop-nextest-docs> Location:
  464. 128.57 s gammaloop-nextest-docs> crates/alphal00p-docs-builder/src/lib.rs:5166:9
  465. 128.57 s gammaloop-nextest-docs> stack backtrace:
  466. 128.57 s gammaloop-nextest-docs> 0: __rustc::rust_begin_unwind
  467. 128.57 s gammaloop-nextest-docs> 1: core::panicking::panic_fmt
  468. 128.57 s gammaloop-nextest-docs> 2: core::result::unwrap_failed
  469. 128.57 s gammaloop-nextest-docs> 3: alphal00p_docs_builder::provenance_tests::each_build_captures_one_revision_before_rendering
  470. 128.57 s gammaloop-nextest-docs> 4: <alphal00p_docs_builder::provenance_tests::each_build_captures_one_revision_before_rendering::{closure#0} as core::ops::function::FnOnce<()>>::call_once
  471. 128.57 s gammaloop-nextest-docs> note: Some details are omitted, run with `RUST_BACKTRACE=full` for a verbose backtrace.
  472. 128.57 s gammaloop-nextest-docs>
  473. 128.57 s gammaloop-nextest-docs> thread 'provenance_tests::each_build_captures_one_revision_before_rendering' (206) panicked at crates/alphal00p-docs-builder/src/provenance_tests.rs:274:9:
  474. 128.57 s gammaloop-nextest-docs> assertion failed: command.status().unwrap().success()
  475. 128.57 s gammaloop-nextest-docs> stack backtrace:
  476. 128.57 s gammaloop-nextest-docs> 0: __rustc::rust_begin_unwind
  477. 128.57 s gammaloop-nextest-docs> 1: core::panicking::panic_fmt
  478. 128.57 s gammaloop-nextest-docs> 2: core::panicking::panic
  479. 128.57 s gammaloop-nextest-docs> 3: alphal00p_docs_builder::provenance_tests::each_build_captures_one_revision_before_rendering
  480. 128.57 s gammaloop-nextest-docs> 4: <alphal00p_docs_builder::provenance_tests::each_build_captures_one_revision_before_rendering::{closure#0} as core::ops::function::FnOnce<()>>::call_once
  481. 128.57 s gammaloop-nextest-docs> note: Some details are omitted, run with `RUST_BACKTRACE=full` for a verbose backtrace.
  482. 128.57 s gammaloop-nextest-docs>
  483. 128.58 s gammaloop-nextest-docs> FAIL [ 0.184s] (89/98) alphal00p-docs-builder tests::developer_scope_ranges_ignore_unrelated_edits_and_warn_only_while_watching
  484. 128.58 s gammaloop-nextest-docs> stdout ---
  485. 128.58 s gammaloop-nextest-docs>
  486. 128.58 s gammaloop-nextest-docs> running 1 test
  487. 128.58 s gammaloop-nextest-docs> test tests::developer_scope_ranges_ignore_unrelated_edits_and_warn_only_while_watching ... FAILED
  488. 128.58 s gammaloop-nextest-docs>
  489. 128.58 s gammaloop-nextest-docs> failures:
  490. 128.58 s gammaloop-nextest-docs>
  491. 128.58 s gammaloop-nextest-docs> failures:
  492. 128.58 s gammaloop-nextest-docs> tests::developer_scope_ranges_ignore_unrelated_edits_and_warn_only_while_watching
  493. 128.58 s gammaloop-nextest-docs>
  494. 128.58 s gammaloop-nextest-docs> test result: FAILED. 0 passed; 1 failed; 0 ignored; 0 measured; 97 filtered out; finished in 0.18s
  495. 128.58 s gammaloop-nextest-docs>
  496. 128.58 s gammaloop-nextest-docs> stderr ---
  497. 128.58 s gammaloop-nextest-docs>
  498. 128.58 s gammaloop-nextest-docs> thread 'tests::developer_scope_ranges_ignore_unrelated_edits_and_warn_only_while_watching' (240) panicked at crates/alphal00p-docs-builder/src/lib.rs:12441:29:
  499. 128.58 s gammaloop-nextest-docs> called `Result::unwrap()` on an `Err` value: required documentation source is missing: /build/source/crates/spynso3/typst/STIXTwoMath-Regular.woff2
  500. 128.58 s gammaloop-nextest-docs>
  501. 128.58 s gammaloop-nextest-docs> Location:
  502. 128.58 s gammaloop-nextest-docs> crates/alphal00p-docs-builder/src/lib.rs:5166:9
  503. 128.58 s gammaloop-nextest-docs> stack backtrace:
  504. 128.58 s gammaloop-nextest-docs> 0: __rustc::rust_begin_unwind
  505. 128.58 s gammaloop-nextest-docs> 1: core::panicking::panic_fmt
  506. 128.58 s gammaloop-nextest-docs> 2: core::result::unwrap_failed
  507. 128.58 s gammaloop-nextest-docs> 3: alphal00p_docs_builder::tests::developer_scope_ranges_ignore_unrelated_edits_and_warn_only_while_watching
  508. 128.58 s gammaloop-nextest-docs> 4: <alphal00p_docs_builder::tests::developer_scope_ranges_ignore_unrelated_edits_and_warn_only_while_watching::{closure#0} as core::ops::function::FnOnce<()>>::call_once
  509. 128.58 s gammaloop-nextest-docs> note: Some details are omitted, run with `RUST_BACKTRACE=full` for a verbose backtrace.
  510. 128.58 s gammaloop-nextest-docs>
  511. 128.60 s gammaloop-nextest-docs> FAIL [ 0.193s] (90/98) alphal00p-docs-builder tests::every_product_requires_a_task_chooser_and_each_supported_interface
  512. 128.60 s gammaloop-nextest-docs> stdout ---
  513. 128.60 s gammaloop-nextest-docs>
  514. 128.60 s gammaloop-nextest-docs> running 1 test
  515. 128.60 s gammaloop-nextest-docs> test tests::every_product_requires_a_task_chooser_and_each_supported_interface ... FAILED
  516. 128.60 s gammaloop-nextest-docs>
  517. 128.60 s gammaloop-nextest-docs> failures:
  518. 128.60 s gammaloop-nextest-docs>
  519. 128.60 s gammaloop-nextest-docs> failures:
  520. 128.60 s gammaloop-nextest-docs> tests::every_product_requires_a_task_chooser_and_each_supported_interface
  521. 128.60 s gammaloop-nextest-docs>
  522. 128.60 s gammaloop-nextest-docs> test result: FAILED. 0 passed; 1 failed; 0 ignored; 0 measured; 97 filtered out; finished in 0.19s
  523. 128.60 s gammaloop-nextest-docs>
  524. 128.60 s gammaloop-nextest-docs> stderr ---
  525. 128.60 s gammaloop-nextest-docs>
  526. 128.60 s gammaloop-nextest-docs> thread 'tests::every_product_requires_a_task_chooser_and_each_supported_interface' (263) panicked at crates/alphal00p-docs-builder/src/lib.rs:12365:9:
  527. 128.60 s gammaloop-nextest-docs> assertion failed: format!("{error:#}").contains("has no quickstart page")
  528. 128.60 s gammaloop-nextest-docs> stack backtrace:
  529. 128.60 s gammaloop-nextest-docs> 0: __rustc::rust_begin_unwind
  530. 128.60 s gammaloop-nextest-docs> 1: core::panicking::panic_fmt
  531. 128.60 s gammaloop-nextest-docs> 2: core::panicking::panic
  532. 128.60 s gammaloop-nextest-docs> 3: alphal00p_docs_builder::tests::every_product_requires_a_task_chooser_and_each_supported_interface
  533. 128.60 s gammaloop-nextest-docs> 4: <alphal00p_docs_builder::tests::every_product_requires_a_task_chooser_and_each_supported_interface::{closure#0} as core::ops::function::FnOnce<()>>::call_once
  534. 128.60 s gammaloop-nextest-docs> note: Some details are omitted, run with `RUST_BACKTRACE=full` for a verbose backtrace.
  535. 128.60 s gammaloop-nextest-docs>
  536. 128.61 s gammaloop-nextest-docs> FAIL [ 0.168s] (91/98) alphal00p-docs-builder tests::pdf_manual_chapter_order_must_match_the_page_registry
  537. 128.61 s gammaloop-nextest-docs> stdout ---
  538. 128.61 s gammaloop-nextest-docs>
  539. 128.61 s gammaloop-nextest-docs> running 1 test
  540. 128.61 s gammaloop-nextest-docs> test tests::pdf_manual_chapter_order_must_match_the_page_registry ... FAILED
  541. 128.61 s gammaloop-nextest-docs>
  542. 128.61 s gammaloop-nextest-docs> failures:
  543. 128.61 s gammaloop-nextest-docs>
  544. 128.61 s gammaloop-nextest-docs> failures:
  545. 128.61 s gammaloop-nextest-docs> tests::pdf_manual_chapter_order_must_match_the_page_registry
  546. 128.61 s gammaloop-nextest-docs>
  547. 128.61 s gammaloop-nextest-docs> test result: FAILED. 0 passed; 1 failed; 0 ignored; 0 measured; 97 filtered out; finished in 0.16s
  548. 128.61 s gammaloop-nextest-docs>
  549. 128.61 s gammaloop-nextest-docs> stderr ---
  550. 128.61 s gammaloop-nextest-docs>
  551. 128.61 s gammaloop-nextest-docs> thread 'tests::pdf_manual_chapter_order_must_match_the_page_registry' (372) panicked at crates/alphal00p-docs-builder/src/lib.rs:12421:9:
  552. 128.61 s gammaloop-nextest-docs> assertion failed: format!("{error:#}").contains("PDF manual chapter order differs")
  553. 128.61 s gammaloop-nextest-docs> stack backtrace:
  554. 128.61 s gammaloop-nextest-docs> 0: __rustc::rust_begin_unwind
  555. 128.61 s gammaloop-nextest-docs> 1: core::panicking::panic_fmt
  556. 128.61 s gammaloop-nextest-docs> 2: core::panicking::panic
  557. 128.61 s gammaloop-nextest-docs> 3: alphal00p_docs_builder::tests::pdf_manual_chapter_order_must_match_the_page_registry
  558. 128.61 s gammaloop-nextest-docs> 4: <alphal00p_docs_builder::tests::pdf_manual_chapter_order_must_match_the_page_registry::{closure#0} as core::ops::function::FnOnce<()>>::call_once
  559. 128.61 s gammaloop-nextest-docs> note: Some details are omitted, run with `RUST_BACKTRACE=full` for a verbose backtrace.
  560. 128.61 s gammaloop-nextest-docs>
  561. 140.60 s gammaloop-nextest-docs> ------------
  562. 140.60 s gammaloop-nextest-docs> Summary [ 12.217s] 98 tests run: 87 passed, 11 failed, 0 skipped
  563. 140.60 s gammaloop-nextest-docs> FAIL [ 0.014s] (15/98) alphal00p-docs-builder tests::developer_architecture_is_classified_searchable_and_source_backed
  564. 140.60 s gammaloop-nextest-docs> stdout ---
  565. 140.60 s gammaloop-nextest-docs>
  566. 140.60 s gammaloop-nextest-docs> running 1 test
  567. 140.60 s gammaloop-nextest-docs> test tests::developer_architecture_is_classified_searchable_and_source_backed ... FAILED
  568. 140.60 s gammaloop-nextest-docs>
  569. 140.60 s gammaloop-nextest-docs> failures:
  570. 140.60 s gammaloop-nextest-docs>
  571. 140.60 s gammaloop-nextest-docs> failures:
  572. 140.60 s gammaloop-nextest-docs> tests::developer_architecture_is_classified_searchable_and_source_backed
  573. 140.60 s gammaloop-nextest-docs>
  574. 140.60 s gammaloop-nextest-docs> test result: FAILED. 0 passed; 1 failed; 0 ignored; 0 measured; 97 filtered out; finished in 0.01s
  575. 140.60 s gammaloop-nextest-docs>
  576. 140.60 s gammaloop-nextest-docs> stderr ---
  577. 140.60 s gammaloop-nextest-docs>
  578. 140.60 s gammaloop-nextest-docs> thread 'tests::developer_architecture_is_classified_searchable_and_source_backed' (230) panicked at crates/alphal00p-docs-builder/src/lib.rs:12846:14:
  579. 140.60 s gammaloop-nextest-docs> called `Result::unwrap()` on an `Err` value: failed to copy documentation asset crates/spynso3/typst/STIXTwoMath-Regular.woff2
  580. 140.60 s gammaloop-nextest-docs>
  581. 140.60 s gammaloop-nextest-docs> Caused by:
  582. 140.60 s gammaloop-nextest-docs> No such file or directory (os error 2)
  583. 140.60 s gammaloop-nextest-docs>
  584. 140.60 s gammaloop-nextest-docs> Location:
  585. 140.60 s gammaloop-nextest-docs> crates/alphal00p-docs-builder/src/lib.rs:2320:18
  586. 140.60 s gammaloop-nextest-docs> stack backtrace:
  587. 140.60 s gammaloop-nextest-docs> 0: __rustc::rust_begin_unwind
  588. 140.60 s gammaloop-nextest-docs> 1: core::panicking::panic_fmt
  589. 140.60 s gammaloop-nextest-docs> 2: core::result::unwrap_failed
  590. 140.60 s gammaloop-nextest-docs> 3: alphal00p_docs_builder::tests::developer_architecture_is_classified_searchable_and_source_backed
  591. 140.60 s gammaloop-nextest-docs> 4: <alphal00p_docs_builder::tests::developer_architecture_is_classified_searchable_and_source_backed::{closure#0} as core::ops::function::FnOnce<()>>::call_once
  592. 140.60 s gammaloop-nextest-docs> note: Some details are omitted, run with `RUST_BACKTRACE=full` for a verbose backtrace.
  593. 140.60 s gammaloop-nextest-docs>
  594. 140.60 s gammaloop-nextest-docs> FAIL [ 0.015s] (19/98) alphal00p-docs-builder tests::every_product_orients_rust_to_native_rustdoc_and_keeps_legacy_redirects
  595. 140.60 s gammaloop-nextest-docs> stdout ---
  596. 140.60 s gammaloop-nextest-docs>
  597. 140.60 s gammaloop-nextest-docs> running 1 test
  598. 140.60 s gammaloop-nextest-docs> test tests::every_product_orients_rust_to_native_rustdoc_and_keeps_legacy_redirects ... FAILED
  599. 140.60 s gammaloop-nextest-docs>
  600. 140.60 s gammaloop-nextest-docs> failures:
  601. 140.60 s gammaloop-nextest-docs>
  602. 140.60 s gammaloop-nextest-docs> failures:
  603. 140.60 s gammaloop-nextest-docs> tests::every_product_orients_rust_to_native_rustdoc_and_keeps_legacy_redirects
  604. 140.60 s gammaloop-nextest-docs>
  605. 140.60 s gammaloop-nextest-docs> test result: FAILED. 0 passed; 1 failed; 0 ignored; 0 measured; 97 filtered out; finished in 0.01s
  606. 140.60 s gammaloop-nextest-docs>
  607. 140.60 s gammaloop-nextest-docs> stderr ---
  608. 140.60 s gammaloop-nextest-docs>
  609. 140.60 s gammaloop-nextest-docs> thread 'tests::every_product_orients_rust_to_native_rustdoc_and_keeps_legacy_redirects' (260) panicked at crates/alphal00p-docs-builder/src/lib.rs:12650:46:
  610. 140.60 s gammaloop-nextest-docs> called `Result::unwrap()` on an `Err` value: failed to copy documentation asset crates/spynso3/typst/STIXTwoMath-Regular.woff2
  611. 140.60 s gammaloop-nextest-docs>
  612. 140.60 s gammaloop-nextest-docs> Caused by:
  613. 140.60 s gammaloop-nextest-docs> No such file or directory (os error 2)
  614. 140.60 s gammaloop-nextest-docs>
  615. 140.60 s gammaloop-nextest-docs> Location:
  616. 140.60 s gammaloop-nextest-docs> crates/alphal00p-docs-builder/src/lib.rs:2320:18
  617. 140.60 s gammaloop-nextest-docs> stack backtrace:
  618. 140.60 s gammaloop-nextest-docs> 0: __rustc::rust_begin_unwind
  619. 140.60 s gammaloop-nextest-docs> 1: core::panicking::panic_fmt
  620. 140.60 s gammaloop-nextest-docs> 2: core::result::unwrap_failed
  621. 140.60 s gammaloop-nextest-docs> 3: alphal00p_docs_builder::tests::every_product_orients_rust_to_native_rustdoc_and_keeps_legacy_redirects
  622. 140.60 s gammaloop-nextest-docs> 4: <alphal00p_docs_builder::tests::every_product_orients_rust_to_native_rustdoc_and_keeps_legacy_redirects::{closure#0} as core::ops::function::FnOnce<()>>::call_once
  623. 140.60 s gammaloop-nextest-docs> note: Some details are omitted, run with `RUST_BACKTRACE=full` for a verbose backtrace.
  624. 140.60 s gammaloop-nextest-docs>
  625. 140.60 s gammaloop-nextest-docs> FAIL [ 0.012s] (44/98) alphal00p-docs-builder tests::portal_and_developer_pages_use_federated_search_and_feedback
  626. 140.60 s gammaloop-nextest-docs> stdout ---
  627. 140.60 s gammaloop-nextest-docs>
  628. 140.60 s gammaloop-nextest-docs> running 1 test
  629. 140.60 s gammaloop-nextest-docs> test tests::portal_and_developer_pages_use_federated_search_and_feedback ... FAILED
  630. 140.60 s gammaloop-nextest-docs>
  631. 140.60 s gammaloop-nextest-docs> failures:
  632. 140.60 s gammaloop-nextest-docs>
  633. 140.60 s gammaloop-nextest-docs> failures:
  634. 140.60 s gammaloop-nextest-docs> tests::portal_and_developer_pages_use_federated_search_and_feedback
  635. 140.60 s gammaloop-nextest-docs>
  636. 140.60 s gammaloop-nextest-docs> test result: FAILED. 0 passed; 1 failed; 0 ignored; 0 measured; 97 filtered out; finished in 0.01s
  637. 140.60 s gammaloop-nextest-docs>
  638. 140.60 s gammaloop-nextest-docs> stderr ---
  639. 140.60 s gammaloop-nextest-docs>
  640. 140.60 s gammaloop-nextest-docs> thread 'tests::portal_and_developer_pages_use_federated_search_and_feedback' (386) panicked at crates/alphal00p-docs-builder/src/lib.rs:9747:14:
  641. 140.60 s gammaloop-nextest-docs> called `Result::unwrap()` on an `Err` value: failed to copy documentation asset crates/spynso3/typst/STIXTwoMath-Regular.woff2
  642. 140.60 s gammaloop-nextest-docs>
  643. 140.60 s gammaloop-nextest-docs> Caused by:
  644. 140.60 s gammaloop-nextest-docs> No such file or directory (os error 2)
  645. 140.60 s gammaloop-nextest-docs>
  646. 140.60 s gammaloop-nextest-docs> Location:
  647. 140.60 s gammaloop-nextest-docs> crates/alphal00p-docs-builder/src/lib.rs:2320:18
  648. 140.60 s gammaloop-nextest-docs> stack backtrace:
  649. 140.60 s gammaloop-nextest-docs> 0: __rustc::rust_begin_unwind
  650. 140.60 s gammaloop-nextest-docs> 1: core::panicking::panic_fmt
  651. 140.60 s gammaloop-nextest-docs> 2: core::result::unwrap_failed
  652. 140.60 s gammaloop-nextest-docs> 3: alphal00p_docs_builder::tests::write_test_portal
  653. 140.60 s gammaloop-nextest-docs> 4: alphal00p_docs_builder::tests::portal_and_developer_pages_use_federated_search_and_feedback
  654. 140.60 s gammaloop-nextest-docs> 5: <alphal00p_docs_builder::tests::portal_and_developer_pages_use_federated_search_and_feedback::{closure#0} as core::ops::function::FnOnce<()>>::call_once
  655. 140.60 s gammaloop-nextest-docs> note: Some details are omitted, run with `RUST_BACKTRACE=full` for a verbose backtrace.
  656. 140.60 s gammaloop-nextest-docs>
  657. 140.60 s gammaloop-nextest-docs> FAIL [ 0.012s] (45/98) alphal00p-docs-builder tests::portal_task_chooser_routes_each_goal_to_the_registered_quickstart
  658. 140.60 s gammaloop-nextest-docs> stdout ---
  659. 140.60 s gammaloop-nextest-docs>
  660. 140.60 s gammaloop-nextest-docs> running 1 test
  661. 140.60 s gammaloop-nextest-docs> test tests::portal_task_chooser_routes_each_goal_to_the_registered_quickstart ... FAILED
  662. 140.60 s gammaloop-nextest-docs>
  663. 140.60 s gammaloop-nextest-docs> failures:
  664. 140.60 s gammaloop-nextest-docs>
  665. 140.60 s gammaloop-nextest-docs> failures:
  666. 140.60 s gammaloop-nextest-docs> tests::portal_task_chooser_routes_each_goal_to_the_registered_quickstart
  667. 140.60 s gammaloop-nextest-docs>
  668. 140.60 s gammaloop-nextest-docs> test result: FAILED. 0 passed; 1 failed; 0 ignored; 0 measured; 97 filtered out; finished in 0.01s
  669. 140.60 s gammaloop-nextest-docs>
  670. 140.60 s gammaloop-nextest-docs> stderr ---
  671. 140.60 s gammaloop-nextest-docs>
  672. 140.60 s gammaloop-nextest-docs> thread 'tests::portal_task_chooser_routes_each_goal_to_the_registered_quickstart' (401) panicked at crates/alphal00p-docs-builder/src/lib.rs:9747:14:
  673. 140.60 s gammaloop-nextest-docs> called `Result::unwrap()` on an `Err` value: failed to copy documentation asset crates/spynso3/typst/STIXTwoMath-Regular.woff2
  674. 140.60 s gammaloop-nextest-docs>
  675. 140.60 s gammaloop-nextest-docs> Caused by:
  676. 140.60 s gammaloop-nextest-docs> No such file or directory (os error 2)
  677. 140.60 s gammaloop-nextest-docs>
  678. 140.60 s gammaloop-nextest-docs> Location:
  679. 140.60 s gammaloop-nextest-docs> crates/alphal00p-docs-builder/src/lib.rs:2320:18
  680. 140.60 s gammaloop-nextest-docs> stack backtrace:
  681. 140.60 s gammaloop-nextest-docs> 0: __rustc::rust_begin_unwind
  682. 140.60 s gammaloop-nextest-docs> 1: core::panicking::panic_fmt
  683. 140.60 s gammaloop-nextest-docs> 2: core::result::unwrap_failed
  684. 140.60 s gammaloop-nextest-docs> 3: alphal00p_docs_builder::tests::write_test_portal
  685. 140.60 s gammaloop-nextest-docs> 4: alphal00p_docs_builder::tests::portal_task_chooser_routes_each_goal_to_the_registered_quickstart
  686. 140.60 s gammaloop-nextest-docs> 5: <alphal00p_docs_builder::tests::portal_task_chooser_routes_each_goal_to_the_registered_quickstart::{closure#0} as core::ops::function::FnOnce<()>>::call_once
  687. 140.60 s gammaloop-nextest-docs> note: Some details are omitted, run with `RUST_BACKTRACE=full` for a verbose backtrace.
  688. 140.60 s gammaloop-nextest-docs>
  689. 140.60 s gammaloop-nextest-docs> FAIL [ 0.015s] (46/98) alphal00p-docs-builder tests::portal_emits_routes_and_valid_assets
  690. 140.60 s gammaloop-nextest-docs> stdout ---
  691. 140.60 s gammaloop-nextest-docs>
  692. 140.60 s gammaloop-nextest-docs> running 1 test
  693. 140.60 s gammaloop-nextest-docs> test tests::portal_emits_routes_and_valid_assets ... FAILED
  694. 140.60 s gammaloop-nextest-docs>
  695. 140.60 s gammaloop-nextest-docs> failures:
  696. 140.60 s gammaloop-nextest-docs>
  697. 140.60 s gammaloop-nextest-docs> failures:
  698. 140.60 s gammaloop-nextest-docs> tests::portal_emits_routes_and_valid_assets
  699. 140.60 s gammaloop-nextest-docs>
  700. 140.60 s gammaloop-nextest-docs> test result: FAILED. 0 passed; 1 failed; 0 ignored; 0 measured; 97 filtered out; finished in 0.01s
  701. 140.60 s gammaloop-nextest-docs>
  702. 140.60 s gammaloop-nextest-docs> stderr ---
  703. 140.60 s gammaloop-nextest-docs>
  704. 140.60 s gammaloop-nextest-docs> thread 'tests::portal_emits_routes_and_valid_assets' (398) panicked at crates/alphal00p-docs-builder/src/lib.rs:9747:14:
  705. 140.60 s gammaloop-nextest-docs> called `Result::unwrap()` on an `Err` value: failed to copy documentation asset crates/spynso3/typst/STIXTwoMath-Regular.woff2
  706. 140.60 s gammaloop-nextest-docs>
  707. 140.60 s gammaloop-nextest-docs> Caused by:
  708. 140.60 s gammaloop-nextest-docs> No such file or directory (os error 2)
  709. 140.60 s gammaloop-nextest-docs>
  710. 140.60 s gammaloop-nextest-docs> Location:
  711. 140.60 s gammaloop-nextest-docs> crates/alphal00p-docs-builder/src/lib.rs:2320:18
  712. 140.60 s gammaloop-nextest-docs> stack backtrace:
  713. 140.60 s gammaloop-nextest-docs> 0: __rustc::rust_begin_unwind
  714. 140.60 s gammaloop-nextest-docs> 1: core::panicking::panic_fmt
  715. 140.60 s gammaloop-nextest-docs> 2: core::result::unwrap_failed
  716. 140.60 s gammaloop-nextest-docs> 3: alphal00p_docs_builder::tests::write_test_portal
  717. 140.60 s gammaloop-nextest-docs> 4: alphal00p_docs_builder::tests::portal_emits_routes_and_valid_assets
  718. 140.60 s gammaloop-nextest-docs> 5: <alphal00p_docs_builder::tests::portal_emits_routes_and_valid_assets::{closure#0} as core::ops::function::FnOnce<()>>::call_once
  719. 140.60 s gammaloop-nextest-docs> note: Some details are omitted, run with `RUST_BACKTRACE=full` for a verbose backtrace.
  720. 140.60 s gammaloop-nextest-docs>
  721. 140.60 s gammaloop-nextest-docs> FAIL [ 0.012s] (79/98) alphal00p-docs-builder tests::site_assets_replace_read_only_generated_files
  722. 140.60 s gammaloop-nextest-docs> stdout ---
  723. 140.60 s gammaloop-nextest-docs>
  724. 140.60 s gammaloop-nextest-docs> running 1 test
  725. 140.60 s gammaloop-nextest-docs> test tests::site_assets_replace_read_only_generated_files ... FAILED
  726. 140.60 s gammaloop-nextest-docs>
  727. 140.60 s gammaloop-nextest-docs> failures:
  728. 140.60 s gammaloop-nextest-docs>
  729. 140.60 s gammaloop-nextest-docs> failures:
  730. 140.60 s gammaloop-nextest-docs> tests::site_assets_replace_read_only_generated_files
  731. 140.60 s gammaloop-nextest-docs>
  732. 140.60 s gammaloop-nextest-docs> test result: FAILED. 0 passed; 1 failed; 0 ignored; 0 measured; 97 filtered out; finished in 0.01s
  733. 140.60 s gammaloop-nextest-docs>
  734. 140.60 s gammaloop-nextest-docs> stderr ---
  735. 140.60 s gammaloop-nextest-docs>
  736. 140.60 s gammaloop-nextest-docs> thread 'tests::site_assets_replace_read_only_generated_files' (658) panicked at crates/alphal00p-docs-builder/src/lib.rs:12396:50:
  737. 140.60 s gammaloop-nextest-docs> called `Result::unwrap()` on an `Err` value: failed to copy documentation asset crates/spynso3/typst/STIXTwoMath-Regular.woff2
  738. 140.60 s gammaloop-nextest-docs>
  739. 140.60 s gammaloop-nextest-docs> Caused by:
  740. 140.60 s gammaloop-nextest-docs> No such file or directory (os error 2)
  741. 140.60 s gammaloop-nextest-docs>
  742. 140.60 s gammaloop-nextest-docs> Location:
  743. 140.60 s gammaloop-nextest-docs> crates/alphal00p-docs-builder/src/lib.rs:2320:18
  744. 140.60 s gammaloop-nextest-docs> stack backtrace:
  745. 140.60 s gammaloop-nextest-docs> 0: __rustc::rust_begin_unwind
  746. 140.60 s gammaloop-nextest-docs> 1: core::panicking::panic_fmt
  747. 140.60 s gammaloop-nextest-docs> 2: core::result::unwrap_failed
  748. 140.60 s gammaloop-nextest-docs> 3: alphal00p_docs_builder::tests::site_assets_replace_read_only_generated_files
  749. 140.60 s gammaloop-nextest-docs> 4: <alphal00p_docs_builder::tests::site_assets_replace_read_only_generated_files::{closure#0} as core::ops::function::FnOnce<()>>::call_once
  750. 140.60 s gammaloop-nextest-docs> note: Some details are omitted, run with `RUST_BACKTRACE=full` for a verbose backtrace.
  751. 140.60 s gammaloop-nextest-docs>
  752. 140.60 s gammaloop-nextest-docs> FAIL [ 0.185s] (87/98) alphal00p-docs-builder tests::checked_in_registry_is_valid
  753. 140.60 s gammaloop-nextest-docs> stdout ---
  754. 140.60 s gammaloop-nextest-docs>
  755. 140.60 s gammaloop-nextest-docs> running 1 test
  756. 140.60 s gammaloop-nextest-docs> test tests::checked_in_registry_is_valid ... FAILED
  757. 140.60 s gammaloop-nextest-docs>
  758. 140.60 s gammaloop-nextest-docs> failures:
  759. 140.60 s gammaloop-nextest-docs>
  760. 140.60 s gammaloop-nextest-docs> failures:
  761. 140.60 s gammaloop-nextest-docs> tests::checked_in_registry_is_valid
  762. 140.60 s gammaloop-nextest-docs>
  763. 140.60 s gammaloop-nextest-docs> test result: FAILED. 0 passed; 1 failed; 0 ignored; 0 measured; 97 filtered out; finished in 0.18s
  764. 140.60 s gammaloop-nextest-docs>
  765. 140.60 s gammaloop-nextest-docs> stderr ---
  766. 140.60 s gammaloop-nextest-docs>
  767. 140.60 s gammaloop-nextest-docs> thread 'tests::checked_in_registry_is_valid' (199) panicked at crates/alphal00p-docs-builder/src/lib.rs:12351:50:
  768. 140.60 s gammaloop-nextest-docs> called `Result::unwrap()` on an `Err` value: required documentation source is missing: /build/source/crates/spynso3/typst/STIXTwoMath-Regular.woff2
  769. 140.60 s gammaloop-nextest-docs>
  770. 140.60 s gammaloop-nextest-docs> Location:
  771. 140.60 s gammaloop-nextest-docs> crates/alphal00p-docs-builder/src/lib.rs:5166:9
  772. 140.60 s gammaloop-nextest-docs> stack backtrace:
  773. 140.60 s gammaloop-nextest-docs> 0: __rustc::rust_begin_unwind
  774. 140.60 s gammaloop-nextest-docs> 1: core::panicking::panic_fmt
  775. 140.60 s gammaloop-nextest-docs> 2: core::result::unwrap_failed
  776. 140.60 s gammaloop-nextest-docs> 3: alphal00p_docs_builder::tests::checked_in_registry_is_valid
  777. 140.60 s gammaloop-nextest-docs> 4: <alphal00p_docs_builder::tests::checked_in_registry_is_valid::{closure#0} as core::ops::function::FnOnce<()>>::call_once
  778. 140.60 s gammaloop-nextest-docs> note: Some details are omitted, run with `RUST_BACKTRACE=full` for a verbose backtrace.
  779. 140.60 s gammaloop-nextest-docs>
  780. 140.60 s gammaloop-nextest-docs> FAIL [ 0.191s] (88/98) alphal00p-docs-builder provenance_tests::each_build_captures_one_revision_before_rendering
  781. 140.60 s gammaloop-nextest-docs> stdout ---
  782. 140.60 s gammaloop-nextest-docs>
  783. 140.60 s gammaloop-nextest-docs> running 1 test
  784. 140.60 s gammaloop-nextest-docs>
  785. 140.60 s gammaloop-nextest-docs> running 1 test
  786. 140.60 s gammaloop-nextest-docs> test provenance_tests::each_build_captures_one_revision_before_rendering ... FAILED
  787. 140.60 s gammaloop-nextest-docs>
  788. 140.60 s gammaloop-nextest-docs> failures:
  789. 140.60 s gammaloop-nextest-docs>
  790. 140.60 s gammaloop-nextest-docs> failures:
  791. 140.60 s gammaloop-nextest-docs> provenance_tests::each_build_captures_one_revision_before_rendering
  792. 140.60 s gammaloop-nextest-docs>
  793. 140.60 s gammaloop-nextest-docs> test result: FAILED. 0 passed; 1 failed; 0 ignored; 0 measured; 97 filtered out; finished in 0.17s
  794. 140.60 s gammaloop-nextest-docs>
  795. 140.60 s gammaloop-nextest-docs> test provenance_tests::each_build_captures_one_revision_before_rendering ... FAILED
  796. 140.60 s gammaloop-nextest-docs>
  797. 140.60 s gammaloop-nextest-docs> failures:
  798. 140.60 s gammaloop-nextest-docs>
  799. 140.60 s gammaloop-nextest-docs> failures:
  800. 140.60 s gammaloop-nextest-docs> provenance_tests::each_build_captures_one_revision_before_rendering
  801. 140.60 s gammaloop-nextest-docs>
  802. 140.60 s gammaloop-nextest-docs> test result: FAILED. 0 passed; 1 failed; 0 ignored; 0 measured; 97 filtered out; finished in 0.18s
  803. 140.60 s gammaloop-nextest-docs>
  804. 140.60 s gammaloop-nextest-docs> stderr ---
  805. 140.60 s gammaloop-nextest-docs>
  806. 140.60 s gammaloop-nextest-docs> thread 'provenance_tests::each_build_captures_one_revision_before_rendering' (229) panicked at crates/alphal00p-docs-builder/src/provenance_tests.rs:297:14:
  807. 140.60 s gammaloop-nextest-docs> called `Result::unwrap()` on an `Err` value: required documentation source is missing: /build/source/target/nix-ci-tmp/.tmpjZ2Q5a/checkout/crates/spynso3/typst/STIXTwoMath-Regular.woff2
  808. 140.60 s gammaloop-nextest-docs>
  809. 140.60 s gammaloop-nextest-docs> Location:
  810. 140.60 s gammaloop-nextest-docs> crates/alphal00p-docs-builder/src/lib.rs:5166:9
  811. 140.60 s gammaloop-nextest-docs> stack backtrace:
  812. 140.60 s gammaloop-nextest-docs> 0: __rustc::rust_begin_unwind
  813. 140.60 s gammaloop-nextest-docs> 1: core::panicking::panic_fmt
  814. 140.60 s gammaloop-nextest-docs> 2: core::result::unwrap_failed
  815. 140.60 s gammaloop-nextest-docs> 3: alphal00p_docs_builder::provenance_tests::each_build_captures_one_revision_before_rendering
  816. 140.60 s gammaloop-nextest-docs> 4: <alphal00p_docs_builder::provenance_tests::each_build_captures_one_revision_before_rendering::{closure#0} as core::ops::function::FnOnce<()>>::call_once
  817. 140.60 s gammaloop-nextest-docs> note: Some details are omitted, run with `RUST_BACKTRACE=full` for a verbose backtrace.
  818. 140.60 s gammaloop-nextest-docs>
  819. 140.60 s gammaloop-nextest-docs> thread 'provenance_tests::each_build_captures_one_revision_before_rendering' (206) panicked at crates/alphal00p-docs-builder/src/provenance_tests.rs:274:9:
  820. 140.60 s gammaloop-nextest-docs> assertion failed: command.status().unwrap().success()
  821. 140.60 s gammaloop-nextest-docs> stack backtrace:
  822. 140.60 s gammaloop-nextest-docs> 0: __rustc::rust_begin_unwind
  823. 140.60 s gammaloop-nextest-docs> 1: core::panicking::panic_fmt
  824. 140.60 s gammaloop-nextest-docs> 2: core::panicking::panic
  825. 140.60 s gammaloop-nextest-docs> 3: alphal00p_docs_builder::provenance_tests::each_build_captures_one_revision_before_rendering
  826. 140.60 s gammaloop-nextest-docs> 4: <alphal00p_docs_builder::provenance_tests::each_build_captures_one_revision_before_rendering::{closure#0} as core::ops::function::FnOnce<()>>::call_once
  827. 140.60 s gammaloop-nextest-docs> note: Some details are omitted, run with `RUST_BACKTRACE=full` for a verbose backtrace.
  828. 140.60 s gammaloop-nextest-docs>
  829. 140.60 s gammaloop-nextest-docs> FAIL [ 0.184s] (89/98) alphal00p-docs-builder tests::developer_scope_ranges_ignore_unrelated_edits_and_warn_only_while_watching
  830. 140.60 s gammaloop-nextest-docs> stdout ---
  831. 140.60 s gammaloop-nextest-docs>
  832. 140.60 s gammaloop-nextest-docs> running 1 test
  833. 140.60 s gammaloop-nextest-docs> test tests::developer_scope_ranges_ignore_unrelated_edits_and_warn_only_while_watching ... FAILED
  834. 140.60 s gammaloop-nextest-docs>
  835. 140.60 s gammaloop-nextest-docs> failures:
  836. 140.60 s gammaloop-nextest-docs>
  837. 140.60 s gammaloop-nextest-docs> failures:
  838. 140.60 s gammaloop-nextest-docs> tests::developer_scope_ranges_ignore_unrelated_edits_and_warn_only_while_watching
  839. 140.60 s gammaloop-nextest-docs>
  840. 140.60 s gammaloop-nextest-docs> test result: FAILED. 0 passed; 1 failed; 0 ignored; 0 measured; 97 filtered out; finished in 0.18s
  841. 140.60 s gammaloop-nextest-docs>
  842. 140.60 s gammaloop-nextest-docs> stderr ---
  843. 140.60 s gammaloop-nextest-docs>
  844. 140.60 s gammaloop-nextest-docs> thread 'tests::developer_scope_ranges_ignore_unrelated_edits_and_warn_only_while_watching' (240) panicked at crates/alphal00p-docs-builder/src/lib.rs:12441:29:
  845. 140.60 s gammaloop-nextest-docs> called `Result::unwrap()` on an `Err` value: required documentation source is missing: /build/source/crates/spynso3/typst/STIXTwoMath-Regular.woff2
  846. 140.60 s gammaloop-nextest-docs>
  847. 140.60 s gammaloop-nextest-docs> Location:
  848. 140.60 s gammaloop-nextest-docs> crates/alphal00p-docs-builder/src/lib.rs:5166:9
  849. 140.60 s gammaloop-nextest-docs> stack backtrace:
  850. 140.60 s gammaloop-nextest-docs> 0: __rustc::rust_begin_unwind
  851. 140.60 s gammaloop-nextest-docs> 1: core::panicking::panic_fmt
  852. 140.60 s gammaloop-nextest-docs> 2: core::result::unwrap_failed
  853. 140.60 s gammaloop-nextest-docs> 3: alphal00p_docs_builder::tests::developer_scope_ranges_ignore_unrelated_edits_and_warn_only_while_watching
  854. 140.60 s gammaloop-nextest-docs> 4: <alphal00p_docs_builder::tests::developer_scope_ranges_ignore_unrelated_edits_and_warn_only_while_watching::{closure#0} as core::ops::function::FnOnce<()>>::call_once
  855. 140.60 s gammaloop-nextest-docs> note: Some details are omitted, run with `RUST_BACKTRACE=full` for a verbose backtrace.
  856. 140.60 s gammaloop-nextest-docs>
  857. 140.60 s gammaloop-nextest-docs> FAIL [ 0.193s] (90/98) alphal00p-docs-builder tests::every_product_requires_a_task_chooser_and_each_supported_interface
  858. 140.60 s gammaloop-nextest-docs> stdout ---
  859. 140.60 s gammaloop-nextest-docs>
  860. 140.60 s gammaloop-nextest-docs> running 1 test
  861. 140.60 s gammaloop-nextest-docs> test tests::every_product_requires_a_task_chooser_and_each_supported_interface ... FAILED
  862. 140.60 s gammaloop-nextest-docs>
  863. 140.60 s gammaloop-nextest-docs> failures:
  864. 140.60 s gammaloop-nextest-docs>
  865. 140.60 s gammaloop-nextest-docs> failures:
  866. 140.60 s gammaloop-nextest-docs> tests::every_product_requires_a_task_chooser_and_each_supported_interface
  867. 140.60 s gammaloop-nextest-docs>
  868. 140.60 s gammaloop-nextest-docs> test result: FAILED. 0 passed; 1 failed; 0 ignored; 0 measured; 97 filtered out; finished in 0.19s
  869. 140.60 s gammaloop-nextest-docs>
  870. 140.60 s gammaloop-nextest-docs> stderr ---
  871. 140.60 s gammaloop-nextest-docs>
  872. 140.60 s gammaloop-nextest-docs> thread 'tests::every_product_requires_a_task_chooser_and_each_supported_interface' (263) panicked at crates/alphal00p-docs-builder/src/lib.rs:12365:9:
  873. 140.60 s gammaloop-nextest-docs> assertion failed: format!("{error:#}").contains("has no quickstart page")
  874. 140.60 s gammaloop-nextest-docs> stack backtrace:
  875. 140.60 s gammaloop-nextest-docs> 0: __rustc::rust_begin_unwind
  876. 140.60 s gammaloop-nextest-docs> 1: core::panicking::panic_fmt
  877. 140.60 s gammaloop-nextest-docs> 2: core::panicking::panic
  878. 140.60 s gammaloop-nextest-docs> 3: alphal00p_docs_builder::tests::every_product_requires_a_task_chooser_and_each_supported_interface
  879. 140.60 s gammaloop-nextest-docs> 4: <alphal00p_docs_builder::tests::every_product_requires_a_task_chooser_and_each_supported_interface::{closure#0} as core::ops::function::FnOnce<()>>::call_once
  880. 140.60 s gammaloop-nextest-docs> note: Some details are omitted, run with `RUST_BACKTRACE=full` for a verbose backtrace.
  881. 140.60 s gammaloop-nextest-docs>
  882. 140.60 s gammaloop-nextest-docs> FAIL [ 0.168s] (91/98) alphal00p-docs-builder tests::pdf_manual_chapter_order_must_match_the_page_registry
  883. 140.60 s gammaloop-nextest-docs> stdout ---
  884. 140.60 s gammaloop-nextest-docs>
  885. 140.60 s gammaloop-nextest-docs> running 1 test
  886. 140.60 s gammaloop-nextest-docs> test tests::pdf_manual_chapter_order_must_match_the_page_registry ... FAILED
  887. 140.60 s gammaloop-nextest-docs>
  888. 140.60 s gammaloop-nextest-docs> failures:
  889. 140.60 s gammaloop-nextest-docs>
  890. 140.60 s gammaloop-nextest-docs> failures:
  891. 140.60 s gammaloop-nextest-docs> tests::pdf_manual_chapter_order_must_match_the_page_registry
  892. 140.60 s gammaloop-nextest-docs>
  893. 140.60 s gammaloop-nextest-docs> test result: FAILED. 0 passed; 1 failed; 0 ignored; 0 measured; 97 filtered out; finished in 0.16s
  894. 140.60 s gammaloop-nextest-docs>
  895. 140.60 s gammaloop-nextest-docs> stderr ---
  896. 140.60 s gammaloop-nextest-docs>
  897. 140.60 s gammaloop-nextest-docs> thread 'tests::pdf_manual_chapter_order_must_match_the_page_registry' (372) panicked at crates/alphal00p-docs-builder/src/lib.rs:12421:9:
  898. 140.60 s gammaloop-nextest-docs> assertion failed: format!("{error:#}").contains("PDF manual chapter order differs")
  899. 140.60 s gammaloop-nextest-docs> stack backtrace:
  900. 140.60 s gammaloop-nextest-docs> 0: __rustc::rust_begin_unwind
  901. 140.60 s gammaloop-nextest-docs> 1: core::panicking::panic_fmt
  902. 140.60 s gammaloop-nextest-docs> 2: core::panicking::panic
  903. 140.60 s gammaloop-nextest-docs> 3: alphal00p_docs_builder::tests::pdf_manual_chapter_order_must_match_the_page_registry
  904. 140.60 s gammaloop-nextest-docs> 4: <alphal00p_docs_builder::tests::pdf_manual_chapter_order_must_match_the_page_registry::{closure#0} as core::ops::function::FnOnce<()>>::call_once
  905. 140.60 s gammaloop-nextest-docs> note: Some details are omitted, run with `RUST_BACKTRACE=full` for a verbose backtrace.
  906. 140.60 s gammaloop-nextest-docs>
  907. 140.61 s gammaloop-nextest-docs> error: test run failed
  908. 140.63 s gammaloop-nextest-docs>
  909. 140.63 s gammaloop-nextest-docs> ========== nextest test summary ==========
  910. 140.63 s gammaloop-nextest-docs> report: target/nextest/ci_gammaloop/junit.xml
  911. 140.63 s gammaloop-nextest-docs> tests: 98, failures: 11, errors: 0
  912. 140.63 s gammaloop-nextest-docs>
  913. 140.63 s gammaloop-nextest-docs> 1. alphal00p-docs-builder::tests::developer_architecture_is_classified_searchable_and_source_backed
  914. 140.63 s gammaloop-nextest-docs> failure: test failure with exit code 101
  915. 140.63 s gammaloop-nextest-docs> thread 'tests::developer_architecture_is_classified_searchable_and_source_backed' (230) panicked at crates/alphal00p-docs-builder/src/lib.rs:12846:14:
  916. 140.63 s gammaloop-nextest-docs> called `Result::unwrap()` on an `Err` value: failed to copy documentation asset crates/spynso3/typst/STIXTwoMath-Regular.woff2
  917. 140.63 s gammaloop-nextest-docs>
  918. 140.63 s gammaloop-nextest-docs> Caused by:
  919. 140.63 s gammaloop-nextest-docs> No such file or directory (os error 2)
  920. 140.63 s gammaloop-nextest-docs>
  921. 140.63 s gammaloop-nextest-docs> Location:
  922. 140.63 s gammaloop-nextest-docs> crates/alphal00p-docs-builder/src/lib.rs:2320:18
  923. 140.63 s gammaloop-nextest-docs> stack backtrace:
  924. 140.63 s gammaloop-nextest-docs> 0: __rustc::rust_begin_unwind
  925. 140.63 s gammaloop-nextest-docs> 1: core::panicking::panic_fmt
  926. 140.63 s gammaloop-nextest-docs> 2: core::result::unwrap_failed
  927. 140.63 s gammaloop-nextest-docs> 3: alphal00p_docs_builder::tests::developer_architecture_is_classified_searchable_and_source_backed
  928. 140.63 s gammaloop-nextest-docs> 4: <alphal00p_docs_builder::tests::developer_architecture_is_classified_searchable_and_source_backed::{closure#0} as core::ops::function::FnOnce<()>>::call_once
  929. 140.63 s gammaloop-nextest-docs> note: Some details are omitted, run with `RUST_BACKTRACE=full` for a verbose backtrace.
  930. 140.63 s gammaloop-nextest-docs> system-out
  931. 140.63 s gammaloop-nextest-docs> running 1 test
  932. 140.63 s gammaloop-nextest-docs> test tests::developer_architecture_is_classified_searchable_and_source_backed ... FAILED
  933. 140.63 s gammaloop-nextest-docs>
  934. 140.63 s gammaloop-nextest-docs> failures:
  935. 140.63 s gammaloop-nextest-docs>
  936. 140.63 s gammaloop-nextest-docs> failures:
  937. 140.63 s gammaloop-nextest-docs> tests::developer_architecture_is_classified_searchable_and_source_backed
  938. 140.63 s gammaloop-nextest-docs>
  939. 140.63 s gammaloop-nextest-docs> test result: FAILED. 0 passed; 1 failed; 0 ignored; 0 measured; 97 filtered out; finished in 0.01s
  940. 140.63 s gammaloop-nextest-docs> system-err
  941. 140.63 s gammaloop-nextest-docs> thread 'tests::developer_architecture_is_classified_searchable_and_source_backed' (230) panicked at crates/alphal00p-docs-builder/src/lib.rs:12846:14:
  942. 140.63 s gammaloop-nextest-docs> called `Result::unwrap()` on an `Err` value: failed to copy documentation asset crates/spynso3/typst/STIXTwoMath-Regular.woff2
  943. 140.63 s gammaloop-nextest-docs>
  944. 140.63 s gammaloop-nextest-docs> Caused by:
  945. 140.63 s gammaloop-nextest-docs> No such file or directory (os error 2)
  946. 140.63 s gammaloop-nextest-docs>
  947. 140.63 s gammaloop-nextest-docs> Location:
  948. 140.63 s gammaloop-nextest-docs> crates/alphal00p-docs-builder/src/lib.rs:2320:18
  949. 140.63 s gammaloop-nextest-docs> stack backtrace:
  950. 140.63 s gammaloop-nextest-docs> 0: __rustc::rust_begin_unwind
  951. 140.63 s gammaloop-nextest-docs> 1: core::panicking::panic_fmt
  952. 140.63 s gammaloop-nextest-docs> 2: core::result::unwrap_failed
  953. 140.63 s gammaloop-nextest-docs> 3: alphal00p_docs_builder::tests::developer_architecture_is_classified_searchable_and_source_backed
  954. 140.63 s gammaloop-nextest-docs> 4: <alphal00p_docs_builder::tests::developer_architecture_is_classified_searchable_and_source_backed::{closure#0} as core::ops::function::FnOnce<()>>::call_once
  955. 140.63 s gammaloop-nextest-docs> note: Some details are omitted, run with `RUST_BACKTRACE=full` for a verbose backtrace.
  956. 140.63 s gammaloop-nextest-docs>
  957. 140.63 s gammaloop-nextest-docs> 2. alphal00p-docs-builder::tests::every_product_orients_rust_to_native_rustdoc_and_keeps_legacy_redirects
  958. 140.63 s gammaloop-nextest-docs> failure: test failure with exit code 101
  959. 140.63 s gammaloop-nextest-docs> thread 'tests::every_product_orients_rust_to_native_rustdoc_and_keeps_legacy_redirects' (260) panicked at crates/alphal00p-docs-builder/src/lib.rs:12650:46:
  960. 140.63 s gammaloop-nextest-docs> called `Result::unwrap()` on an `Err` value: failed to copy documentation asset crates/spynso3/typst/STIXTwoMath-Regular.woff2
  961. 140.63 s gammaloop-nextest-docs>
  962. 140.63 s gammaloop-nextest-docs> Caused by:
  963. 140.63 s gammaloop-nextest-docs> No such file or directory (os error 2)
  964. 140.63 s gammaloop-nextest-docs>
  965. 140.63 s gammaloop-nextest-docs> Location:
  966. 140.63 s gammaloop-nextest-docs> crates/alphal00p-docs-builder/src/lib.rs:2320:18
  967. 140.63 s gammaloop-nextest-docs> stack backtrace:
  968. 140.63 s gammaloop-nextest-docs> 0: __rustc::rust_begin_unwind
  969. 140.63 s gammaloop-nextest-docs> 1: core::panicking::panic_fmt
  970. 140.63 s gammaloop-nextest-docs> 2: core::result::unwrap_failed
  971. 140.63 s gammaloop-nextest-docs> 3: alphal00p_docs_builder::tests::every_product_orients_rust_to_native_rustdoc_and_keeps_legacy_redirects
  972. 140.63 s gammaloop-nextest-docs> 4: <alphal00p_docs_builder::tests::every_product_orients_rust_to_native_rustdoc_and_keeps_legacy_redirects::{closure#0} as core::ops::function::FnOnce<()>>::call_once
  973. 140.63 s gammaloop-nextest-docs> note: Some details are omitted, run with `RUST_BACKTRACE=full` for a verbose backtrace.
  974. 140.63 s gammaloop-nextest-docs> system-out
  975. 140.63 s gammaloop-nextest-docs> running 1 test
  976. 140.63 s gammaloop-nextest-docs> test tests::every_product_orients_rust_to_native_rustdoc_and_keeps_legacy_redirects ... FAILED
  977. 140.63 s gammaloop-nextest-docs>
  978. 140.63 s gammaloop-nextest-docs> failures:
  979. 140.63 s gammaloop-nextest-docs>
  980. 140.63 s gammaloop-nextest-docs> failures:
  981. 140.63 s gammaloop-nextest-docs> tests::every_product_orients_rust_to_native_rustdoc_and_keeps_legacy_redirects
  982. 140.63 s gammaloop-nextest-docs>
  983. 140.63 s gammaloop-nextest-docs> test result: FAILED. 0 passed; 1 failed; 0 ignored; 0 measured; 97 filtered out; finished in 0.01s
  984. 140.63 s gammaloop-nextest-docs> system-err
  985. 140.63 s gammaloop-nextest-docs> thread 'tests::every_product_orients_rust_to_native_rustdoc_and_keeps_legacy_redirects' (260) panicked at crates/alphal00p-docs-builder/src/lib.rs:12650:46:
  986. 140.63 s gammaloop-nextest-docs> called `Result::unwrap()` on an `Err` value: failed to copy documentation asset crates/spynso3/typst/STIXTwoMath-Regular.woff2
  987. 140.63 s gammaloop-nextest-docs>
  988. 140.63 s gammaloop-nextest-docs> Caused by:
  989. 140.63 s gammaloop-nextest-docs> No such file or directory (os error 2)
  990. 140.63 s gammaloop-nextest-docs>
  991. 140.63 s gammaloop-nextest-docs> Location:
  992. 140.63 s gammaloop-nextest-docs> crates/alphal00p-docs-builder/src/lib.rs:2320:18
  993. 140.63 s gammaloop-nextest-docs> stack backtrace:
  994. 140.63 s gammaloop-nextest-docs> 0: __rustc::rust_begin_unwind
  995. 140.63 s gammaloop-nextest-docs> 1: core::panicking::panic_fmt
  996. 140.63 s gammaloop-nextest-docs> 2: core::result::unwrap_failed
  997. 140.64 s gammaloop-nextest-docs> 3: alphal00p_docs_builder::tests::every_product_orients_rust_to_native_rustdoc_and_keeps_legacy_redirects
  998. 140.64 s gammaloop-nextest-docs> 4: <alphal00p_docs_builder::tests::every_product_orients_rust_to_native_rustdoc_and_keeps_legacy_redirects::{closure#0} as core::ops::function::FnOnce<()>>::call_once
  999. 140.64 s gammaloop-nextest-docs> note: Some details are omitted, run with `RUST_BACKTRACE=full` for a verbose backtrace.
  1000. 140.64 s gammaloop-nextest-docs>
  1001. 140.64 s gammaloop-nextest-docs> 3. alphal00p-docs-builder::tests::portal_and_developer_pages_use_federated_search_and_feedback
  1002. 140.64 s gammaloop-nextest-docs> failure: test failure with exit code 101
  1003. 140.64 s gammaloop-nextest-docs> thread 'tests::portal_and_developer_pages_use_federated_search_and_feedback' (386) panicked at crates/alphal00p-docs-builder/src/lib.rs:9747:14:
  1004. 140.64 s gammaloop-nextest-docs> called `Result::unwrap()` on an `Err` value: failed to copy documentation asset crates/spynso3/typst/STIXTwoMath-Regular.woff2
  1005. 140.64 s gammaloop-nextest-docs>
  1006. 140.64 s gammaloop-nextest-docs> Caused by:
  1007. 140.64 s gammaloop-nextest-docs> No such file or directory (os error 2)
  1008. 140.64 s gammaloop-nextest-docs>
  1009. 140.64 s gammaloop-nextest-docs> Location:
  1010. 140.64 s gammaloop-nextest-docs> crates/alphal00p-docs-builder/src/lib.rs:2320:18
  1011. 140.64 s gammaloop-nextest-docs> stack backtrace:
  1012. 140.64 s gammaloop-nextest-docs> 0: __rustc::rust_begin_unwind
  1013. 140.64 s gammaloop-nextest-docs> 1: core::panicking::panic_fmt
  1014. 140.64 s gammaloop-nextest-docs> 2: core::result::unwrap_failed
  1015. 140.64 s gammaloop-nextest-docs> 3: alphal00p_docs_builder::tests::write_test_portal
  1016. 140.64 s gammaloop-nextest-docs> 4: alphal00p_docs_builder::tests::portal_and_developer_pages_use_federated_search_and_feedback
  1017. 140.64 s gammaloop-nextest-docs> 5: <alphal00p_docs_builder::tests::portal_and_developer_pages_use_federated_search_and_feedback::{closure#0} as core::ops::function::FnOnce<()>>::call_once
  1018. 140.64 s gammaloop-nextest-docs> note: Some details are omitted, run with `RUST_BACKTRACE=full` for a verbose backtrace.
  1019. 140.64 s gammaloop-nextest-docs> system-out
  1020. 140.64 s gammaloop-nextest-docs> running 1 test
  1021. 140.64 s gammaloop-nextest-docs> test tests::portal_and_developer_pages_use_federated_search_and_feedback ... FAILED
  1022. 140.64 s gammaloop-nextest-docs>
  1023. 140.64 s gammaloop-nextest-docs> failures:
  1024. 140.64 s gammaloop-nextest-docs>
  1025. 140.64 s gammaloop-nextest-docs> failures:
  1026. 140.64 s gammaloop-nextest-docs> tests::portal_and_developer_pages_use_federated_search_and_feedback
  1027. 140.64 s gammaloop-nextest-docs>
  1028. 140.64 s gammaloop-nextest-docs> test result: FAILED. 0 passed; 1 failed; 0 ignored; 0 measured; 97 filtered out; finished in 0.01s
  1029. 140.64 s gammaloop-nextest-docs> system-err
  1030. 140.64 s gammaloop-nextest-docs> thread 'tests::portal_and_developer_pages_use_federated_search_and_feedback' (386) panicked at crates/alphal00p-docs-builder/src/lib.rs:9747:14:
  1031. 140.64 s gammaloop-nextest-docs> called `Result::unwrap()` on an `Err` value: failed to copy documentation asset crates/spynso3/typst/STIXTwoMath-Regular.woff2
  1032. 140.64 s gammaloop-nextest-docs>
  1033. 140.64 s gammaloop-nextest-docs> Caused by:
  1034. 140.64 s gammaloop-nextest-docs> No such file or directory (os error 2)
  1035. 140.64 s gammaloop-nextest-docs>
  1036. 140.64 s gammaloop-nextest-docs> Location:
  1037. 140.64 s gammaloop-nextest-docs> crates/alphal00p-docs-builder/src/lib.rs:2320:18
  1038. 140.64 s gammaloop-nextest-docs> stack backtrace:
  1039. 140.64 s gammaloop-nextest-docs> 0: __rustc::rust_begin_unwind
  1040. 140.64 s gammaloop-nextest-docs> 1: core::panicking::panic_fmt
  1041. 140.64 s gammaloop-nextest-docs> 2: core::result::unwrap_failed
  1042. 140.64 s gammaloop-nextest-docs> 3: alphal00p_docs_builder::tests::write_test_portal
  1043. 140.64 s gammaloop-nextest-docs> 4: alphal00p_docs_builder::tests::portal_and_developer_pages_use_federated_search_and_feedback
  1044. 140.64 s gammaloop-nextest-docs> 5: <alphal00p_docs_builder::tests::portal_and_developer_pages_use_federated_search_and_feedback::{closure#0} as core::ops::function::FnOnce<()>>::call_once
  1045. 140.64 s gammaloop-nextest-docs> note: Some details are omitted, run with `RUST_BACKTRACE=full` for a verbose backtrace.
  1046. 140.64 s gammaloop-nextest-docs>
  1047. 140.64 s gammaloop-nextest-docs> 4. alphal00p-docs-builder::tests::portal_task_chooser_routes_each_goal_to_the_registered_quickstart
  1048. 140.64 s gammaloop-nextest-docs> failure: test failure with exit code 101
  1049. 140.64 s gammaloop-nextest-docs> thread 'tests::portal_task_chooser_routes_each_goal_to_the_registered_quickstart' (401) panicked at crates/alphal00p-docs-builder/src/lib.rs:9747:14:
  1050. 140.64 s gammaloop-nextest-docs> called `Result::unwrap()` on an `Err` value: failed to copy documentation asset crates/spynso3/typst/STIXTwoMath-Regular.woff2
  1051. 140.64 s gammaloop-nextest-docs>
  1052. 140.64 s gammaloop-nextest-docs> Caused by:
  1053. 140.64 s gammaloop-nextest-docs> No such file or directory (os error 2)
  1054. 140.64 s gammaloop-nextest-docs>
  1055. 140.64 s gammaloop-nextest-docs> Location:
  1056. 140.64 s gammaloop-nextest-docs> crates/alphal00p-docs-builder/src/lib.rs:2320:18
  1057. 140.64 s gammaloop-nextest-docs> stack backtrace:
  1058. 140.64 s gammaloop-nextest-docs> 0: __rustc::rust_begin_unwind
  1059. 140.64 s gammaloop-nextest-docs> 1: core::panicking::panic_fmt
  1060. 140.64 s gammaloop-nextest-docs> 2: core::result::unwrap_failed
  1061. 140.64 s gammaloop-nextest-docs> 3: alphal00p_docs_builder::tests::write_test_portal
  1062. 140.64 s gammaloop-nextest-docs> 4: alphal00p_docs_builder::tests::portal_task_chooser_routes_each_goal_to_the_registered_quickstart
  1063. 140.64 s gammaloop-nextest-docs> 5: <alphal00p_docs_builder::tests::portal_task_chooser_routes_each_goal_to_the_registered_quickstart::{closure#0} as core::ops::function::FnOnce<()>>::call_once
  1064. 140.64 s gammaloop-nextest-docs> note: Some details are omitted, run with `RUST_BACKTRACE=full` for a verbose backtrace.
  1065. 140.64 s gammaloop-nextest-docs> system-out
  1066. 140.64 s gammaloop-nextest-docs> running 1 test
  1067. 140.64 s gammaloop-nextest-docs> test tests::portal_task_chooser_routes_each_goal_to_the_registered_quickstart ... FAILED
  1068. 140.64 s gammaloop-nextest-docs>
  1069. 140.64 s gammaloop-nextest-docs> failures:
  1070. 140.64 s gammaloop-nextest-docs>
  1071. 140.64 s gammaloop-nextest-docs> failures:
  1072. 140.64 s gammaloop-nextest-docs> tests::portal_task_chooser_routes_each_goal_to_the_registered_quickstart
  1073. 140.64 s gammaloop-nextest-docs>
  1074. 140.64 s gammaloop-nextest-docs> test result: FAILED. 0 passed; 1 failed; 0 ignored; 0 measured; 97 filtered out; finished in 0.01s
  1075. 140.64 s gammaloop-nextest-docs> system-err
  1076. 140.64 s gammaloop-nextest-docs> thread 'tests::portal_task_chooser_routes_each_goal_to_the_registered_quickstart' (401) panicked at crates/alphal00p-docs-builder/src/lib.rs:9747:14:
  1077. 140.64 s gammaloop-nextest-docs> called `Result::unwrap()` on an `Err` value: failed to copy documentation asset crates/spynso3/typst/STIXTwoMath-Regular.woff2
  1078. 140.64 s gammaloop-nextest-docs>
  1079. 140.64 s gammaloop-nextest-docs> Caused by:
  1080. 140.64 s gammaloop-nextest-docs> No such file or directory (os error 2)
  1081. 140.64 s gammaloop-nextest-docs>
  1082. 140.64 s gammaloop-nextest-docs> Location:
  1083. 140.64 s gammaloop-nextest-docs> crates/alphal00p-docs-builder/src/lib.rs:2320:18
  1084. 140.64 s gammaloop-nextest-docs> stack backtrace:
  1085. 140.64 s gammaloop-nextest-docs> 0: __rustc::rust_begin_unwind
  1086. 140.64 s gammaloop-nextest-docs> 1: core::panicking::panic_fmt
  1087. 140.64 s gammaloop-nextest-docs> 2: core::result::unwrap_failed
  1088. 140.64 s gammaloop-nextest-docs> 3: alphal00p_docs_builder::tests::write_test_portal
  1089. 140.64 s gammaloop-nextest-docs> 4: alphal00p_docs_builder::tests::portal_task_chooser_routes_each_goal_to_the_registered_quickstart
  1090. 140.64 s gammaloop-nextest-docs> 5: <alphal00p_docs_builder::tests::portal_task_chooser_routes_each_goal_to_the_registered_quickstart::{closure#0} as core::ops::function::FnOnce<()>>::call_once
  1091. 140.64 s gammaloop-nextest-docs> note: Some details are omitted, run with `RUST_BACKTRACE=full` for a verbose backtrace.
  1092. 140.64 s gammaloop-nextest-docs>
  1093. 140.64 s gammaloop-nextest-docs> 5. alphal00p-docs-builder::tests::portal_emits_routes_and_valid_assets
  1094. 140.64 s gammaloop-nextest-docs> failure: test failure with exit code 101
  1095. 140.64 s gammaloop-nextest-docs> thread 'tests::portal_emits_routes_and_valid_assets' (398) panicked at crates/alphal00p-docs-builder/src/lib.rs:9747:14:
  1096. 140.64 s gammaloop-nextest-docs> called `Result::unwrap()` on an `Err` value: failed to copy documentation asset crates/spynso3/typst/STIXTwoMath-Regular.woff2
  1097. 140.64 s gammaloop-nextest-docs>
  1098. 140.64 s gammaloop-nextest-docs> Caused by:
  1099. 140.64 s gammaloop-nextest-docs> No such file or directory (os error 2)
  1100. 140.64 s gammaloop-nextest-docs>
  1101. 140.64 s gammaloop-nextest-docs> Location:
  1102. 140.64 s gammaloop-nextest-docs> crates/alphal00p-docs-builder/src/lib.rs:2320:18
  1103. 140.64 s gammaloop-nextest-docs> stack backtrace:
  1104. 140.64 s gammaloop-nextest-docs> 0: __rustc::rust_begin_unwind
  1105. 140.64 s gammaloop-nextest-docs> 1: core::panicking::panic_fmt
  1106. 140.64 s gammaloop-nextest-docs> 2: core::result::unwrap_failed
  1107. 140.64 s gammaloop-nextest-docs> 3: alphal00p_docs_builder::tests::write_test_portal
  1108. 140.64 s gammaloop-nextest-docs> 4: alphal00p_docs_builder::tests::portal_emits_routes_and_valid_assets
  1109. 140.64 s gammaloop-nextest-docs> 5: <alphal00p_docs_builder::tests::portal_emits_routes_and_valid_assets::{closure#0} as core::ops::function::FnOnce<()>>::call_once
  1110. 140.64 s gammaloop-nextest-docs> note: Some details are omitted, run with `RUST_BACKTRACE=full` for a verbose backtrace.
  1111. 140.64 s gammaloop-nextest-docs> system-out
  1112. 140.64 s gammaloop-nextest-docs> running 1 test
  1113. 140.64 s gammaloop-nextest-docs> test tests::portal_emits_routes_and_valid_assets ... FAILED
  1114. 140.64 s gammaloop-nextest-docs>
  1115. 140.64 s gammaloop-nextest-docs> failures:
  1116. 140.64 s gammaloop-nextest-docs>
  1117. 140.64 s gammaloop-nextest-docs> failures:
  1118. 140.64 s gammaloop-nextest-docs> tests::portal_emits_routes_and_valid_assets
  1119. 140.64 s gammaloop-nextest-docs>
  1120. 140.64 s gammaloop-nextest-docs> test result: FAILED. 0 passed; 1 failed; 0 ignored; 0 measured; 97 filtered out; finished in 0.01s
  1121. 140.64 s gammaloop-nextest-docs> system-err
  1122. 140.64 s gammaloop-nextest-docs> thread 'tests::portal_emits_routes_and_valid_assets' (398) panicked at crates/alphal00p-docs-builder/src/lib.rs:9747:14:
  1123. 140.64 s gammaloop-nextest-docs> called `Result::unwrap()` on an `Err` value: failed to copy documentation asset crates/spynso3/typst/STIXTwoMath-Regular.woff2
  1124. 140.64 s gammaloop-nextest-docs>
  1125. 140.64 s gammaloop-nextest-docs> Caused by:
  1126. 140.64 s gammaloop-nextest-docs> No such file or directory (os error 2)
  1127. 140.64 s gammaloop-nextest-docs>
  1128. 140.64 s gammaloop-nextest-docs> Location:
  1129. 140.64 s gammaloop-nextest-docs> crates/alphal00p-docs-builder/src/lib.rs:2320:18
  1130. 140.64 s gammaloop-nextest-docs> stack backtrace:
  1131. 140.64 s gammaloop-nextest-docs> 0: __rustc::rust_begin_unwind
  1132. 140.64 s gammaloop-nextest-docs> 1: core::panicking::panic_fmt
  1133. 140.64 s gammaloop-nextest-docs> 2: core::result::unwrap_failed
  1134. 140.64 s gammaloop-nextest-docs> 3: alphal00p_docs_builder::tests::write_test_portal
  1135. 140.64 s gammaloop-nextest-docs> 4: alphal00p_docs_builder::tests::portal_emits_routes_and_valid_assets
  1136. 140.64 s gammaloop-nextest-docs> 5: <alphal00p_docs_builder::tests::portal_emits_routes_and_valid_assets::{closure#0} as core::ops::function::FnOnce<()>>::call_once
  1137. 140.64 s gammaloop-nextest-docs> note: Some details are omitted, run with `RUST_BACKTRACE=full` for a verbose backtrace.
  1138. 140.64 s gammaloop-nextest-docs>
  1139. 140.64 s gammaloop-nextest-docs> 6. alphal00p-docs-builder::tests::site_assets_replace_read_only_generated_files
  1140. 140.64 s gammaloop-nextest-docs> failure: test failure with exit code 101
  1141. 140.64 s gammaloop-nextest-docs> thread 'tests::site_assets_replace_read_only_generated_files' (658) panicked at crates/alphal00p-docs-builder/src/lib.rs:12396:50:
  1142. 140.64 s gammaloop-nextest-docs> called `Result::unwrap()` on an `Err` value: failed to copy documentation asset crates/spynso3/typst/STIXTwoMath-Regular.woff2
  1143. 140.64 s gammaloop-nextest-docs>
  1144. 140.64 s gammaloop-nextest-docs> Caused by:
  1145. 140.64 s gammaloop-nextest-docs> No such file or directory (os error 2)
  1146. 140.64 s gammaloop-nextest-docs>
  1147. 140.64 s gammaloop-nextest-docs> Location:
  1148. 140.64 s gammaloop-nextest-docs> crates/alphal00p-docs-builder/src/lib.rs:2320:18
  1149. 140.64 s gammaloop-nextest-docs> stack backtrace:
  1150. 140.64 s gammaloop-nextest-docs> 0: __rustc::rust_begin_unwind
  1151. 140.64 s gammaloop-nextest-docs> 1: core::panicking::panic_fmt
  1152. 140.64 s gammaloop-nextest-docs> 2: core::result::unwrap_failed
  1153. 140.64 s gammaloop-nextest-docs> 3: alphal00p_docs_builder::tests::site_assets_replace_read_only_generated_files
  1154. 140.64 s gammaloop-nextest-docs> 4: <alphal00p_docs_builder::tests::site_assets_replace_read_only_generated_files::{closure#0} as core::ops::function::FnOnce<()>>::call_once
  1155. 140.64 s gammaloop-nextest-docs> note: Some details are omitted, run with `RUST_BACKTRACE=full` for a verbose backtrace.
  1156. 140.64 s gammaloop-nextest-docs> system-out
  1157. 140.64 s gammaloop-nextest-docs> running 1 test
  1158. 140.64 s gammaloop-nextest-docs> test tests::site_assets_replace_read_only_generated_files ... FAILED
  1159. 140.64 s gammaloop-nextest-docs>
  1160. 140.64 s gammaloop-nextest-docs> failures:
  1161. 140.64 s gammaloop-nextest-docs>
  1162. 140.64 s gammaloop-nextest-docs> failures:
  1163. 140.64 s gammaloop-nextest-docs> tests::site_assets_replace_read_only_generated_files
  1164. 140.64 s gammaloop-nextest-docs>
  1165. 140.64 s gammaloop-nextest-docs> test result: FAILED. 0 passed; 1 failed; 0 ignored; 0 measured; 97 filtered out; finished in 0.01s
  1166. 140.64 s gammaloop-nextest-docs> system-err
  1167. 140.64 s gammaloop-nextest-docs> thread 'tests::site_assets_replace_read_only_generated_files' (658) panicked at crates/alphal00p-docs-builder/src/lib.rs:12396:50:
  1168. 140.64 s gammaloop-nextest-docs> called `Result::unwrap()` on an `Err` value: failed to copy documentation asset crates/spynso3/typst/STIXTwoMath-Regular.woff2
  1169. 140.64 s gammaloop-nextest-docs>
  1170. 140.64 s gammaloop-nextest-docs> Caused by:
  1171. 140.64 s gammaloop-nextest-docs> No such file or directory (os error 2)
  1172. 140.64 s gammaloop-nextest-docs>
  1173. 140.64 s gammaloop-nextest-docs> Location:
  1174. 140.64 s gammaloop-nextest-docs> crates/alphal00p-docs-builder/src/lib.rs:2320:18
  1175. 140.64 s gammaloop-nextest-docs> stack backtrace:
  1176. 140.64 s gammaloop-nextest-docs> 0: __rustc::rust_begin_unwind
  1177. 140.64 s gammaloop-nextest-docs> 1: core::panicking::panic_fmt
  1178. 140.64 s gammaloop-nextest-docs> 2: core::result::unwrap_failed
  1179. 140.64 s gammaloop-nextest-docs> 3: alphal00p_docs_builder::tests::site_assets_replace_read_only_generated_files
  1180. 140.64 s gammaloop-nextest-docs> 4: <alphal00p_docs_builder::tests::site_assets_replace_read_only_generated_files::{closure#0} as core::ops::function::FnOnce<()>>::call_once
  1181. 140.64 s gammaloop-nextest-docs> note: Some details are omitted, run with `RUST_BACKTRACE=full` for a verbose backtrace.
  1182. 140.64 s gammaloop-nextest-docs>
  1183. 140.64 s gammaloop-nextest-docs> 7. alphal00p-docs-builder::tests::checked_in_registry_is_valid
  1184. 140.64 s gammaloop-nextest-docs> failure: test failure with exit code 101
  1185. 140.64 s gammaloop-nextest-docs> thread 'tests::checked_in_registry_is_valid' (199) panicked at crates/alphal00p-docs-builder/src/lib.rs:12351:50:
  1186. 140.64 s gammaloop-nextest-docs> called `Result::unwrap()` on an `Err` value: required documentation source is missing: /build/source/crates/spynso3/typst/STIXTwoMath-Regular.woff2
  1187. 140.64 s gammaloop-nextest-docs>
  1188. 140.64 s gammaloop-nextest-docs> Location:
  1189. 140.64 s gammaloop-nextest-docs> crates/alphal00p-docs-builder/src/lib.rs:5166:9
  1190. 140.64 s gammaloop-nextest-docs> stack backtrace:
  1191. 140.64 s gammaloop-nextest-docs> 0: __rustc::rust_begin_unwind
  1192. 140.64 s gammaloop-nextest-docs> 1: core::panicking::panic_fmt
  1193. 140.64 s gammaloop-nextest-docs> 2: core::result::unwrap_failed
  1194. 140.64 s gammaloop-nextest-docs> 3: alphal00p_docs_builder::tests::checked_in_registry_is_valid
  1195. 140.64 s gammaloop-nextest-docs> 4: <alphal00p_docs_builder::tests::checked_in_registry_is_valid::{closure#0} as core::ops::function::FnOnce<()>>::call_once
  1196. 140.64 s gammaloop-nextest-docs> note: Some details are omitted, run with `RUST_BACKTRACE=full` for a verbose backtrace.
  1197. 140.64 s gammaloop-nextest-docs> system-out
  1198. 140.64 s gammaloop-nextest-docs> running 1 test
  1199. 140.64 s gammaloop-nextest-docs> test tests::checked_in_registry_is_valid ... FAILED
  1200. 140.64 s gammaloop-nextest-docs>
  1201. 140.64 s gammaloop-nextest-docs> failures:
  1202. 140.64 s gammaloop-nextest-docs>
  1203. 140.64 s gammaloop-nextest-docs> failures:
  1204. 140.64 s gammaloop-nextest-docs> tests::checked_in_registry_is_valid
  1205. 140.64 s gammaloop-nextest-docs>
  1206. 140.64 s gammaloop-nextest-docs> test result: FAILED. 0 passed; 1 failed; 0 ignored; 0 measured; 97 filtered out; finished in 0.18s
  1207. 140.64 s gammaloop-nextest-docs> system-err
  1208. 140.64 s gammaloop-nextest-docs> thread 'tests::checked_in_registry_is_valid' (199) panicked at crates/alphal00p-docs-builder/src/lib.rs:12351:50:
  1209. 140.64 s gammaloop-nextest-docs> called `Result::unwrap()` on an `Err` value: required documentation source is missing: /build/source/crates/spynso3/typst/STIXTwoMath-Regular.woff2
  1210. 140.64 s gammaloop-nextest-docs>
  1211. 140.64 s gammaloop-nextest-docs> Location:
  1212. 140.64 s gammaloop-nextest-docs> crates/alphal00p-docs-builder/src/lib.rs:5166:9
  1213. 140.64 s gammaloop-nextest-docs> stack backtrace:
  1214. 140.64 s gammaloop-nextest-docs> 0: __rustc::rust_begin_unwind
  1215. 140.64 s gammaloop-nextest-docs> 1: core::panicking::panic_fmt
  1216. 140.64 s gammaloop-nextest-docs> 2: core::result::unwrap_failed
  1217. 140.64 s gammaloop-nextest-docs> 3: alphal00p_docs_builder::tests::checked_in_registry_is_valid
  1218. 140.64 s gammaloop-nextest-docs> 4: <alphal00p_docs_builder::tests::checked_in_registry_is_valid::{closure#0} as core::ops::function::FnOnce<()>>::call_once
  1219. 140.64 s gammaloop-nextest-docs> note: Some details are omitted, run with `RUST_BACKTRACE=full` for a verbose backtrace.
  1220. 140.64 s gammaloop-nextest-docs>
  1221. 140.64 s gammaloop-nextest-docs> 8. alphal00p-docs-builder::provenance_tests::each_build_captures_one_revision_before_rendering
  1222. 140.64 s gammaloop-nextest-docs> failure: test failure with exit code 101
  1223. 140.64 s gammaloop-nextest-docs> thread 'provenance_tests::each_build_captures_one_revision_before_rendering' (206) panicked at crates/alphal00p-docs-builder/src/provenance_tests.rs:274:9:
  1224. 140.64 s gammaloop-nextest-docs> assertion failed: command.status().unwrap().success()
  1225. 140.64 s gammaloop-nextest-docs> stack backtrace:
  1226. 140.64 s gammaloop-nextest-docs> 0: __rustc::rust_begin_unwind
  1227. 140.64 s gammaloop-nextest-docs> 1: core::panicking::panic_fmt
  1228. 140.64 s gammaloop-nextest-docs> 2: core::panicking::panic
  1229. 140.64 s gammaloop-nextest-docs> 3: alphal00p_docs_builder::provenance_tests::each_build_captures_one_revision_before_rendering
  1230. 140.64 s gammaloop-nextest-docs> 4: <alphal00p_docs_builder::provenance_tests::each_build_captures_one_revision_before_rendering::{closure#0} as core::ops::function::FnOnce<()>>::call_once
  1231. 140.64 s gammaloop-nextest-docs> note: Some details are omitted, run with `RUST_BACKTRACE=full` for a verbose backtrace.
  1232. 140.64 s gammaloop-nextest-docs> system-out
  1233. 140.64 s gammaloop-nextest-docs> running 1 test
  1234. 140.64 s gammaloop-nextest-docs>
  1235. 140.64 s gammaloop-nextest-docs> running 1 test
  1236. 140.64 s gammaloop-nextest-docs> test provenance_tests::each_build_captures_one_revision_before_rendering ... FAILED
  1237. 140.64 s gammaloop-nextest-docs>
  1238. 140.64 s gammaloop-nextest-docs> failures:
  1239. 140.64 s gammaloop-nextest-docs>
  1240. 140.64 s gammaloop-nextest-docs> failures:
  1241. 140.64 s gammaloop-nextest-docs> provenance_tests::each_build_captures_one_revision_before_rendering
  1242. 140.64 s gammaloop-nextest-docs>
  1243. 140.64 s gammaloop-nextest-docs> test result: FAILED. 0 passed; 1 failed; 0 ignored; 0 measured; 97 filtered out; finished in 0.17s
  1244. 140.64 s gammaloop-nextest-docs>
  1245. 140.64 s gammaloop-nextest-docs> test provenance_tests::each_build_captures_one_revision_before_rendering ... FAILED
  1246. 140.64 s gammaloop-nextest-docs>
  1247. 140.64 s gammaloop-nextest-docs> failures:
  1248. 140.64 s gammaloop-nextest-docs>
  1249. 140.64 s gammaloop-nextest-docs> failures:
  1250. 140.64 s gammaloop-nextest-docs> provenance_tests::each_build_captures_one_revision_before_rendering
  1251. 140.64 s gammaloop-nextest-docs>
  1252. 140.64 s gammaloop-nextest-docs> test result: FAILED. 0 passed; 1 failed; 0 ignored; 0 measured; 97 filtered out; finished in 0.18s
  1253. 140.64 s gammaloop-nextest-docs> system-err
  1254. 140.64 s gammaloop-nextest-docs> thread 'provenance_tests::each_build_captures_one_revision_before_rendering' (229) panicked at crates/alphal00p-docs-builder/src/provenance_tests.rs:297:14:
  1255. 140.64 s gammaloop-nextest-docs> called `Result::unwrap()` on an `Err` value: required documentation source is missing: /build/source/target/nix-ci-tmp/.tmpjZ2Q5a/checkout/crates/spynso3/typst/STIXTwoMath-Regular.woff2
  1256. 140.64 s gammaloop-nextest-docs>
  1257. 140.64 s gammaloop-nextest-docs> Location:
  1258. 140.64 s gammaloop-nextest-docs> crates/alphal00p-docs-builder/src/lib.rs:5166:9
  1259. 140.64 s gammaloop-nextest-docs> stack backtrace:
  1260. 140.64 s gammaloop-nextest-docs> 0: __rustc::rust_begin_unwind
  1261. 140.64 s gammaloop-nextest-docs> 1: core::panicking::panic_fmt
  1262. 140.64 s gammaloop-nextest-docs> 2: core::result::unwrap_failed
  1263. 140.64 s gammaloop-nextest-docs> 3: alphal00p_docs_builder::provenance_tests::each_build_captures_one_revision_before_rendering
  1264. 140.64 s gammaloop-nextest-docs> 4: <alphal00p_docs_builder::provenance_tests::each_build_captures_one_revision_before_rendering::{closure#0} as core::ops::function::FnOnce<()>>::call_once
  1265. 140.64 s gammaloop-nextest-docs> note: Some details are omitted, run with `RUST_BACKTRACE=full` for a verbose backtrace.
  1266. 140.64 s gammaloop-nextest-docs>
  1267. 140.64 s gammaloop-nextest-docs> thread 'provenance_tests::each_build_captures_one_revision_before_rendering' (206) panicked at crates/alphal00p-docs-builder/src/provenance_tests.rs:274:9:
  1268. 140.64 s gammaloop-nextest-docs> assertion failed: command.status().unwrap().success()
  1269. 140.64 s gammaloop-nextest-docs> stack backtrace:
  1270. 140.64 s gammaloop-nextest-docs> 0: __rustc::rust_begin_unwind
  1271. 140.64 s gammaloop-nextest-docs> 1: core::panicking::panic_fmt
  1272. 140.64 s gammaloop-nextest-docs> 2: core::panicking::panic
  1273. 140.64 s gammaloop-nextest-docs> 3: alphal00p_docs_builder::provenance_tests::each_build_captures_one_revision_before_rendering
  1274. 140.64 s gammaloop-nextest-docs> 4: <alphal00p_docs_builder::provenance_tests::each_build_captures_one_revision_before_rendering::{closure#0} as core::ops::function::FnOnce<()>>::call_once
  1275. 140.64 s gammaloop-nextest-docs> note: Some details are omitted, run with `RUST_BACKTRACE=full` for a verbose backtrace.
  1276. 140.64 s gammaloop-nextest-docs>
  1277. 140.64 s gammaloop-nextest-docs> 9. alphal00p-docs-builder::tests::developer_scope_ranges_ignore_unrelated_edits_and_warn_only_while_watching
  1278. 140.64 s gammaloop-nextest-docs> failure: test failure with exit code 101
  1279. 140.64 s gammaloop-nextest-docs> thread 'tests::developer_scope_ranges_ignore_unrelated_edits_and_warn_only_while_watching' (240) panicked at crates/alphal00p-docs-builder/src/lib.rs:12441:29:
  1280. 140.64 s gammaloop-nextest-docs> called `Result::unwrap()` on an `Err` value: required documentation source is missing: /build/source/crates/spynso3/typst/STIXTwoMath-Regular.woff2
  1281. 140.64 s gammaloop-nextest-docs>
  1282. 140.64 s gammaloop-nextest-docs> Location:
  1283. 140.64 s gammaloop-nextest-docs> crates/alphal00p-docs-builder/src/lib.rs:5166:9
  1284. 140.64 s gammaloop-nextest-docs> stack backtrace:
  1285. 140.64 s gammaloop-nextest-docs> 0: __rustc::rust_begin_unwind
  1286. 140.64 s gammaloop-nextest-docs> 1: core::panicking::panic_fmt
  1287. 140.64 s gammaloop-nextest-docs> 2: core::result::unwrap_failed
  1288. 140.64 s gammaloop-nextest-docs> 3: alphal00p_docs_builder::tests::developer_scope_ranges_ignore_unrelated_edits_and_warn_only_while_watching
  1289. 140.64 s gammaloop-nextest-docs> 4: <alphal00p_docs_builder::tests::developer_scope_ranges_ignore_unrelated_edits_and_warn_only_while_watching::{closure#0} as core::ops::function::FnOnce<()>>::call_once
  1290. 140.64 s gammaloop-nextest-docs> note: Some details are omitted, run with `RUST_BACKTRACE=full` for a verbose backtrace.
  1291. 140.64 s gammaloop-nextest-docs> system-out
  1292. 140.64 s gammaloop-nextest-docs> running 1 test
  1293. 140.64 s gammaloop-nextest-docs> test tests::developer_scope_ranges_ignore_unrelated_edits_and_warn_only_while_watching ... FAILED
  1294. 140.64 s gammaloop-nextest-docs>
  1295. 140.64 s gammaloop-nextest-docs> failures:
  1296. 140.64 s gammaloop-nextest-docs>
  1297. 140.64 s gammaloop-nextest-docs> failures:
  1298. 140.64 s gammaloop-nextest-docs> tests::developer_scope_ranges_ignore_unrelated_edits_and_warn_only_while_watching
  1299. 140.64 s gammaloop-nextest-docs>
  1300. 140.64 s gammaloop-nextest-docs> test result: FAILED. 0 passed; 1 failed; 0 ignored; 0 measured; 97 filtered out; finished in 0.18s
  1301. 140.64 s gammaloop-nextest-docs> system-err
  1302. 140.64 s gammaloop-nextest-docs> thread 'tests::developer_scope_ranges_ignore_unrelated_edits_and_warn_only_while_watching' (240) panicked at crates/alphal00p-docs-builder/src/lib.rs:12441:29:
  1303. 140.64 s gammaloop-nextest-docs> called `Result::unwrap()` on an `Err` value: required documentation source is missing: /build/source/crates/spynso3/typst/STIXTwoMath-Regular.woff2
  1304. 140.64 s gammaloop-nextest-docs>
  1305. 140.64 s gammaloop-nextest-docs> Location:
  1306. 140.64 s gammaloop-nextest-docs> crates/alphal00p-docs-builder/src/lib.rs:5166:9
  1307. 140.64 s gammaloop-nextest-docs> stack backtrace:
  1308. 140.64 s gammaloop-nextest-docs> 0: __rustc::rust_begin_unwind
  1309. 140.64 s gammaloop-nextest-docs> 1: core::panicking::panic_fmt
  1310. 140.64 s gammaloop-nextest-docs> 2: core::result::unwrap_failed
  1311. 140.64 s gammaloop-nextest-docs> 3: alphal00p_docs_builder::tests::developer_scope_ranges_ignore_unrelated_edits_and_warn_only_while_watching
  1312. 140.64 s gammaloop-nextest-docs> 4: <alphal00p_docs_builder::tests::developer_scope_ranges_ignore_unrelated_edits_and_warn_only_while_watching::{closure#0} as core::ops::function::FnOnce<()>>::call_once
  1313. 140.64 s gammaloop-nextest-docs> note: Some details are omitted, run with `RUST_BACKTRACE=full` for a verbose backtrace.
  1314. 140.64 s gammaloop-nextest-docs>
  1315. 140.64 s gammaloop-nextest-docs> 10. alphal00p-docs-builder::tests::every_product_requires_a_task_chooser_and_each_supported_interface
  1316. 140.64 s gammaloop-nextest-docs> failure: test failure with exit code 101
  1317. 140.64 s gammaloop-nextest-docs> thread 'tests::every_product_requires_a_task_chooser_and_each_supported_interface' (263) panicked at crates/alphal00p-docs-builder/src/lib.rs:12365:9:
  1318. 140.64 s gammaloop-nextest-docs> assertion failed: format!("{error:#}").contains("has no quickstart page")
  1319. 140.64 s gammaloop-nextest-docs> stack backtrace:
  1320. 140.64 s gammaloop-nextest-docs> 0: __rustc::rust_begin_unwind
  1321. 140.64 s gammaloop-nextest-docs> 1: core::panicking::panic_fmt
  1322. 140.64 s gammaloop-nextest-docs> 2: core::panicking::panic
  1323. 140.64 s gammaloop-nextest-docs> 3: alphal00p_docs_builder::tests::every_product_requires_a_task_chooser_and_each_supported_interface
  1324. 140.64 s gammaloop-nextest-docs> 4: <alphal00p_docs_builder::tests::every_product_requires_a_task_chooser_and_each_supported_interface::{closure#0} as core::ops::function::FnOnce<()>>::call_once
  1325. 140.64 s gammaloop-nextest-docs> note: Some details are omitted, run with `RUST_BACKTRACE=full` for a verbose backtrace.
  1326. 140.64 s gammaloop-nextest-docs> system-out
  1327. 140.64 s gammaloop-nextest-docs> running 1 test
  1328. 140.64 s gammaloop-nextest-docs> test tests::every_product_requires_a_task_chooser_and_each_supported_interface ... FAILED
  1329. 140.64 s gammaloop-nextest-docs>
  1330. 140.64 s gammaloop-nextest-docs> failures:
  1331. 140.64 s gammaloop-nextest-docs>
  1332. 140.64 s gammaloop-nextest-docs> failures:
  1333. 140.64 s gammaloop-nextest-docs> tests::every_product_requires_a_task_chooser_and_each_supported_interface
  1334. 140.64 s gammaloop-nextest-docs>
  1335. 140.64 s gammaloop-nextest-docs> test result: FAILED. 0 passed; 1 failed; 0 ignored; 0 measured; 97 filtered out; finished in 0.19s
  1336. 140.64 s gammaloop-nextest-docs> system-err
  1337. 140.64 s gammaloop-nextest-docs> thread 'tests::every_product_requires_a_task_chooser_and_each_supported_interface' (263) panicked at crates/alphal00p-docs-builder/src/lib.rs:12365:9:
  1338. 140.64 s gammaloop-nextest-docs> assertion failed: format!("{error:#}").contains("has no quickstart page")
  1339. 140.64 s gammaloop-nextest-docs> stack backtrace:
  1340. 140.64 s gammaloop-nextest-docs> 0: __rustc::rust_begin_unwind
  1341. 140.64 s gammaloop-nextest-docs> 1: core::panicking::panic_fmt
  1342. 140.64 s gammaloop-nextest-docs> 2: core::panicking::panic
  1343. 140.64 s gammaloop-nextest-docs> 3: alphal00p_docs_builder::tests::every_product_requires_a_task_chooser_and_each_supported_interface
  1344. 140.64 s gammaloop-nextest-docs> 4: <alphal00p_docs_builder::tests::every_product_requires_a_task_chooser_and_each_supported_interface::{closure#0} as core::ops::function::FnOnce<()>>::call_once
  1345. 140.64 s gammaloop-nextest-docs> note: Some details are omitted, run with `RUST_BACKTRACE=full` for a verbose backtrace.
  1346. 140.64 s gammaloop-nextest-docs>
  1347. 140.64 s gammaloop-nextest-docs> 11. alphal00p-docs-builder::tests::pdf_manual_chapter_order_must_match_the_page_registry
  1348. 140.64 s gammaloop-nextest-docs> failure: test failure with exit code 101
  1349. 140.64 s gammaloop-nextest-docs> thread 'tests::pdf_manual_chapter_order_must_match_the_page_registry' (372) panicked at crates/alphal00p-docs-builder/src/lib.rs:12421:9:
  1350. 140.64 s gammaloop-nextest-docs> assertion failed: format!("{error:#}").contains("PDF manual chapter order differs")
  1351. 140.64 s gammaloop-nextest-docs> stack backtrace:
  1352. 140.64 s gammaloop-nextest-docs> 0: __rustc::rust_begin_unwind
  1353. 140.64 s gammaloop-nextest-docs> 1: core::panicking::panic_fmt
  1354. 140.64 s gammaloop-nextest-docs> 2: core::panicking::panic
  1355. 140.64 s gammaloop-nextest-docs> 3: alphal00p_docs_builder::tests::pdf_manual_chapter_order_must_match_the_page_registry
  1356. 140.64 s gammaloop-nextest-docs> 4: <alphal00p_docs_builder::tests::pdf_manual_chapter_order_must_match_the_page_registry::{closure#0} as core::ops::function::FnOnce<()>>::call_once
  1357. 140.64 s gammaloop-nextest-docs> note: Some details are omitted, run with `RUST_BACKTRACE=full` for a verbose backtrace.
  1358. 140.64 s gammaloop-nextest-docs> system-out
  1359. 140.64 s gammaloop-nextest-docs> running 1 test
  1360. 140.64 s gammaloop-nextest-docs> test tests::pdf_manual_chapter_order_must_match_the_page_registry ... FAILED
  1361. 140.64 s gammaloop-nextest-docs>
  1362. 140.64 s gammaloop-nextest-docs> failures:
  1363. 140.64 s gammaloop-nextest-docs>
  1364. 140.64 s gammaloop-nextest-docs> failures:
  1365. 140.64 s gammaloop-nextest-docs> tests::pdf_manual_chapter_order_must_match_the_page_registry
  1366. 140.64 s gammaloop-nextest-docs>
  1367. 140.64 s gammaloop-nextest-docs> test result: FAILED. 0 passed; 1 failed; 0 ignored; 0 measured; 97 filtered out; finished in 0.16s
  1368. 140.64 s gammaloop-nextest-docs> system-err
  1369. 140.64 s gammaloop-nextest-docs> thread 'tests::pdf_manual_chapter_order_must_match_the_page_registry' (372) panicked at crates/alphal00p-docs-builder/src/lib.rs:12421:9:
  1370. 140.64 s gammaloop-nextest-docs> assertion failed: format!("{error:#}").contains("PDF manual chapter order differs")
  1371. 140.64 s gammaloop-nextest-docs> stack backtrace:
  1372. 140.64 s gammaloop-nextest-docs> 0: __rustc::rust_begin_unwind
  1373. 140.64 s gammaloop-nextest-docs> 1: core::panicking::panic_fmt
  1374. 140.64 s gammaloop-nextest-docs> 2: core::panicking::panic
  1375. 140.64 s gammaloop-nextest-docs> 3: alphal00p_docs_builder::tests::pdf_manual_chapter_order_must_match_the_page_registry
  1376. 140.64 s gammaloop-nextest-docs> 4: <alphal00p_docs_builder::tests::pdf_manual_chapter_order_must_match_the_page_registry::{closure#0} as core::ops::function::FnOnce<()>>::call_once
  1377. 140.64 s gammaloop-nextest-docs> note: Some details are omitted, run with `RUST_BACKTRACE=full` for a verbose backtrace.
  1378. 140.64 s gammaloop-nextest-docs> =========================================
  1379. 140.65 s gammaloop-nextest-docs> Extracting 2 binaries to /build/source
  1380. 140.69 s gammaloop-nextest-docs> Extracted 5 files to /build/source in 0.04s
  1381. 140.70 s gammaloop-nextest-docs> ------------
  1382. 140.70 s gammaloop-nextest-docs> Nextest run ID 990ee094-5f3e-4102-87ac-dc6c87c26daa with nextest profile: ci_gammaloop
  1383. 140.70 s gammaloop-nextest-docs> Starting 23 tests across 2 binaries
  1384. 140.73 s gammaloop-nextest-docs> ------------
  1385. 140.73 s gammaloop-nextest-docs> Summary [ 0.028s] 23 tests run: 23 passed, 0 skipped
  1386. 140.76 s gammaloop-nextest-docs>
  1387. 140.76 s gammaloop-nextest-docs> ========== nextest test summary ==========
  1388. 140.76 s gammaloop-nextest-docs> report: target/nextest/ci_gammaloop/junit.xml
  1389. 140.76 s gammaloop-nextest-docs> tests: 23, failures: 0, errors: 0
  1390. 140.76 s gammaloop-nextest-docs> No failing testcases found.
  1391. 140.76 s gammaloop-nextest-docs> =========================================
  1392. 140.78 s gammaloop-nextest-docs> Extracting 5 binaries (including 4 non-test binaries), 1 build script output directory, and 2 linked paths to /build/source
  1393. 141.71 s gammaloop-nextest-docs> Extracted 26 files to /build/source in 0.93s
  1394. 141.72 s gammaloop-nextest-docs> ------------
  1395. 141.72 s gammaloop-nextest-docs> Nextest run ID bb21f4c8-6158-4dc9-a171-1bc402179b26 with nextest profile: ci_gammaloop
  1396. 141.72 s gammaloop-nextest-docs> Starting 88 tests across 1 binary
  1397. 141.79 s gammaloop-nextest-docs> ------------
  1398. 141.79 s gammaloop-nextest-docs> Summary [ 0.069s] 88 tests run: 88 passed, 0 skipped
  1399. 141.82 s gammaloop-nextest-docs>
  1400. 141.82 s gammaloop-nextest-docs> ========== nextest test summary ==========
  1401. 141.82 s gammaloop-nextest-docs> report: target/nextest/ci_gammaloop/junit.xml
  1402. 141.82 s gammaloop-nextest-docs> tests: 88, failures: 0, errors: 0
  1403. 141.82 s gammaloop-nextest-docs> No failing testcases found.
  1404. 141.82 s gammaloop-nextest-docs> =========================================
  1405. 141.84 s gammaloop-nextest-docs> Extracting 2 binaries to /build/source
  1406. 141.88 s gammaloop-nextest-docs> Extracted 5 files to /build/source in 0.04s
  1407. 141.89 s gammaloop-nextest-docs> ------------
  1408. 141.89 s gammaloop-nextest-docs> Nextest run ID c14c836f-43d5-43ab-8e3f-42235ae0416d with nextest profile: ci_gammaloop