0.00 s
$ /nix/store/bhv6xyvqw6gjs3j488gi1z6wdv18bdpa-coreutils-9.11/bin/timeout --kill-after=15s 7200s /nix/store/bxgja2ppiqi6w2bgn0r07d7mgnl1k6k2-nix-2.34.8/bin/nix --extra-experimental-features nix-command --extra-experimental-features flakes flake clone git+https://github.com/alphal00p/gammaloop --dest /tmp/nix-ci-worker/stable-pwd/repo/
0.10 s
Cloning into '/tmp/nix-ci-worker/stable-pwd/repo'...
0.81 s
remote: Enumerating objects: 162082, done.
0.94 s
remote: Counting objects: 0% (1/3658)
remote: Counting objects: 1% (37/3658)
remote: Counting objects: 2% (74/3658)
remote: Counting objects: 3% (110/3658)
remote: Counting objects: 4% (147/3658)
remote: Counting objects: 5% (183/3658)
remote: Counting objects: 6% (220/3658)
remote: Counting objects: 7% (257/3658)
remote: Counting objects: 8% (293/3658)
remote: Counting objects: 9% (330/3658)
remote: Counting objects: 10% (366/3658)
remote: Counting objects: 11% (403/3658)
remote: Counting objects: 12% (439/3658)
remote: Counting objects: 13% (476/3658)
remote: Counting objects: 14% (513/3658)
remote: Counting objects: 15% (549/3658)
remote: Counting objects: 16% (586/3658)
remote: Counting objects: 17% (622/3658)
remote: Counting objects: 18% (659/3658)
remote: Counting objects: 19% (696/3658)
remote: Counting objects: 20% (732/3658)
remote: Counting objects: 21% (769/3658)
remote: Counting objects: 22% (805/3658)
remote: Counting objects: 23% (842/3658)
remote: Counting objects: 24% (878/3658)
remote: Counting objects: 25% (915/3658)
remote: Counting objects: 26% (952/3658)
remote: Counting objects: 27% (988/3658)
remote: Counting objects: 28% (1025/3658)
remote: Counting objects: 29% (1061/3658)
remote: Counting objects: 30% (1098/3658)
remote: Counting objects: 31% (1134/3658)
remote: Counting objects: 32% (1171/3658)
remote: Counting objects: 33% (1208/3658)
remote: Counting objects: 34% (1244/3658)
remote: Counting objects: 35% (1281/3658)
remote: Counting objects: 36% (1317/3658)
remote: Counting objects: 37% (1354/3658)
remote: Counting objects: 38% (1391/3658)
remote: Counting objects: 39% (1427/3658)
remote: Counting objects: 40% (1464/3658)
remote: Counting objects: 41% (1500/3658)
remote: Counting objects: 42% (1537/3658)
remote: Counting objects: 43% (1573/3658)
remote: Counting objects: 44% (1610/3658)
remote: Counting objects: 45% (1647/3658)
remote: Counting objects: 46% (1683/3658)
remote: Counting objects: 47% (1720/3658)
remote: Counting objects: 48% (1756/3658)
remote: Counting objects: 49% (1793/3658)
remote: Counting objects: 50% (1829/3658)
remote: Counting objects: 51% (1866/3658)
remote: Counting objects: 52% (1903/3658)
remote: Counting objects: 53% (1939/3658)
remote: Counting objects: 54% (1976/3658)
remote: Counting objects: 55% (2012/3658)
remote: Counting objects: 56% (2049/3658)
remote: Counting objects: 57% (2086/3658)
remote: Counting objects: 58% (2122/3658)
remote: Counting objects: 59% (2159/3658)
remote: Counting objects: 60% (2195/3658)
remote: Counting objects: 61% (2232/3658)
remote: Counting objects: 62% (2268/3658)
remote: Counting objects: 63% (2305/3658)
remote: Counting objects: 64% (2342/3658)
remote: Counting objects: 65% (2378/3658)
remote: Counting objects: 66% (2415/3658)
remote: Counting objects: 67% (2451/3658)
remote: Counting objects: 68% (2488/3658)
remote: Counting objects: 69% (2525/3658)
remote: Counting objects: 70% (2561/3658)
remote: Counting objects: 71% (2598/3658)
remote: Counting objects: 72% (2634/3658)
remote: Counting objects: 73% (2671/3658)
remote: Counting objects: 74% (2707/3658)
remote: Counting objects: 75% (2744/3658)
remote: Counting objects: 76% (2781/3658)
remote: Counting objects: 77% (2817/3658)
remote: Counting objects: 78% (2854/3658)
remote: Counting objects: 79% (2890/3658)
remote: Counting objects: 80% (2927/3658)
remote: Counting objects: 81% (2963/3658)
remote: Counting objects: 82% (3000/3658)
remote: Counting objects: 83% (3037/3658)
remote: Counting objects: 84% (3073/3658)
remote: Counting objects: 85% (3110/3658)
remote: Counting objects: 86% (3146/3658)
remote: Counting objects: 87% (3183/3658)
remote: Counting objects: 88% (3220/3658)
remote: Counting objects: 89% (3256/3658)
remote: Counting objects: 90% (3293/3658)
remote: Counting objects: 91% (3329/3658)
remote: Counting objects: 92% (3366/3658)
remote: Counting objects: 93% (3402/3658)
remote: Counting objects: 94% (3439/3658)
remote: Counting objects: 95% (3476/3658)
remote: Counting objects: 96% (3512/3658)
remote: Counting objects: 97% (3549/3658)
remote: Counting objects: 98% (3585/3658)
remote: Counting objects: 99% (3622/3658)
remote: Counting objects: 100% (3658/3658)
remote: Counting objects: 100% (3658/3658), done.
2.80 s
remote: Compressing objects: 0% (1/1470)
remote: Compressing objects: 1% (15/1470)
remote: Compressing objects: 2% (30/1470)
remote: Compressing objects: 3% (45/1470)
remote: Compressing objects: 4% (59/1470)
remote: Compressing objects: 5% (74/1470)
remote: Compressing objects: 6% (89/1470)
remote: Compressing objects: 7% (103/1470)
remote: Compressing objects: 8% (118/1470)
remote: Compressing objects: 9% (133/1470)
remote: Compressing objects: 10% (147/1470)
remote: Compressing objects: 11% (162/1470)
remote: Compressing objects: 12% (177/1470)
remote: Compressing objects: 13% (192/1470)
remote: Compressing objects: 14% (206/1470)
remote: Compressing objects: 15% (221/1470)
remote: Compressing objects: 16% (236/1470)
remote: Compressing objects: 17% (250/1470)
remote: Compressing objects: 18% (265/1470)
remote: Compressing objects: 19% (280/1470)
remote: Compressing objects: 20% (294/1470)
remote: Compressing objects: 21% (309/1470)
remote: Compressing objects: 22% (324/1470)
remote: Compressing objects: 23% (339/1470)
remote: Compressing objects: 24% (353/1470)
remote: Compressing objects: 25% (368/1470)
remote: Compressing objects: 26% (383/1470)
remote: Compressing objects: 27% (397/1470)
remote: Compressing objects: 28% (412/1470)
remote: Compressing objects: 29% (427/1470)
remote: Compressing objects: 30% (441/1470)
remote: Compressing objects: 31% (456/1470)
remote: Compressing objects: 32% (471/1470)
remote: Compressing objects: 32% (484/1470)
remote: Compressing objects: 33% (486/1470)
remote: Compressing objects: 34% (500/1470)
remote: Compressing objects: 35% (515/1470)
remote: Compressing objects: 36% (530/1470)
remote: Compressing objects: 37% (544/1470)
remote: Compressing objects: 38% (559/1470)
remote: Compressing objects: 39% (574/1470)
remote: Compressing objects: 40% (588/1470)
remote: Compressing objects: 41% (603/1470)
remote: Compressing objects: 42% (618/1470)
remote: Compressing objects: 43% (633/1470)
remote: Compressing objects: 44% (647/1470)
remote: Compressing objects: 45% (662/1470)
remote: Compressing objects: 46% (677/1470)
remote: Compressing objects: 47% (691/1470)
remote: Compressing objects: 48% (706/1470)
remote: Compressing objects: 49% (721/1470)
remote: Compressing objects: 50% (735/1470)
remote: Compressing objects: 51% (750/1470)
remote: Compressing objects: 52% (765/1470)
remote: Compressing objects: 53% (780/1470)
remote: Compressing objects: 54% (794/1470)
remote: Compressing objects: 55% (809/1470)
remote: Compressing objects: 56% (824/1470)
remote: Compressing objects: 57% (838/1470)
remote: Compressing objects: 58% (853/1470)
remote: Compressing objects: 59% (868/1470)
remote: Compressing objects: 60% (882/1470)
remote: Compressing objects: 61% (897/1470)
remote: Compressing objects: 62% (912/1470)
remote: Compressing objects: 63% (927/1470)
remote: Compressing objects: 64% (941/1470)
remote: Compressing objects: 65% (956/1470)
remote: Compressing objects: 66% (971/1470)
remote: Compressing objects: 67% (985/1470)
remote: Compressing objects: 68% (1000/1470)
remote: Compressing objects: 69% (1015/1470)
remote: Compressing objects: 70% (1029/1470)
remote: Compressing objects: 71% (1044/1470)
remote: Compressing objects: 72% (1059/1470)
remote: Compressing objects: 73% (1074/1470)
remote: Compressing objects: 74% (1088/1470)
remote: Compressing objects: 75% (1103/1470)
remote: Compressing objects: 76% (1118/1470)
remote: Compressing objects: 77% (1132/1470)
remote: Compressing objects: 78% (1147/1470)
remote: Compressing objects: 79% (1162/1470)
remote: Compressing objects: 80% (1176/1470)
remote: Compressing objects: 81% (1191/1470)
remote: Compressing objects: 82% (1206/1470)
remote: Compressing objects: 83% (1221/1470)
remote: Compressing objects: 84% (1235/1470)
remote: Compressing objects: 85% (1250/1470)
remote: Compressing objects: 86% (1265/1470)
remote: Compressing objects: 87% (1279/1470)
remote: Compressing objects: 88% (1294/1470)
remote: Compressing objects: 89% (1309/1470)
remote: Compressing objects: 90% (1323/1470)
remote: Compressing objects: 91% (1338/1470)
remote: Compressing objects: 92% (1353/1470)
remote: Compressing objects: 93% (1368/1470)
remote: Compressing objects: 94% (1382/1470)
remote: Compressing objects: 95% (1397/1470)
remote: Compressing objects: 96% (1412/1470)
remote: Compressing objects: 97% (1426/1470)
remote: Compressing objects: 98% (1441/1470)
remote: Compressing objects: 99% (1456/1470)
remote: Compressing objects: 100% (1470/1470)
remote: Compressing objects: 100% (1470/1470), done.
29.09 s
Receiving objects: 0% (1/162082)
Receiving objects: 1% (1621/162082)
Receiving objects: 2% (3242/162082)
Receiving objects: 3% (4863/162082)
Receiving objects: 4% (6484/162082), 8.54 MiB | 17.05 MiB/s
Receiving objects: 4% (6548/162082), 8.54 MiB | 17.05 MiB/s
Receiving objects: 5% (8105/162082), 23.36 MiB | 15.41 MiB/s
Receiving objects: 6% (9725/162082), 23.36 MiB | 15.41 MiB/s
Receiving objects: 6% (9736/162082), 23.36 MiB | 15.41 MiB/s
Receiving objects: 7% (11346/162082), 39.32 MiB | 15.63 MiB/s
Receiving objects: 8% (12967/162082), 39.32 MiB | 15.63 MiB/s
Receiving objects: 9% (14588/162082), 39.32 MiB | 15.63 MiB/s
Receiving objects: 10% (16209/162082), 39.32 MiB | 15.63 MiB/s
Receiving objects: 10% (17468/162082), 39.32 MiB | 15.63 MiB/s
Receiving objects: 11% (17830/162082), 47.69 MiB | 15.80 MiB/s
Receiving objects: 12% (19450/162082), 56.22 MiB | 15.97 MiB/s
Receiving objects: 13% (21071/162082), 56.22 MiB | 15.97 MiB/s
Receiving objects: 13% (21578/162082), 56.22 MiB | 15.97 MiB/s
Receiving objects: 14% (22692/162082), 64.96 MiB | 16.16 MiB/s
Receiving objects: 15% (24313/162082), 74.03 MiB | 16.38 MiB/s
Receiving objects: 16% (25934/162082), 74.03 MiB | 16.38 MiB/s
Receiving objects: 16% (26332/162082), 82.87 MiB | 16.45 MiB/s
Receiving objects: 17% (27554/162082), 92.21 MiB | 16.95 MiB/s
Receiving objects: 18% (29175/162082), 92.21 MiB | 16.95 MiB/s
Receiving objects: 18% (29403/162082), 92.21 MiB | 16.95 MiB/s
Receiving objects: 19% (30796/162082), 101.67 MiB | 17.38 MiB/s
Receiving objects: 20% (32417/162082), 101.67 MiB | 17.38 MiB/s
Receiving objects: 21% (34038/162082), 111.23 MiB | 17.76 MiB/s
Receiving objects: 21% (34531/162082), 111.23 MiB | 17.76 MiB/s
Receiving objects: 22% (35659/162082), 120.49 MiB | 18.01 MiB/s
Receiving objects: 23% (37279/162082), 129.96 MiB | 18.26 MiB/s
Receiving objects: 24% (38900/162082), 129.96 MiB | 18.26 MiB/s
Receiving objects: 24% (39103/162082), 138.79 MiB | 18.33 MiB/s
Receiving objects: 25% (40521/162082), 138.79 MiB | 18.33 MiB/s
Receiving objects: 26% (42142/162082), 146.62 MiB | 18.13 MiB/s
Receiving objects: 26% (43150/162082), 155.45 MiB | 18.08 MiB/s
Receiving objects: 27% (43763/162082), 155.45 MiB | 18.08 MiB/s
Receiving objects: 28% (45383/162082), 155.45 MiB | 18.08 MiB/s
Receiving objects: 29% (47004/162082), 155.45 MiB | 18.08 MiB/s
Receiving objects: 30% (48625/162082), 155.45 MiB | 18.08 MiB/s
Receiving objects: 31% (50246/162082), 163.14 MiB | 17.82 MiB/s
Receiving objects: 32% (51867/162082), 163.14 MiB | 17.82 MiB/s
Receiving objects: 33% (53488/162082), 163.14 MiB | 17.82 MiB/s
Receiving objects: 34% (55108/162082), 163.14 MiB | 17.82 MiB/s
Receiving objects: 35% (56729/162082), 163.14 MiB | 17.82 MiB/s
Receiving objects: 35% (58166/162082), 163.14 MiB | 17.82 MiB/s
Receiving objects: 36% (58350/162082), 163.14 MiB | 17.82 MiB/s
Receiving objects: 37% (59971/162082), 171.34 MiB | 17.57 MiB/s
Receiving objects: 38% (61592/162082), 171.34 MiB | 17.57 MiB/s
Receiving objects: 39% (63212/162082), 171.34 MiB | 17.57 MiB/s
Receiving objects: 40% (64833/162082), 180.79 MiB | 17.57 MiB/s
Receiving objects: 41% (66454/162082), 180.79 MiB | 17.57 MiB/s
Receiving objects: 41% (67850/162082), 180.79 MiB | 17.57 MiB/s
Receiving objects: 42% (68075/162082), 180.79 MiB | 17.57 MiB/s
Receiving objects: 43% (69696/162082), 191.33 MiB | 17.79 MiB/s
Receiving objects: 44% (71317/162082), 191.33 MiB | 17.79 MiB/s
Receiving objects: 45% (72937/162082), 191.33 MiB | 17.79 MiB/s
Receiving objects: 46% (74558/162082), 191.33 MiB | 17.79 MiB/s
Receiving objects: 47% (76179/162082), 202.96 MiB | 18.32 MiB/s
Receiving objects: 48% (77800/162082), 202.96 MiB | 18.32 MiB/s
Receiving objects: 48% (77856/162082), 215.55 MiB | 19.02 MiB/s
Receiving objects: 48% (78082/162082), 235.88 MiB | 19.83 MiB/s
Receiving objects: 48% (78212/162082), 256.64 MiB | 20.64 MiB/s
Receiving objects: 48% (79278/162082), 267.29 MiB | 21.18 MiB/s
Receiving objects: 49% (79421/162082), 267.29 MiB | 21.18 MiB/s
Receiving objects: 50% (81041/162082), 277.18 MiB | 21.28 MiB/s
Receiving objects: 50% (82015/162082), 293.12 MiB | 19.90 MiB/s
Receiving objects: 51% (82662/162082), 293.12 MiB | 19.90 MiB/s
Receiving objects: 51% (83693/162082), 305.75 MiB | 17.61 MiB/s
Receiving objects: 52% (84283/162082), 313.54 MiB | 17.14 MiB/s
Receiving objects: 53% (85904/162082), 313.54 MiB | 17.14 MiB/s
Receiving objects: 54% (87525/162082), 313.54 MiB | 17.14 MiB/s
Receiving objects: 54% (88278/162082), 322.46 MiB | 16.82 MiB/s
Receiving objects: 55% (89146/162082), 322.46 MiB | 16.82 MiB/s
Receiving objects: 56% (90766/162082), 329.73 MiB | 16.22 MiB/s
Receiving objects: 57% (92387/162082), 329.73 MiB | 16.22 MiB/s
Receiving objects: 58% (94008/162082), 329.73 MiB | 16.22 MiB/s
Receiving objects: 59% (95629/162082), 329.73 MiB | 16.22 MiB/s
Receiving objects: 60% (97250/162082), 329.73 MiB | 16.22 MiB/s
Receiving objects: 61% (98871/162082), 329.73 MiB | 16.22 MiB/s
Receiving objects: 62% (100491/162082), 329.73 MiB | 16.22 MiB/s
Receiving objects: 63% (102112/162082), 329.73 MiB | 16.22 MiB/s
Receiving objects: 64% (103733/162082), 329.73 MiB | 16.22 MiB/s
Receiving objects: 65% (105354/162082), 329.73 MiB | 16.22 MiB/s
Receiving objects: 66% (106975/162082), 329.73 MiB | 16.22 MiB/s
Receiving objects: 67% (108595/162082), 329.73 MiB | 16.22 MiB/s
Receiving objects: 68% (110216/162082), 329.73 MiB | 16.22 MiB/s
Receiving objects: 69% (111837/162082), 329.73 MiB | 16.22 MiB/s
Receiving objects: 69% (113295/162082), 329.73 MiB | 16.22 MiB/s
Receiving objects: 70% (113458/162082), 329.73 MiB | 16.22 MiB/s
Receiving objects: 71% (115079/162082), 329.73 MiB | 16.22 MiB/s
Receiving objects: 72% (116700/162082), 329.73 MiB | 16.22 MiB/s
Receiving objects: 73% (118320/162082), 329.73 MiB | 16.22 MiB/s
Receiving objects: 74% (119941/162082), 341.84 MiB | 16.55 MiB/s
Receiving objects: 75% (121562/162082), 341.84 MiB | 16.55 MiB/s
Receiving objects: 76% (123183/162082), 341.84 MiB | 16.55 MiB/s
Receiving objects: 76% (124102/162082), 353.75 MiB | 17.00 MiB/s
Receiving objects: 77% (124804/162082), 366.14 MiB | 17.79 MiB/s
Receiving objects: 78% (126424/162082), 366.14 MiB | 17.79 MiB/s
Receiving objects: 79% (128045/162082), 366.14 MiB | 17.79 MiB/s
Receiving objects: 80% (129666/162082), 366.14 MiB | 17.79 MiB/s
Receiving objects: 81% (131287/162082), 366.14 MiB | 17.79 MiB/s
Receiving objects: 82% (132908/162082), 366.14 MiB | 17.79 MiB/s
Receiving objects: 82% (133436/162082), 391.47 MiB | 20.43 MiB/s
Receiving objects: 83% (134529/162082), 391.47 MiB | 20.43 MiB/s
Receiving objects: 84% (136149/162082), 403.57 MiB | 21.71 MiB/s
Receiving objects: 85% (137770/162082), 403.57 MiB | 21.71 MiB/s
Receiving objects: 85% (138576/162082), 403.57 MiB | 21.71 MiB/s
Receiving objects: 86% (139391/162082), 415.91 MiB | 22.72 MiB/s
Receiving objects: 87% (141012/162082), 415.91 MiB | 22.72 MiB/s
Receiving objects: 88% (142633/162082), 415.91 MiB | 22.72 MiB/s
Receiving objects: 89% (144253/162082), 428.05 MiB | 22.80 MiB/s
Receiving objects: 89% (145252/162082), 428.05 MiB | 22.80 MiB/s
Receiving objects: 90% (145874/162082), 438.80 MiB | 23.32 MiB/s
Receiving objects: 91% (147495/162082), 448.38 MiB | 22.78 MiB/s
Receiving objects: 91% (147608/162082), 448.38 MiB | 22.78 MiB/s
Receiving objects: 92% (149116/162082), 448.38 MiB | 22.78 MiB/s
Receiving objects: 93% (150737/162082), 458.12 MiB | 22.32 MiB/s
Receiving objects: 94% (152358/162082), 458.12 MiB | 22.32 MiB/s
Receiving objects: 94% (152857/162082), 468.29 MiB | 21.84 MiB/s
Receiving objects: 95% (153978/162082), 478.14 MiB | 20.96 MiB/s
Receiving objects: 96% (155599/162082), 478.14 MiB | 20.96 MiB/s
Receiving objects: 97% (157220/162082), 488.59 MiB | 20.78 MiB/s
Receiving objects: 97% (157916/162082), 488.59 MiB | 20.78 MiB/s
Receiving objects: 98% (158841/162082), 488.59 MiB | 20.78 MiB/s
Receiving objects: 99% (160462/162082), 488.59 MiB | 20.78 MiB/s
remote: Total 162082 (delta 2545), reused 2660 (delta 2170), pack-reused 158424 (from 3)
29.10 s
Receiving objects: 100% (162082/162082), 499.07 MiB | 20.43 MiB/s
Receiving objects: 100% (162082/162082), 500.55 MiB | 19.04 MiB/s, done.
31.29 s
Resolving deltas: 0% (0/105553)
Resolving deltas: 1% (1056/105553)
Resolving deltas: 2% (2112/105553)
Resolving deltas: 3% (3167/105553)
Resolving deltas: 4% (4223/105553)
Resolving deltas: 5% (5278/105553)
Resolving deltas: 6% (6335/105553)
Resolving deltas: 7% (7389/105553)
Resolving deltas: 8% (8445/105553)
Resolving deltas: 9% (9500/105553)
Resolving deltas: 10% (10556/105553)
Resolving deltas: 11% (11612/105553)
Resolving deltas: 12% (12667/105553)
Resolving deltas: 13% (13723/105553)
Resolving deltas: 14% (14779/105553)
Resolving deltas: 15% (15833/105553)
Resolving deltas: 16% (16889/105553)
Resolving deltas: 17% (17945/105553)
Resolving deltas: 18% (19002/105553)
Resolving deltas: 19% (20056/105553)
Resolving deltas: 20% (21111/105553)
Resolving deltas: 21% (22167/105553)
Resolving deltas: 22% (23222/105553)
Resolving deltas: 23% (24279/105553)
Resolving deltas: 24% (25333/105553)
Resolving deltas: 25% (26389/105553)
Resolving deltas: 26% (27446/105553)
Resolving deltas: 27% (28501/105553)
Resolving deltas: 28% (29556/105553)
Resolving deltas: 29% (30613/105553)
Resolving deltas: 30% (31666/105553)
Resolving deltas: 31% (32725/105553)
Resolving deltas: 32% (33778/105553)
Resolving deltas: 33% (34833/105553)
Resolving deltas: 34% (35889/105553)
Resolving deltas: 35% (36945/105553)
Resolving deltas: 36% (38000/105553)
Resolving deltas: 37% (39055/105553)
Resolving deltas: 38% (40111/105553)
Resolving deltas: 39% (41166/105553)
Resolving deltas: 40% (42222/105553)
Resolving deltas: 41% (43277/105553)
Resolving deltas: 42% (44333/105553)
Resolving deltas: 43% (45388/105553)
Resolving deltas: 43% (46356/105553)
Resolving deltas: 44% (46444/105553)
Resolving deltas: 45% (47499/105553)
Resolving deltas: 46% (48555/105553)
Resolving deltas: 47% (49611/105553)
Resolving deltas: 48% (50666/105553)
Resolving deltas: 49% (51721/105553)
Resolving deltas: 50% (52777/105553)
Resolving deltas: 51% (53834/105553)
Resolving deltas: 52% (54889/105553)
Resolving deltas: 53% (55944/105553)
Resolving deltas: 54% (56999/105553)
Resolving deltas: 55% (58055/105553)
Resolving deltas: 56% (59110/105553)
Resolving deltas: 57% (60166/105553)
Resolving deltas: 58% (61221/105553)
Resolving deltas: 59% (62277/105553)
Resolving deltas: 60% (63332/105553)
Resolving deltas: 61% (64388/105553)
Resolving deltas: 62% (65445/105553)
Resolving deltas: 63% (66499/105553)
Resolving deltas: 64% (67555/105553)
Resolving deltas: 65% (68610/105553)
Resolving deltas: 66% (69665/105553)
Resolving deltas: 67% (70721/105553)
Resolving deltas: 68% (71777/105553)
Resolving deltas: 69% (72832/105553)
Resolving deltas: 70% (73888/105553)
Resolving deltas: 71% (74943/105553)
Resolving deltas: 72% (75999/105553)
Resolving deltas: 73% (77054/105553)
Resolving deltas: 74% (78110/105553)
Resolving deltas: 75% (79166/105553)
Resolving deltas: 76% (80221/105553)
Resolving deltas: 77% (81276/105553)
Resolving deltas: 78% (82333/105553)
Resolving deltas: 79% (83387/105553)
Resolving deltas: 80% (84443/105553)
Resolving deltas: 81% (85498/105553)
Resolving deltas: 82% (86554/105553)
Resolving deltas: 83% (87609/105553)
Resolving deltas: 84% (88665/105553)
Resolving deltas: 85% (89721/105553)
Resolving deltas: 86% (90776/105553)
Resolving deltas: 87% (91832/105553)
Resolving deltas: 88% (92887/105553)
Resolving deltas: 89% (93943/105553)
Resolving deltas: 90% (94998/105553)
Resolving deltas: 91% (96054/105553)
Resolving deltas: 92% (97109/105553)
Resolving deltas: 93% (98165/105553)
Resolving deltas: 94% (99220/105553)
Resolving deltas: 94% (99284/105553)
Resolving deltas: 95% (100276/105553)
Resolving deltas: 96% (101331/105553)
Resolving deltas: 97% (102389/105553)
Resolving deltas: 98% (103442/105553)
Resolving deltas: 99% (104498/105553)
Resolving deltas: 100% (105553/105553)
Resolving deltas: 100% (105553/105553), done.
32.04 s
Fetching commit 8959f063dd3a21d9dfa4be72260815fa7c625bde for feynkit ...
32.04 s
$ /nix/store/b1wn5clix1mz4vpfih7x9cnj9qfh7c6h-git-2.54.0/bin/git fetch origin 8959f063dd3a21d9dfa4be72260815fa7c625bde
32.46 s
From https://github.com/alphal00p/gammaloop
32.46 s
* branch 8959f063dd3a21d9dfa4be72260815fa7c625bde -> FETCH_HEAD
32.47 s
$ /nix/store/bhv6xyvqw6gjs3j488gi1z6wdv18bdpa-coreutils-9.11/bin/timeout --kill-after=15s 7200s /nix/store/b1wn5clix1mz4vpfih7x9cnj9qfh7c6h-git-2.54.0/bin/git -c advice.detachedHead=false checkout 8959f063dd3a21d9dfa4be72260815fa7c625bde
32.89 s
HEAD is now at 8959f063d record indexed tensor qualification and remaining performance limits
32.90 s
$ /nix/store/bhv6xyvqw6gjs3j488gi1z6wdv18bdpa-coreutils-9.11/bin/timeout --kill-after=15s 7200s /nix/store/bxgja2ppiqi6w2bgn0r07d7mgnl1k6k2-nix-2.34.8/bin/nix --extra-experimental-features nix-command --extra-experimental-features flakes --log-format internal-json run .#packages.x86_64-linux.nix-ci-check-gammaloop-nextest-spenso --print-build-logs
33.02 s
warning: ignoring untrusted flake configuration setting 'extra-substituters'.
33.02 s
Pass '--accept-flake-config' to trust it
33.02 s
warning: ignoring untrusted flake configuration setting 'extra-trusted-public-keys'.
33.02 s
Pass '--accept-flake-config' to trust it
33.03 s
error (ignored): SQLite database '/var/cache/nix-ci-worker/eval-cache-v6/44d2f7647dffd26b47c6455ce0b671c28e2b57709dc4ee7a1bfb1638af013319.sqlite ' is busy
33.03 s
33.03 s
Downloading cached source from https://cache.nix-ci.com
36.85 s
Downloaded cached source (204.9 MiB) in 3.8s
36.85 s
Progress: 1 of 1 downloaded from cache
49.79 s
fetching Git repository 'https://github.com/alphal00p/momtrop'
50.28 s
remote: Enumerating objects: 735, done.
50.28 s
remote: Counting objects: 0% (1/129)
remote: Counting objects: 1% (2/129)
remote: Counting objects: 2% (3/129)
remote: Counting objects: 3% (4/129)
remote: Counting objects: 4% (6/129)
remote: Counting objects: 5% (7/129)
remote: Counting objects: 6% (8/129)
remote: Counting objects: 7% (10/129)
remote: Counting objects: 8% (11/129)
remote: Counting objects: 9% (12/129)
remote: Counting objects: 10% (13/129)
remote: Counting objects: 11% (15/129)
remote: Counting objects: 12% (16/129)
remote: Counting objects: 13% (17/129)
remote: Counting objects: 14% (19/129)
remote: Counting objects: 15% (20/129)
remote: Counting objects: 16% (21/129)
remote: Counting objects: 17% (22/129)
remote: Counting objects: 18% (24/129)
remote: Counting objects: 19% (25/129)
remote: Counting objects: 20% (26/129)
remote: Counting objects: 21% (28/129)
remote: Counting objects: 22% (29/129)
remote: Counting objects: 23% (30/129)
remote: Counting objects: 24% (31/129)
remote: Counting objects: 25% (33/129)
remote: Counting objects: 26% (34/129)
remote: Counting objects: 27% (35/129)
remote: Counting objects: 28% (37/129)
remote: Counting objects: 29% (38/129)
remote: Counting objects: 30% (39/129)
remote: Counting objects: 31% (40/129)
remote: Counting objects: 32% (42/129)
remote: Counting objects: 33% (43/129)
remote: Counting objects: 34% (44/129)
remote: Counting objects: 35% (46/129)
remote: Counting objects: 36% (47/129)
remote: Counting objects: 37% (48/129)
remote: Counting objects: 38% (50/129)
remote: Counting objects: 39% (51/129)
remote: Counting objects: 40% (52/129)
remote: Counting objects: 41% (53/129)
remote: Counting objects: 42% (55/129)
remote: Counting objects: 43% (56/129)
remote: Counting objects: 44% (57/129)
remote: Counting objects: 45% (59/129)
remote: Counting objects: 46% (60/129)
remote: Counting objects: 47% (61/129)
remote: Counting objects: 48% (62/129)
remote: Counting objects: 49% (64/129)
remote: Counting objects: 50% (65/129)
remote: Counting objects: 51% (66/129)
remote: Counting objects: 52% (68/129)
remote: Counting objects: 53% (69/129)
remote: Counting objects: 54% (70/129)
remote: Counting objects: 55% (71/129)
remote: Counting objects: 56% (73/129)
remote: Counting objects: 57% (74/129)
remote: Counting objects: 58% (75/129)
remote: Counting objects: 59% (77/129)
remote: Counting objects: 60% (78/129)
remote: Counting objects: 61% (79/129)
remote: Counting objects: 62% (80/129)
remote: Counting objects: 63% (82/129)
remote: Counting objects: 64% (83/129)
remote: Counting objects: 65% (84/129)
remote: Counting objects: 66% (86/129)
remote: Counting objects: 67% (87/129)
remote: Counting objects: 68% (88/129)
remote: Counting objects: 69% (90/129)
remote: Counting objects: 70% (91/129)
remote: Counting objects: 71% (92/129)
remote: Counting objects: 72% (93/129)
remote: Counting objects: 73% (95/129)
remote: Counting objects: 74% (96/129)
remote: Counting objects: 75% (97/129)
remote: Counting objects: 76% (99/129)
remote: Counting objects: 77% (100/129)
remote: Counting objects: 78% (101/129)
remote: Counting objects: 79% (102/129)
remote: Counting objects: 80% (104/129)
remote: Counting objects: 81% (105/129)
remote: Counting objects: 82% (106/129)
remote: Counting objects: 83% (108/129)
remote: Counting objects: 84% (109/129)
remote: Counting objects: 85% (110/129)
remote: Counting objects: 86% (111/129)
remote: Counting objects: 87% (113/129)
remote: Counting objects: 88% (114/129)
remote: Counting objects: 89% (115/129)
remote: Counting objects: 90% (117/129)
remote: Counting objects: 91% (118/129)
remote: Counting objects: 92% (119/129)
remote: Counting objects: 93% (120/129)
remote: Counting objects: 94% (122/129)
remote: Counting objects: 95% (123/129)
remote: Counting objects: 96% (124/129)
remote: Counting objects: 97% (126/129)
remote: Counting objects: 98% (127/129)
remote: Counting objects: 99% (128/129)
remote: Counting objects: 100% (129/129)
remote: Counting objects: 100% (129/129), done.
50.29 s
remote: Compressing objects: 1% (1/72)
remote: Compressing objects: 2% (2/72)
remote: Compressing objects: 4% (3/72)
remote: Compressing objects: 5% (4/72)
remote: Compressing objects: 6% (5/72)
remote: Compressing objects: 8% (6/72)
remote: Compressing objects: 9% (7/72)
remote: Compressing objects: 11% (8/72)
remote: Compressing objects: 12% (9/72)
remote: Compressing objects: 13% (10/72)
remote: Compressing objects: 15% (11/72)
remote: Compressing objects: 16% (12/72)
remote: Compressing objects: 18% (13/72)
remote: Compressing objects: 19% (14/72)
remote: Compressing objects: 20% (15/72)
remote: Compressing objects: 22% (16/72)
remote: Compressing objects: 23% (17/72)
remote: Compressing objects: 25% (18/72)
remote: Compressing objects: 26% (19/72)
remote: Compressing objects: 27% (20/72)
remote: Compressing objects: 29% (21/72)
remote: Compressing objects: 30% (22/72)
remote: Compressing objects: 31% (23/72)
remote: Compressing objects: 33% (24/72)
remote: Compressing objects: 34% (25/72)
remote: Compressing objects: 36% (26/72)
remote: Compressing objects: 37% (27/72)
remote: Compressing objects: 38% (28/72)
remote: Compressing objects: 40% (29/72)
remote: Compressing objects: 41% (30/72)
remote: Compressing objects: 43% (31/72)
remote: Compressing objects: 44% (32/72)
remote: Compressing objects: 45% (33/72)
remote: Compressing objects: 47% (34/72)
remote: Compressing objects: 48% (35/72)
remote: Compressing objects: 50% (36/72)
remote: Compressing objects: 51% (37/72)
remote: Compressing objects: 52% (38/72)
remote: Compressing objects: 54% (39/72)
remote: Compressing objects: 55% (40/72)
remote: Compressing objects: 56% (41/72)
remote: Compressing objects: 58% (42/72)
remote: Compressing objects: 59% (43/72)
remote: Compressing objects: 61% (44/72)
remote: Compressing objects: 62% (45/72)
remote: Compressing objects: 63% (46/72)
remote: Compressing objects: 65% (47/72)
remote: Compressing objects: 66% (48/72)
remote: Compressing objects: 68% (49/72)
remote: Compressing objects: 69% (50/72)
remote: Compressing objects: 70% (51/72)
remote: Compressing objects: 72% (52/72)
remote: Compressing objects: 73% (53/72)
remote: Compressing objects: 75% (54/72)
remote: Compressing objects: 76% (55/72)
remote: Compressing objects: 77% (56/72)
remote: Compressing objects: 79% (57/72)
remote: Compressing objects: 80% (58/72)
remote: Compressing objects: 81% (59/72)
remote: Compressing objects: 83% (60/72)
remote: Compressing objects: 84% (61/72)
remote: Compressing objects: 86% (62/72)
remote: Compressing objects: 87% (63/72)
remote: Compressing objects: 88% (64/72)
remote: Compressing objects: 90% (65/72)
remote: Compressing objects: 91% (66/72)
remote: Compressing objects: 93% (67/72)
remote: Compressing objects: 94% (68/72)
remote: Compressing objects: 95% (69/72)
remote: Compressing objects: 97% (70/72)
remote: Compressing objects: 98% (71/72)
remote: Compressing objects: 100% (72/72)
remote: Compressing objects: 100% (72/72), done.
50.30 s
Receiving objects: 0% (1/735)
Receiving objects: 1% (8/735)
Receiving objects: 2% (15/735)
Receiving objects: 3% (23/735)
Receiving objects: 4% (30/735)
Receiving objects: 5% (37/735)
Receiving objects: 6% (45/735)
Receiving objects: 7% (52/735)
Receiving objects: 8% (59/735)
Receiving objects: 9% (67/735)
Receiving objects: 10% (74/735)
Receiving objects: 11% (81/735)
Receiving objects: 12% (89/735)
Receiving objects: 13% (96/735)
Receiving objects: 14% (103/735)
Receiving objects: 15% (111/735)
Receiving objects: 16% (118/735)
Receiving objects: 17% (125/735)
Receiving objects: 18% (133/735)
Receiving objects: 19% (140/735)
Receiving objects: 20% (147/735)
Receiving objects: 21% (155/735)
Receiving objects: 22% (162/735)
Receiving objects: 23% (170/735)
Receiving objects: 24% (177/735)
Receiving objects: 25% (184/735)
Receiving objects: 26% (192/735)
Receiving objects: 27% (199/735)
Receiving objects: 28% (206/735)
Receiving objects: 29% (214/735)
Receiving objects: 30% (221/735)
Receiving objects: 31% (228/735)
Receiving objects: 32% (236/735)
Receiving objects: 33% (243/735)
Receiving objects: 34% (250/735)
Receiving objects: 35% (258/735)
Receiving objects: 36% (265/735)
Receiving objects: 37% (272/735)
Receiving objects: 38% (280/735)
Receiving objects: 39% (287/735)
Receiving objects: 40% (294/735)
Receiving objects: 41% (302/735)
Receiving objects: 42% (309/735)
Receiving objects: 43% (317/735)
Receiving objects: 44% (324/735)
Receiving objects: 45% (331/735)
Receiving objects: 46% (339/735)
Receiving objects: 47% (346/735)
Receiving objects: 48% (353/735)
Receiving objects: 49% (361/735)
Receiving objects: 50% (368/735)
Receiving objects: 51% (375/735)
Receiving objects: 52% (383/735)
Receiving objects: 53% (390/735)
Receiving objects: 54% (397/735)
Receiving objects: 55% (405/735)
Receiving objects: 56% (412/735)
Receiving objects: 57% (419/735)
Receiving objects: 58% (427/735)
Receiving objects: 59% (434/735)
Receiving objects: 60% (441/735)
Receiving objects: 61% (449/735)
Receiving objects: 62% (456/735)
Receiving objects: 63% (464/735)
Receiving objects: 64% (471/735)
Receiving objects: 65% (478/735)
Receiving objects: 66% (486/735)
Receiving objects: 67% (493/735)
Receiving objects: 68% (500/735)
Receiving objects: 69% (508/735)
Receiving objects: 70% (515/735)
Receiving objects: 71% (522/735)
Receiving objects: 72% (530/735)
Receiving objects: 73% (537/735)
Receiving objects: 74% (544/735)
Receiving objects: 75% (552/735)
Receiving objects: 76% (559/735)
Receiving objects: 77% (566/735)
Receiving objects: 78% (574/735)
Receiving objects: 79% (581/735)
Receiving objects: 80% (588/735)
Receiving objects: 81% (596/735)
Receiving objects: 82% (603/735)
Receiving objects: 83% (611/735)
Receiving objects: 84% (618/735)
Receiving objects: 85% (625/735)
Receiving objects: 86% (633/735)
Receiving objects: 87% (640/735)
Receiving objects: 88% (647/735)
Receiving objects: 89% (655/735)
Receiving objects: 90% (662/735)
Receiving objects: 91% (669/735)
Receiving objects: 92% (677/735)
Receiving objects: 93% (684/735)
remote: Total 735 (delta 77), reused 90 (delta 50), pack-reused 606 (from 1)
50.30 s
Receiving objects: 94% (691/735)
Receiving objects: 95% (699/735)
Receiving objects: 96% (706/735)
Receiving objects: 97% (713/735)
Receiving objects: 98% (721/735)
Receiving objects: 99% (728/735)
Receiving objects: 100% (735/735)
Receiving objects: 100% (735/735), 158.80 KiB | 22.69 MiB/s, done.
50.30 s
Resolving deltas: 0% (0/468)
Resolving deltas: 1% (5/468)
Resolving deltas: 2% (10/468)
Resolving deltas: 3% (15/468)
Resolving deltas: 4% (19/468)
Resolving deltas: 5% (24/468)
Resolving deltas: 6% (29/468)
Resolving deltas: 7% (33/468)
Resolving deltas: 8% (39/468)
Resolving deltas: 9% (43/468)
Resolving deltas: 10% (47/468)
Resolving deltas: 11% (53/468)
Resolving deltas: 12% (57/468)
Resolving deltas: 13% (62/468)
Resolving deltas: 14% (69/468)
Resolving deltas: 15% (71/468)
Resolving deltas: 16% (76/468)
Resolving deltas: 17% (81/468)
Resolving deltas: 18% (85/468)
Resolving deltas: 19% (89/468)
Resolving deltas: 20% (94/468)
Resolving deltas: 21% (99/468)
Resolving deltas: 22% (103/468)
Resolving deltas: 23% (108/468)
Resolving deltas: 24% (114/468)
Resolving deltas: 25% (119/468)
Resolving deltas: 26% (122/468)
Resolving deltas: 27% (127/468)
Resolving deltas: 28% (133/468)
Resolving deltas: 29% (136/468)
Resolving deltas: 30% (142/468)
Resolving deltas: 31% (146/468)
Resolving deltas: 32% (150/468)
Resolving deltas: 33% (155/468)
Resolving deltas: 34% (161/468)
Resolving deltas: 35% (164/468)
Resolving deltas: 36% (169/468)
Resolving deltas: 37% (174/468)
Resolving deltas: 38% (178/468)
Resolving deltas: 39% (183/468)
Resolving deltas: 40% (188/468)
Resolving deltas: 41% (192/468)
Resolving deltas: 42% (197/468)
Resolving deltas: 43% (202/468)
Resolving deltas: 44% (206/468)
Resolving deltas: 45% (213/468)
Resolving deltas: 46% (216/468)
Resolving deltas: 47% (220/468)
Resolving deltas: 48% (227/468)
Resolving deltas: 49% (230/468)
Resolving deltas: 50% (235/468)
Resolving deltas: 51% (239/468)
Resolving deltas: 52% (244/468)
Resolving deltas: 53% (249/468)
Resolving deltas: 54% (253/468)
Resolving deltas: 55% (258/468)
Resolving deltas: 56% (263/468)
Resolving deltas: 57% (267/468)
Resolving deltas: 58% (272/468)
Resolving deltas: 59% (277/468)
Resolving deltas: 60% (281/468)
Resolving deltas: 61% (287/468)
Resolving deltas: 62% (292/468)
Resolving deltas: 63% (295/468)
Resolving deltas: 64% (300/468)
Resolving deltas: 65% (305/468)
Resolving deltas: 66% (309/468)
Resolving deltas: 67% (314/468)
Resolving deltas: 68% (319/468)
Resolving deltas: 69% (324/468)
Resolving deltas: 70% (328/468)
Resolving deltas: 71% (333/468)
Resolving deltas: 72% (337/468)
Resolving deltas: 73% (342/468)
Resolving deltas: 74% (347/468)
Resolving deltas: 75% (352/468)
Resolving deltas: 76% (356/468)
Resolving deltas: 77% (361/468)
Resolving deltas: 78% (366/468)
Resolving deltas: 79% (370/468)
Resolving deltas: 80% (375/468)
Resolving deltas: 81% (381/468)
Resolving deltas: 82% (384/468)
Resolving deltas: 83% (389/468)
Resolving deltas: 84% (396/468)
Resolving deltas: 85% (399/468)
Resolving deltas: 86% (404/468)
Resolving deltas: 87% (408/468)
Resolving deltas: 88% (412/468)
Resolving deltas: 89% (417/468)
Resolving deltas: 90% (422/468)
Resolving deltas: 91% (426/468)
Resolving deltas: 92% (432/468)
Resolving deltas: 93% (437/468)
Resolving deltas: 94% (441/468)
Resolving deltas: 95% (445/468)
Resolving deltas: 96% (450/468)
Resolving deltas: 97% (455/468)
Resolving deltas: 98% (459/468)
Resolving deltas: 99% (464/468)
Resolving deltas: 100% (468/468)
Resolving deltas: 100% (468/468), done.
50.32 s
From https://github.com/alphal00p/momtrop
50.32 s
* [new branch] criterion-dev-dependency -> criterion-dev-dependency
50.32 s
* [new branch] float_refactor -> float_refactor
50.32 s
* [new branch] logger_feature -> logger_feature
50.32 s
* [new branch] main -> main
50.32 s
* [new branch] pyo3 -> pyo3
50.32 s
* [new branch] sympol -> sympol
50.32 s
* [new branch] test_branch -> test_branch
50.32 s
* [new ref] refs/pull/1/head -> refs/pull/1/head
50.32 s
* [new ref] refs/pull/2/head -> refs/pull/2/head
50.32 s
* [new ref] refs/pull/3/head -> refs/pull/3/head
50.32 s
* [new ref] refs/pull/4/head -> refs/pull/4/head
50.32 s
* [new tag] v0.2.0 -> v0.2.0
50.32 s
* [new tag] v0.2.1 -> v0.2.1
50.32 s
* [new tag] v0.3.0 -> v0.3.0
78.24 s
78.25 s
Downloading cached bash from https://cache.nix-ci.com
78.26 s
Downloading cached aws-c-common from https://cache.nix-ci.com
78.26 s
Downloading cached gcc-15.3.0-lib from https://cache.nix-ci.com
78.26 s
Downloading cached openssl from https://cache.nix-ci.com
78.26 s
Downloading cached libsodium-1.0.22-unstable-2026-08 from https://cache.nix-ci.com
78.26 s
Downloading cached sqlite from https://cache.nix-ci.com
78.26 s
Downloading cached libpsl from https://cache.nix-ci.com
78.26 s
Downloading cached nghttp2-1.70.0-lib from https://cache.nix-ci.com
78.26 s
Downloading cached pcre2 from https://cache.nix-ci.com
78.26 s
Downloading cached xz from https://cache.nix-ci.com
78.26 s
Downloaded cached xz in 0ms
78.26 s
Progress: 0 of 1 built, 1 of 45 downloaded from cache (9 downloading)
78.29 s
Downloaded cached bash (1.8 MiB) in 39ms
78.29 s
Progress: 0 of 1 built, 2 of 45 downloaded from cache (8 downloading)
78.29 s
Downloaded cached libsodium-1.0.22-unstable-2026-08 (669 KiB) in 39ms
78.29 s
Progress: 0 of 1 built, 3 of 45 downloaded from cache (7 downloading)
78.31 s
Downloaded cached pcre2 (2 MiB) in 56ms
78.31 s
Progress: 0 of 1 built, 4 of 45 downloaded from cache (6 downloading)
78.31 s
Downloaded cached aws-c-common (1.1 MiB) in 59ms
78.31 s
Progress: 0 of 1 built, 5 of 45 downloaded from cache (5 downloading)
78.32 s
Downloading cached aws-c-compression from https://cache.nix-ci.com
78.32 s
Downloading cached aws-c-sdkutils from https://cache.nix-ci.com
78.32 s
Downloading cached aws-checksums from https://cache.nix-ci.com
78.36 s
Downloaded cached aws-c-compression (31 KiB) in 45ms
78.36 s
Progress: 0 of 1 built, 6 of 45 downloaded from cache (7 downloading)
78.37 s
Downloaded cached libpsl (114 KiB) in 109ms
78.37 s
Progress: 0 of 1 built, 7 of 45 downloaded from cache (6 downloading)
78.37 s
Downloaded cached nghttp2-1.70.0-lib (225 KiB) in 114ms
78.37 s
Progress: 0 of 1 built, 8 of 45 downloaded from cache (5 downloading)
78.37 s
Downloaded cached aws-checksums (86 KiB) in 56ms
78.37 s
Progress: 0 of 1 built, 9 of 45 downloaded from cache (4 downloading)
78.38 s
Downloaded cached aws-c-sdkutils (155 KiB) in 67ms
78.38 s
Progress: 0 of 1 built, 10 of 45 downloaded from cache (3 downloading)
78.39 s
Downloaded cached gcc-15.3.0-lib (9.8 MiB) in 132ms
78.39 s
Progress: 0 of 1 built, 11 of 45 downloaded from cache (2 downloading)
78.39 s
Downloading cached boehm-gc from https://cache.nix-ci.com
78.39 s
Downloading cached icu4c from https://cache.nix-ci.com
78.39 s
Downloaded cached boehm-gc in 0ms
78.39 s
Downloading cached onetbb from https://cache.nix-ci.com
78.39 s
Downloading cached zstd from https://cache.nix-ci.com
78.39 s
Progress: 0 of 1 built, 12 of 45 downloaded from cache (5 downloading)
78.39 s
Downloaded cached onetbb in 0ms
78.39 s
Downloaded cached zstd in 0ms
78.39 s
Progress: 0 of 1 built, 13 of 45 downloaded from cache (4 downloading)
78.39 s
Progress: 0 of 1 built, 14 of 45 downloaded from cache (3 downloading)
78.39 s
Downloading cached libblake3 from https://cache.nix-ci.com
78.39 s
Downloaded cached libblake3 in 0ms
78.39 s
Progress: 0 of 1 built, 15 of 45 downloaded from cache (3 downloading)
78.48 s
Downloaded cached openssl (8.9 MiB) in 222ms
78.48 s
Progress: 0 of 1 built, 16 of 45 downloaded from cache (2 downloading)
78.48 s
Downloading cached aws-c-cal from https://cache.nix-ci.com
78.48 s
Downloaded cached aws-c-cal in 0ms
78.48 s
Downloading cached libarchive-3.8.9-lib from https://cache.nix-ci.com
78.48 s
Downloading cached libssh2 from https://cache.nix-ci.com
78.48 s
Downloading cached krb5-1.22.2-lib from https://cache.nix-ci.com
78.48 s
Downloaded cached libarchive-3.8.9-lib in 0ms
78.48 s
Downloading cached ngtcp2 from https://cache.nix-ci.com
78.48 s
Downloaded cached libssh2 in 0ms
78.48 s
Downloading cached s2n-tls from https://cache.nix-ci.com
78.48 s
Downloaded cached krb5-1.22.2-lib in 0ms
78.48 s
Downloaded cached ngtcp2 in 0ms
78.48 s
Progress: 0 of 1 built, 17 of 45 downloaded from cache (7 downloading)
78.48 s
Downloaded cached s2n-tls in 0ms
78.48 s
Progress: 0 of 1 built, 18 of 45 downloaded from cache (6 downloading)
78.48 s
Progress: 0 of 1 built, 19 of 45 downloaded from cache (5 downloading)
78.48 s
Progress: 0 of 1 built, 20 of 45 downloaded from cache (5 downloading)
78.48 s
Downloading cached libgit2-1.9.7-lib from https://cache.nix-ci.com
78.48 s
Progress: 0 of 1 built, 21 of 45 downloaded from cache (4 downloading)
78.48 s
Downloaded cached libgit2-1.9.7-lib in 0ms
78.48 s
Progress: 0 of 1 built, 22 of 45 downloaded from cache (3 downloading)
78.48 s
Downloading cached aws-c-io from https://cache.nix-ci.com
78.48 s
Downloaded cached aws-c-io in 0ms
78.48 s
Downloading cached curl from https://cache.nix-ci.com
78.48 s
Progress: 0 of 1 built, 23 of 45 downloaded from cache (4 downloading)
78.48 s
Progress: 0 of 1 built, 24 of 45 downloaded from cache (3 downloading)
78.48 s
Downloading cached aws-c-event-stream from https://cache.nix-ci.com
78.48 s
Downloading cached aws-c-http from https://cache.nix-ci.com
78.52 s
Downloaded cached sqlite (5.7 MiB) in 266ms
78.52 s
Progress: 0 of 1 built, 25 of 45 downloaded from cache (4 downloading)
78.54 s
Downloaded cached aws-c-http (641 KiB) in 62ms
78.54 s
Progress: 0 of 1 built, 26 of 45 downloaded from cache (3 downloading)
78.54 s
Downloading cached aws-c-auth from https://cache.nix-ci.com
78.54 s
Downloading cached aws-c-mqtt from https://cache.nix-ci.com
78.54 s
Downloaded cached aws-c-auth in 0ms
78.54 s
Progress: 0 of 1 built, 27 of 45 downloaded from cache (4 downloading)
78.54 s
Downloading cached aws-c-s3 from https://cache.nix-ci.com
78.55 s
Downloaded cached curl (1.2 MiB) in 69ms
78.55 s
Progress: 0 of 1 built, 28 of 45 downloaded from cache (4 downloading)
78.55 s
Downloaded cached aws-c-event-stream (176 KiB) in 69ms
78.55 s
Progress: 0 of 1 built, 29 of 45 downloaded from cache (3 downloading)
78.56 s
Downloaded cached aws-c-mqtt (557 KiB) in 20ms
78.56 s
Progress: 0 of 1 built, 30 of 45 downloaded from cache (2 downloading)
78.57 s
Downloaded cached aws-c-s3 (384 KiB) in 25ms
78.57 s
Progress: 0 of 1 built, 31 of 45 downloaded from cache (1 downloading)
78.57 s
Downloading cached aws-crt-cpp from https://cache.nix-ci.com
78.60 s
Downloaded cached aws-crt-cpp (979 KiB) in 26ms
78.60 s
Progress: 0 of 1 built, 32 of 45 downloaded from cache (1 downloading)
78.86 s
Downloaded cached icu4c (39.5 MiB) in 472ms
78.86 s
Progress: 0 of 1 built, 33 of 45 downloaded from cache
78.86 s
Downloading cached boost from https://cache.nix-ci.com
78.86 s
Downloaded cached boost in 0ms
78.86 s
Progress: 0 of 1 built, 34 of 45 downloaded from cache
78.86 s
Downloading cached nix-util from https://cache.nix-ci.com
78.86 s
Downloaded cached nix-util in 0ms
78.86 s
Progress: 0 of 1 built, 35 of 45 downloaded from cache
78.86 s
Downloading cached nix-nswrapper from https://cache.nix-ci.com
78.86 s
Downloaded cached nix-nswrapper in 0ms
78.86 s
Progress: 0 of 1 built, 36 of 45 downloaded from cache (1 downloading)
78.86 s
Downloading cached nix-store from https://cache.nix-ci.com
78.86 s
Downloaded cached nix-store in 0ms
78.86 s
Progress: 0 of 1 built, 37 of 45 downloaded from cache
78.86 s
Downloading cached nix-fetchers from https://cache.nix-ci.com
78.86 s
Downloaded cached nix-fetchers in 0ms
78.86 s
Downloading cached nix-main from https://cache.nix-ci.com
78.86 s
Downloaded cached nix-main in 0ms
78.86 s
Progress: 0 of 1 built, 38 of 45 downloaded from cache (1 downloading)
78.86 s
Progress: 0 of 1 built, 39 of 45 downloaded from cache
78.86 s
Downloading cached nix-expr from https://cache.nix-ci.com
78.89 s
Downloaded cached nix-expr (3.3 MiB) in 28ms
78.89 s
Progress: 0 of 1 built, 40 of 45 downloaded from cache
78.89 s
Downloading cached nix-flake from https://cache.nix-ci.com
78.89 s
Downloaded cached nix-flake in 0ms
78.89 s
Progress: 0 of 1 built, 41 of 45 downloaded from cache
78.89 s
Downloading cached nix-cmd from https://cache.nix-ci.com
78.92 s
Downloaded cached nix-cmd (1 MiB) in 29ms
78.92 s
Progress: 0 of 1 built, 42 of 45 downloaded from cache
78.92 s
Downloading cached nix from https://cache.nix-ci.com
78.98 s
Downloaded cached nix (3.9 MiB) in 63ms
78.98 s
Progress: 0 of 1 built, 43 of 45 downloaded from cache
78.99 s
Downloading cached nix from https://cache.nix-ci.com
78.99 s
Downloaded cached nix in 0ms
78.99 s
Progress: 0 of 1 built, 44 of 45 downloaded from cache
78.99 s
Downloading cached nix-ci-check-gammaloop-nextest-spenso from https://cache.nix-ci.com
78.99 s
Downloaded cached nix-ci-check-gammaloop-nextest-spenso (1128 B) in 8ms
78.99 s
Progress: 0 of 1 built, 45 of 45 downloaded from cache
79.19 s
evaluating derivation 'gdo you want to allow configuration setting 'extra-substituters' to be set to 'https://cache.nix-ci.com ' (y/N)? do you want to permanently mark this value as untrusted (y/N)? warning: ignoring untrusted flake configuration setting 'extra-substituters'.
79.19 s
Pass '--accept-flake-config' to trust it
79.19 s
do you want to allow configuration setting 'extra-trusted-public-keys' to be set to 'nix-ci:g3xV5BDTLtIBZr/A00IU1x0EtKKlb7YLgBN2SgYgM6A= ' (y/N)? do you want to permanently mark this value as untrusted (y/N)? warning: ignoring untrusted flake configuration setting 'extra-trusted-public-keys'.
79.19 s
Pass '--accept-flake-config' to trust it
96.98 s
copying '/nix/store/vrm9
evaluating derivation 'g
copying '/nix/store/vrm9
evaluating derivation 'g
copying '/nix/store/vrm9
evaluating derivation 'g
copying '/nix/store/vrm9
evaluating derivation 'g
copying '/nix/store/vrm9
evaluating derivation 'g
copying '/nix/store/vrm9
evaluating derivation 'g
copying '/nix/store/vrm9
evaluating derivation 'g
copying '/nix/store/vrm9
evaluating derivation 'g
copying '/nix/store/vrm9
evaluating derivation 'g
copying '/nix/store/vrm9
evaluating derivation 'g
copying '/nix/store/vrm9
evaluating derivation 'g
copying '/nix/store/vrm9
evaluating derivation 'g
copying '/nix/store/vrm9
evaluating derivation 'g
copying '/nix/store/vrm9
evaluating derivation 'g
copying '/nix/store/vrm9
evaluating derivation 'g
copying '/nix/store/vrm9
evaluating derivation 'g
copying '/nix/store/vrm9
evaluating derivation 'g
copying '/nix/store/vrm9
evaluating derivation 'g
copying '/nix/store/vrm9
evaluating derivation 'g
copying '/nix/store/vrm9
evaluating derivation 'g
copying '/nix/store/vrm9
evaluating derivation 'g
copying '/nix/store/vrm9
evaluating derivation 'g
copying '/nix/store/vrm9
evaluating derivation 'g
copying '/nix/store/vrm9
evaluating derivation 'g
copying '/nix/store/vrm9
evaluating derivation 'g
copying '/nix/store/vrm9
evaluating derivation 'g
copying '/nix/store/vrm9
evaluating derivation 'g
copying '/nix/store/vrm9
evaluating derivation 'g
copying '/nix/store/vrm9
evaluating derivation 'g
copying '/nix/store/vrm9
evaluating derivation 'g
copying '/nix/store/vrm9
evaluating derivation 'g
copying '/nix/store/vrm9
evaluating derivation 'g
copying '/nix/store/vrm9
evaluating derivation 'g
copying '/nix/store/vrm9
evaluating derivation 'g
copying '/nix/store/vrm9
evaluating derivation 'g
copying '/nix/store/vrm9
evaluating derivation 'g
copying '/nix/store/vrm9
evaluating derivation 'g
copying '/nix/store/vrm9
evaluating derivation 'g
copying '/nix/store/vrm9
evaluating derivation 'g
copying '/nix/store/vrm9
evaluating derivation 'g
copying '/nix/store/vrm9
evaluating derivation 'g
copying '/nix/store/vrm9
evaluating derivation 'g
copying '/nix/store/vrm9
evaluating derivation 'g
copying '/nix/store/vrm9
evaluating derivation 'g
copying '/nix/store/vrm9
evaluating derivation 'g
copying '/nix/store/vrm9
evaluating derivation 'g
copying '/nix/store/vrm9
evaluating derivation 'g
copying '/nix/store/vrm9
evaluating derivation 'g
copying '/nix/store/vrm9
evaluating derivation 'g
copying '/nix/store/vrm9
evaluating derivation 'g
copying '/nix/store/vrm9
evaluating derivation 'g
copying '/nix/store/vrm9
evaluating derivation 'g
copying '/nix/store/vrm9
evaluating derivation 'g
copying '/nix/store/vrm9
evaluating derivation 'g
copying '/nix/store/vrm9
evaluating derivation 'g
copying '/nix/store/vrm9
evaluating derivation 'g
copying '/nix/store/vrm9
evaluating derivation 'g
copying '/nix/store/vrm9
evaluating derivation 'g
copying '/nix/store/vrm9
evaluating derivation 'g
copying '/nix/store/vrm9
evaluating derivation 'g
copying '/nix/store/vrm9
evaluating derivation 'g
querying gammaloop-nexte
[44.9 KiB DL] querying i
[0 /31 built, 16 /0 /72 cop
[0 /29 built, 15 /11 /72 co
[0 /28 built, 16 /17 /72 co
[0 /26 built, 16 /21 /72 co
[0 /26 built, 16 /24 /72 co
[0 /26 built, 16 /27 /72 co
[0 /25 built, 16 /34 /72 co
[0 /23 built, 16 /42 /72 co
[0 /22 built, 16 /45 /72 co
[0 /22 built, 16 /47 /72 co
[0 /21 built, 14 /50 /72 co
[0 /20 built, 11 /54 /72 co
[0 /20 built, 11 /56 /72 co
[0 /19 built, 10 /57 /72 co
[0 /18 built, 9 /59 /72 cop
[0 /18 built, 9 /60 /72 cop
[0 /17 built, 8 /61 /72 cop
[0 /16 built, 7 /62 /72 cop
[0 /15 built, 7 /63 /72 cop
[0 /14 built, 6 /65 /72 cop
[0 /13 built, 5 /66 /72 cop
[0 /12 built, 4 /67 /72 cop
[0 /11 built, 3 /68 /72 cop
[1 /0 /11 built, 3 /68 /72 cgammaloop-nextest-binaries-spenso (post)> Uploading to the NixCI cache: /nix/store/ckvj671654g7r16vlk4cfzs3cnm9hcfm-gammaloop-nextest-binaries-spenso
97.04 s
gammaloop-nextest-binaries-spenso (post)> warning: 'warn-short-path-literals' is deprecated, use 'lint-short-path-literals = ignore' instead
97.08 s
gammaloop-nextest-binaries-spenso (post)> copying 0 paths...
97.17 s
gammaloop-nextest-binaries-spenso (post)> warning: 'warn-short-path-literals' is deprecated, use 'lint-short-path-literals = ignore' instead
98.64 s
gammaloop-nextest-binaries-spenso (post)> copying 48 paths...
98.64 s
gammaloop-nextest-binaries-spenso (post)> copying path '/nix/store/i5am5490ildjgdlgbc0as1cv0jbpl6gp-gammaloop-ci-test-binary-dependencies-b73bbbe004039ce9-Cargo.toml.drv' to 'https://cache.nix-ci.com'...
98.64 s
gammaloop-nextest-binaries-spenso (post)> copying path '/nix/store/5m9dgivv0h6291skxg97wazbl33lla7z-source' to 'https://cache.nix-ci.com'...
98.64 s
gammaloop-nextest-binaries-spenso (post)> copying path '/nix/store/hhqazbc4xg9hbqpxv2n2m4k7vnvpnjgv-source' to 'https://cache.nix-ci.com'...
98.64 s
gammaloop-nextest-binaries-spenso (post)> copying path '/nix/store/cw87m0yipp0dzwk5mcrxs0hjjdg7zgp7-source' to 'https://cache.nix-ci.com'...
98.64 s
gammaloop-nextest-binaries-spenso (post)> copying path '/nix/store/7hiylg76862rj6rfjgfp27d619hi08jg-source' to 'https://cache.nix-ci.com'...
98.64 s
gammaloop-nextest-binaries-spenso (post)> copying path '/nix/store/a39nb9m2iv73dfwyiaz68aswyf4b6p2b-source' to 'https://cache.nix-ci.com'...
98.64 s
gammaloop-nextest-binaries-spenso (post)> copying path '/nix/store/8w9aa8q5z7vq362z5455gs7j1q735kx3-source' to 'https://cache.nix-ci.com'...
98.64 s
gammaloop-nextest-binaries-spenso (post)> copying path '/nix/store/1519nx1sa7ygy9jnps90z7441pn3iala-source' to 'https://cache.nix-ci.com'...
98.64 s
gammaloop-nextest-binaries-spenso (post)> copying path '/nix/store/8vcdx3rx1jlm68ankg5mca8chz3cm9ai-source' to 'https://cache.nix-ci.com'...
98.64 s
gammaloop-nextest-binaries-spenso (post)> copying path '/nix/store/ji8il66z2civr536wmy8ncp9h49nnizi-source' to 'https://cache.nix-ci.com'...
98.64 s
gammaloop-nextest-binaries-spenso (post)> copying path '/nix/store/i4fj06rmis12p5nvwkhw04rlnlsnx5w1-source' to 'https://cache.nix-ci.com'...
98.64 s
gammaloop-nextest-binaries-spenso (post)> copying path '/nix/store/fkhjf9mrb5r6gxzfaxd12z0yinml7aan-source' to 'https://cache.nix-ci.com'...
98.65 s
gammaloop-nextest-binaries-spenso (post)> copying path '/nix/store/1fj96v7gvkzjgir3nnkssdi9drsjzlhh-gammaloop-ci-test-binary-dependencies-b73bbbe004039ce9-spynso3-dev-dependency.toml.drv' to 'https://cache.nix-ci.com'...
98.65 s
gammaloop-nextest-binaries-spenso (post)> copying path '/nix/store/26ypm15p7vpsmrrgfhdbb6css3k2gnsy-gammaloop-ci-test-binary-dependencies-d7bb270d8f7fb682-spenso-dev-dependency.toml.drv' to 'https://cache.nix-ci.com'...
98.65 s
gammaloop-nextest-binaries-spenso (post)> copying path '/nix/store/gzcgkmgw6kn72bdmx5r71qpvrifgcly0-gammaloop-ci-consumer-spynso3-Cargo.toml.drv' to 'https://cache.nix-ci.com'...
98.65 s
gammaloop-nextest-binaries-spenso (post)> copying path '/nix/store/1vbasqxpwg375vzvwhb9sdhsq160j3js-data.json' to 'https://cache.nix-ci.com'...
98.82 s
gammaloop-nextest-binaries-spenso (post)> copying path '/nix/store/jpqys7yl329pscprv0whmbnm69dv4rn7-gammaloop-ci-test-dependencies-b73bbbe004039ce9-Cargo.toml.drv' to 'https://cache.nix-ci.com'...
98.85 s
gammaloop-nextest-binaries-spenso (post)> copying path '/nix/store/ki2ld2rhc4i6k6yp4pk2gnbp9qdafs71-gammaloop-ci-consumer-spynso3-Cargo.toml.drv' to 'https://cache.nix-ci.com'...
98.85 s
gammaloop-nextest-binaries-spenso (post)> copying path '/nix/store/mbinbah1lx1b321gn5lind9g3xcvpdzd-typst' to 'https://cache.nix-ci.com'...
98.85 s
gammaloop-nextest-binaries-spenso (post)> copying path '/nix/store/mk1w396xaamp5gjv9rvzg7g8n7adzmcf-gammaloop-crate-spynso3-dependency-deps-inputs.drv' to 'https://cache.nix-ci.com'...
98.87 s
gammaloop-nextest-binaries-spenso (post)> copying path '/nix/store/mqsilkryh3ns81ax79phz701mzbym5r6-source' to 'https://cache.nix-ci.com'...
98.97 s
gammaloop-nextest-binaries-spenso (post)> copying path '/nix/store/n7c3jy7x4lqz8vmfbn1ws91b8dwhz7sc-gammaloop-ci-test-binary-dependencies-d2286bec20271558-spenso-hep-lib-dev-dependency.toml.drv' to 'https://cache.nix-ci.com'...
99.01 s
gammaloop-nextest-binaries-spenso (post)> copying path '/nix/store/n8vb03n4zybwp2dymhdkk1pvcn23jraq-source' to 'https://cache.nix-ci.com'...
99.01 s
gammaloop-nextest-binaries-spenso (post)> copying path '/nix/store/pkrka42001p5gyhn4kbwz4jypn6pi0p5-gammaloop-ci-test-binary-dependencies-4de73cca58696627-symbolica-data-dev-dependency.toml.drv' to 'https://cache.nix-ci.com'...
99.13 s
gammaloop-nextest-binaries-spenso (post)> copying path '/nix/store/qa831b1mjlq2x2nwpsc3iiai1pm81c3m-gammaloop-crate-test-binaries-symbolica-utils-c3179818d3c1e5a4-deps-0.1.0.drv' to 'https://cache.nix-ci.com'...
99.17 s
gammaloop-nextest-binaries-spenso (post)> copying path '/nix/store/xn0mpijyw5hi34q2qa315ilamk4g6wyz-source' to 'https://cache.nix-ci.com'...
99.26 s
gammaloop-nextest-binaries-spenso (post)> copying path '/nix/store/y3nmjs5dwk54njlsxc1z8y641ya8ij8i-gammaloop-ci-test-binary-dependencies-890cc3c9db09bd21-idenso-dev-dependency.toml.drv' to 'https://cache.nix-ci.com'...
99.29 s
gammaloop-nextest-binaries-spenso (post)> copying path '/nix/store/ifcjgx9x0a90jkc908nm4n24480p3v0d-source.drv' to 'https://cache.nix-ci.com'...
99.43 s
gammaloop-nextest-binaries-spenso (post)> copying path '/nix/store/p64a5kd59q7dj0aziip1b5aq1izs2464-gammaloop-crate-test-binaries-symbolica-data-4de73cca58696627-deps-0.1.0.drv' to 'https://cache.nix-ci.com'...
99.45 s
gammaloop-nextest-binaries-spenso (post)> copying path '/nix/store/fdknk6hlwhg7v8n2jwd5j2zxvygbknwr-gammaloop-crate-spynso3-dependency-deps-deps-0.1.0.drv' to 'https://cache.nix-ci.com'...
99.62 s
gammaloop-nextest-binaries-spenso (post)> copying path '/nix/store/yrvkwmjdh9n7rv738kl4g4wn1km6biyz-gammaloop-crate-spynso3-dependency-inputs.drv' to 'https://cache.nix-ci.com'...
100.48 s
gammaloop-nextest-binaries-spenso (post)> copying path '/nix/store/q6glk25q2qiq1h27jblmgj8jfh5g6iwl-gammaloop-crate-test-binaries-spenso-macros-47470ef98b5d7a99-deps-0.1.0.drv' to 'https://cache.nix-ci.com'...
100.55 s
gammaloop-nextest-binaries-spenso (post)> copying path '/nix/store/x56p2vg80rqpr0b4jnqddk96kr9fsx81-gammaloop-nextest-binaries-spenso-symbolica-data-0.1.0.drv' to 'https://cache.nix-ci.com'...
100.60 s
gammaloop-nextest-binaries-spenso (post)> copying path '/nix/store/69vidsk88my899b0ggvr7z4wwam6bggd-gammaloop-nextest-binaries-spenso-symbolica-utils-0.1.0.drv' to 'https://cache.nix-ci.com'...
100.82 s
gammaloop-nextest-binaries-spenso (post)> copying path '/nix/store/fp2xvg9aqph3rqhqn3lj5y0dj4yz3jhq-gammaloop-nextest-binaries-spenso-spenso-macros-0.1.0.drv' to 'https://cache.nix-ci.com'...
100.99 s
gammaloop-nextest-binaries-spenso (post)> copying path '/nix/store/5bv5y989289d2nhhq6xyia2bnbrf72v4-source.drv' to 'https://cache.nix-ci.com'...
101.15 s
gammaloop-nextest-binaries-spenso (post)> copying path '/nix/store/h21ma6m25c4jj06n9j8nxv6x6ivjdf0m-gammaloop-crate-spynso3-dependency-deps-0.1.0.drv' to 'https://cache.nix-ci.com'...
101.30 s
gammaloop-nextest-binaries-spenso (post)> copying path '/nix/store/iv33bayhjvgb05r8kfhmfdi8dksxlx9r-gammaloop-crate-test-dependencies-b73bbbe004039ce9-inputs.drv' to 'https://cache.nix-ci.com'...
102.15 s
gammaloop-nextest-binaries-spenso (post)> copying path '/nix/store/qf5hihz49v3d48ddlz0z3x3zdjiz9vfw-gammaloop-crate-test-binaries-spenso-d7bb270d8f7fb682-deps-0.1.0.drv' to 'https://cache.nix-ci.com'...
102.30 s
gammaloop-nextest-binaries-spenso (post)> copying path '/nix/store/c37nrzdcxdpx9z249z8flgx154x4xnkq-gammaloop-nextest-binaries-spenso-spenso-0.1.0.drv' to 'https://cache.nix-ci.com'...
103.05 s
gammaloop-nextest-binaries-spenso (post)> copying path '/nix/store/s8faxp3lm760hnxsl5h2xrvh106kpv60-gammaloop-crate-test-binaries-idenso-890cc3c9db09bd21-deps-0.1.0.drv' to 'https://cache.nix-ci.com'...
103.06 s
gammaloop-nextest-binaries-spenso (post)> copying path '/nix/store/0r3k780rvclkjkqm8q772kg8bwcjx8my-gammaloop-crate-test-binaries-spenso-hep-lib-d2286bec20271558-deps-0.1.0.drv' to 'https://cache.nix-ci.com'...
103.20 s
gammaloop-nextest-binaries-spenso (post)> copying path '/nix/store/0rc7n3h0y26c9xw3qml5xnzbgzg55jgj-gammaloop-nextest-binaries-spenso-spenso-hep-lib-0.1.0.drv' to 'https://cache.nix-ci.com'...
103.49 s
gammaloop-nextest-binaries-spenso (post)> copying path '/nix/store/kanafkszhcginwgmfvhb3g1w801ffw4i-gammaloop-nextest-binaries-spenso-idenso-0.1.0.drv' to 'https://cache.nix-ci.com'...
105.21 s
gammaloop-nextest-binaries-spenso (post)> copying path '/nix/store/23wi14b2bd8rmmx3dym0bnzilk5jllc8-gammaloop-crate-test-dependencies-b73bbbe004039ce9-deps-0.1.0.drv' to 'https://cache.nix-ci.com'...
105.51 s
gammaloop-nextest-binaries-spenso (post)> copying path '/nix/store/c3pa2an7bkk0hf0lcjlpcrc4mk0hihkz-gammaloop-crate-test-binaries-spynso3-b73bbbe004039ce9-deps-0.1.0.drv' to 'https://cache.nix-ci.com'...
105.65 s
gammaloop-nextest-binaries-spenso (post)> copying path '/nix/store/lkdmc43y48yyxpqi9a1wy8qxhi3zh54p-gammaloop-nextest-binaries-spenso-spynso3-0.1.0.drv' to 'https://cache.nix-ci.com'...
105.80 s
gammaloop-nextest-binaries-spenso (post)> copying path '/nix/store/0s15rfn78lh94y0r8jj17fljsq3qx8lc-gammaloop-nextest-binaries-spenso.drv' to 'https://cache.nix-ci.com'...
106.35 s
[1 /1 /6 built, 1 /71 /72 co
[2 /1 /5 built, 72 copied rust-stable-with-std (post)> Uploading to the NixCI cache: /nix/store/wg9kw4yhn1jn01mjs8cwx5mz69l1s64z-rust-stable-with-std-2026-09-03
106.39 s
rust-stable-with-std (post)> warning: 'warn-short-path-literals' is deprecated, use 'lint-short-path-literals = ignore' instead
106.42 s
rust-stable-with-std (post)> copying 0 paths...
106.47 s
rust-stable-with-std (post)> warning: 'warn-short-path-literals' is deprecated, use 'lint-short-path-literals = ignore' instead
106.52 s
rust-stable-with-std (post)> copying 0 paths...
106.69 s
[1 /2 /6 built, 72 copied clippy-stable-with-std (post)> Uploading to the NixCI cache: /nix/store/s9nslw8h7m9vh88zd2hilmjb298pfca4-clippy-stable-with-std-2026-09-03
106.74 s
clippy-stable-with-std (post)> warning: 'warn-short-path-literals' is deprecated, use 'lint-short-path-literals = ignore' instead
106.76 s
clippy-stable-with-std (post)> copying 0 paths...
106.81 s
clippy-stable-with-std (post)> warning: 'warn-short-path-literals' is deprecated, use 'lint-short-path-literals = ignore' instead
106.86 s
clippy-stable-with-std (post)> copying 0 paths...
106.94 s
[3 /6 built, 72 copied (1
[1 /3 /5 built, 72 copied rust-stable-with-components> /nix/store/wg9kw4yhn1jn01mjs8cwx5mz69l1s64z-rust-stable-with-std-2026-09-03/bin:
106.94 s
rust-stable-with-components> rust-lldb: Keeping existing link to /nix/store/s9nslw8h7m9vh88zd2hilmjb298pfca4-clippy-stable-with-std-2026-09-03/bin/rust-lldb
106.94 s
rust-stable-with-components> rust-gdb: Keeping existing link to /nix/store/s9nslw8h7m9vh88zd2hilmjb298pfca4-clippy-stable-with-std-2026-09-03/bin/rust-gdb
106.94 s
rust-stable-with-components> rust-gdbgui: Keeping existing link to /nix/store/s9nslw8h7m9vh88zd2hilmjb298pfca4-clippy-stable-with-std-2026-09-03/bin/rust-gdbgui
106.94 s
rust-stable-with-components> rustc: Keeping existing link to /nix/store/s9nslw8h7m9vh88zd2hilmjb298pfca4-clippy-stable-with-std-2026-09-03/bin/rustc
106.94 s
rust-stable-with-components> rustdoc: Keeping existing link to /nix/store/s9nslw8h7m9vh88zd2hilmjb298pfca4-clippy-stable-with-std-2026-09-03/bin/rustdoc
106.94 s
rust-stable-with-components> /nix/store/wg9kw4yhn1jn01mjs8cwx5mz69l1s64z-rust-stable-with-std-2026-09-03/lib:
106.94 s
rust-stable-with-components> librustc_driver-eaf3ed1d23ca5027.so: Keeping existing link to /nix/store/s9nslw8h7m9vh88zd2hilmjb298pfca4-clippy-stable-with-std-2026-09-03/lib/librustc_driver-eaf3ed1d23ca5027.so
107.42 s
rust-stable-with-components (post)> Uploading to the NixCI cache: /nix/store/c3bpv60f5wgp4pmgsifaykxk214h6463-rust-stable-with-components-2026-09-03
107.46 s
rust-stable-with-components (post)> warning: 'warn-short-path-literals' is deprecated, use 'lint-short-path-literals = ignore' instead
107.49 s
rust-stable-with-components (post)> copying 0 paths...
107.55 s
rust-stable-with-components (post)> warning: 'warn-short-path-literals' is deprecated, use 'lint-short-path-literals = ignore' instead
107.59 s
rust-stable-with-components (post)> copying 0 paths...
107.98 s
[4 /6 built, 72 copied (1
[1 /4 /5 built, 72 copied gammaloop-nextest-spenso> Nextest worker budget: 16
107.99 s
gammaloop-nextest-spenso> Extracting 6 binaries (including 1 non-test binary) and 2 linked paths to /build/source
108.31 s
gammaloop-nextest-spenso> Extracted 21 files to /build/source in 0.32s
108.33 s
gammaloop-nextest-spenso> ------------
108.33 s
gammaloop-nextest-spenso> Nextest run ID efdd37ab-a458-4754-9045-d948242c8dff with nextest profile: ci_gammaloop
108.33 s
gammaloop-nextest-spenso> Starting 1068 tests across 5 binaries (24 tests skipped , including 2 tests via profile.default.default-filter )
141.91 s
gammaloop-nextest-spenso> ------------
141.91 s
gammaloop-nextest-spenso> Summary [ 33.576s] 1068 tests run: 1068 passed , 24 skipped
141.95 s
gammaloop-nextest-spenso>
141.95 s
gammaloop-nextest-spenso> ========== nextest test summary ==========
141.95 s
gammaloop-nextest-spenso> report: target/nextest/ci_gammaloop/junit.xml
141.95 s
gammaloop-nextest-spenso> tests: 1068, failures: 0, errors: 0
141.95 s
gammaloop-nextest-spenso> No failing testcases found.
141.95 s
gammaloop-nextest-spenso> =========================================
141.96 s
gammaloop-nextest-spenso> Extracting 4 binaries (including 1 non-test binary) and 2 linked paths to /build/source
142.13 s
gammaloop-nextest-spenso> Extracted 19 files to /build/source in 0.16s
142.14 s
gammaloop-nextest-spenso> ------------
142.14 s
gammaloop-nextest-spenso> Nextest run ID dec14dd7-9706-4c48-a2a4-a0cf7236b1aa with nextest profile: ci_gammaloop
142.14 s
gammaloop-nextest-spenso> Starting 393 tests across 3 binaries
143.45 s
gammaloop-nextest-spenso> ------------
143.45 s
gammaloop-nextest-spenso> Summary [ 1.305s] 393 tests run: 393 passed , 0 skipped
143.49 s
gammaloop-nextest-spenso>
143.49 s
gammaloop-nextest-spenso> ========== nextest test summary ==========
143.49 s
gammaloop-nextest-spenso> report: target/nextest/ci_gammaloop/junit.xml
143.49 s
gammaloop-nextest-spenso> tests: 393, failures: 0, errors: 0
143.49 s
gammaloop-nextest-spenso> No failing testcases found.
143.49 s
gammaloop-nextest-spenso> =========================================
143.50 s
gammaloop-nextest-spenso> Extracting 11 binaries (including 1 non-test binary) and 2 linked paths to /build/source
144.14 s
gammaloop-nextest-spenso> Extracted 26 files to /build/source in 0.63s
144.16 s
gammaloop-nextest-spenso> ------------
144.16 s
gammaloop-nextest-spenso> Nextest run ID dd71adbd-7533-4411-91a5-1a97de15c925 with nextest profile: ci_gammaloop
144.16 s
gammaloop-nextest-spenso> Starting 134 tests across 10 binaries (2 tests skipped )
181.08 s
gammaloop-nextest-spenso> ------------
181.08 s
gammaloop-nextest-spenso> Summary [ 36.925s] 134 tests run: 134 passed , 2 skipped
181.11 s
gammaloop-nextest-spenso>
181.11 s
gammaloop-nextest-spenso> ========== nextest test summary ==========
181.11 s
gammaloop-nextest-spenso> report: target/nextest/ci_gammaloop/junit.xml
181.11 s
gammaloop-nextest-spenso> tests: 134, failures: 0, errors: 0
181.11 s
gammaloop-nextest-spenso> No failing testcases found.
181.11 s
gammaloop-nextest-spenso> =========================================
181.13 s
gammaloop-nextest-spenso> Extracting 2 binaries to /build/source
181.16 s
gammaloop-nextest-spenso> Extracted 5 files to /build/source in 0.04s
181.17 s
gammaloop-nextest-spenso> ------------
181.17 s
gammaloop-nextest-spenso> Nextest run ID 9c06c6a4-80d7-4cc7-a232-961dcc31a1c1 with nextest profile: ci_gammaloop
181.17 s
gammaloop-nextest-spenso> Starting 2 tests across 2 binaries
181.18 s
gammaloop-nextest-spenso> ------------
181.18 s
gammaloop-nextest-spenso> Summary [ 0.004s] 2 tests run: 2 passed , 0 skipped
181.21 s
gammaloop-nextest-spenso>
181.21 s
gammaloop-nextest-spenso> ========== nextest test summary ==========
181.21 s
gammaloop-nextest-spenso> report: target/nextest/ci_gammaloop/junit.xml
181.21 s
gammaloop-nextest-spenso> tests: 2, failures: 0, errors: 0
181.21 s
gammaloop-nextest-spenso> No failing testcases found.
181.21 s
gammaloop-nextest-spenso> =========================================
181.22 s
gammaloop-nextest-spenso> Extracting 7 binaries (including 3 non-test binaries), 1 build script output directory, and 3 linked paths to /build/source
182.07 s
gammaloop-nextest-spenso> Extracted 27 files to /build/source in 0.85s
182.09 s
gammaloop-nextest-spenso> ------------
182.09 s
gammaloop-nextest-spenso> Nextest run ID 490a75ba-c7e8-4661-bb0d-d53727c0abbd with nextest profile: ci_gammaloop
182.09 s
gammaloop-nextest-spenso> Starting 146 tests across 4 binaries
182.28 s
gammaloop-nextest-spenso> FAIL [ 0.018s] (131/146) spynso3 tests :: tensor_indexing_stubs_document_logical_order
182.28 s
gammaloop-nextest-spenso> stdout ---
182.28 s
gammaloop-nextest-spenso>
182.28 s
gammaloop-nextest-spenso> running 1 test
182.28 s
gammaloop-nextest-spenso> test tests::tensor_indexing_stubs_document_logical_order ... FAILED
182.28 s
gammaloop-nextest-spenso>
182.28 s
gammaloop-nextest-spenso> failures:
182.28 s
gammaloop-nextest-spenso>
182.28 s
gammaloop-nextest-spenso> failures:
182.28 s
gammaloop-nextest-spenso> tests::tensor_indexing_stubs_document_logical_order
182.28 s
gammaloop-nextest-spenso>
182.28 s
gammaloop-nextest-spenso> test result: FAILED. 0 passed; 1 failed; 0 ignored; 0 measured; 134 filtered out; finished in 0.01s
182.28 s
gammaloop-nextest-spenso>
182.28 s
gammaloop-nextest-spenso> stderr ---
182.28 s
gammaloop-nextest-spenso>
182.28 s
gammaloop-nextest-spenso> thread 'tests::tensor_indexing_stubs_document_logical_order' (5867) panicked at crates/spynso3/src/lib.rs:2334:9:
182.28 s
gammaloop-nextest-spenso> assertion failed: getitem.iter().all(|method|
182.28 s
gammaloop-nextest-spenso> {
182.28 s
gammaloop-nextest-spenso> method.doc.contains("logical row-major") &&
182.28 s
gammaloop-nextest-spenso> method.doc.contains("canonical storage-axis order is not exposed")
182.28 s
gammaloop-nextest-spenso> })
182.28 s
gammaloop-nextest-spenso> stack backtrace:
182.28 s
gammaloop-nextest-spenso> 0: __rustc::rust_begin_unwind
182.28 s
gammaloop-nextest-spenso> 1: core::panicking::panic_fmt
182.28 s
gammaloop-nextest-spenso> 2: core::panicking::panic
182.28 s
gammaloop-nextest-spenso> 3: spynso3::tests::tensor_indexing_stubs_document_logical_order
182.28 s
gammaloop-nextest-spenso> 4: <spynso3::tests::tensor_indexing_stubs_document_logical_order::{closure#0} as core::ops::function::FnOnce<()>>::call_once
182.28 s
gammaloop-nextest-spenso> note: Some details are omitted, run with `RUST_BACKTRACE=full` for a verbose backtrace.
182.28 s
gammaloop-nextest-spenso>
182.33 s
gammaloop-nextest-spenso> ------------
182.33 s
gammaloop-nextest-spenso> Summary [ 0.240s] 146 tests run: 145 passed , 1 failed , 0 skipped
182.33 s
gammaloop-nextest-spenso> FAIL [ 0.018s] (131/146) spynso3 tests :: tensor_indexing_stubs_document_logical_order
182.33 s
gammaloop-nextest-spenso> stdout ---
182.33 s
gammaloop-nextest-spenso>
182.33 s
gammaloop-nextest-spenso> running 1 test
182.33 s
gammaloop-nextest-spenso> test tests::tensor_indexing_stubs_document_logical_order ... FAILED
182.33 s
gammaloop-nextest-spenso>
182.33 s
gammaloop-nextest-spenso> failures:
182.33 s
gammaloop-nextest-spenso>
182.33 s
gammaloop-nextest-spenso> failures:
182.33 s
gammaloop-nextest-spenso> tests::tensor_indexing_stubs_document_logical_order
182.33 s
gammaloop-nextest-spenso>
182.33 s
gammaloop-nextest-spenso> test result: FAILED. 0 passed; 1 failed; 0 ignored; 0 measured; 134 filtered out; finished in 0.01s
182.33 s
gammaloop-nextest-spenso>
182.33 s
gammaloop-nextest-spenso> stderr ---
182.33 s
gammaloop-nextest-spenso>
182.33 s
gammaloop-nextest-spenso> thread 'tests::tensor_indexing_stubs_document_logical_order' (5867) panicked at crates/spynso3/src/lib.rs:2334:9:
182.33 s
gammaloop-nextest-spenso> assertion failed: getitem.iter().all(|method|
182.33 s
gammaloop-nextest-spenso> {
182.33 s
gammaloop-nextest-spenso> method.doc.contains("logical row-major") &&
182.33 s
gammaloop-nextest-spenso> method.doc.contains("canonical storage-axis order is not exposed")
182.33 s
gammaloop-nextest-spenso> })
182.33 s
gammaloop-nextest-spenso> stack backtrace:
182.33 s
gammaloop-nextest-spenso> 0: __rustc::rust_begin_unwind
182.33 s
gammaloop-nextest-spenso> 1: core::panicking::panic_fmt
182.33 s
gammaloop-nextest-spenso> 2: core::panicking::panic
182.33 s
gammaloop-nextest-spenso> 3: spynso3::tests::tensor_indexing_stubs_document_logical_order
182.33 s
gammaloop-nextest-spenso> 4: <spynso3::tests::tensor_indexing_stubs_document_logical_order::{closure#0} as core::ops::function::FnOnce<()>>::call_once
182.33 s
gammaloop-nextest-spenso> note: Some details are omitted, run with `RUST_BACKTRACE=full` for a verbose backtrace.
182.33 s
gammaloop-nextest-spenso>
182.33 s
gammaloop-nextest-spenso> error : test run failed
182.36 s
gammaloop-nextest-spenso>
182.36 s
gammaloop-nextest-spenso> ========== nextest test summary ==========
182.36 s
gammaloop-nextest-spenso> report: target/nextest/ci_gammaloop/junit.xml
182.36 s
gammaloop-nextest-spenso> tests: 146, failures: 1, errors: 0
182.36 s
gammaloop-nextest-spenso>
182.36 s
gammaloop-nextest-spenso> 1. spynso3::tests::tensor_indexing_stubs_document_logical_order
182.36 s
gammaloop-nextest-spenso> failure: test failure with exit code 101
182.36 s
gammaloop-nextest-spenso> thread 'tests::tensor_indexing_stubs_document_logical_order' (5867) panicked at crates/spynso3/src/lib.rs:2334:9:
182.36 s
gammaloop-nextest-spenso> assertion failed: getitem.iter().all(|method|
182.36 s
gammaloop-nextest-spenso> {
182.36 s
gammaloop-nextest-spenso> method.doc.contains("logical row-major") &&
182.36 s
gammaloop-nextest-spenso> method.doc.contains("canonical storage-axis order is not exposed")
182.36 s
gammaloop-nextest-spenso> })
182.36 s
gammaloop-nextest-spenso> stack backtrace:
182.36 s
gammaloop-nextest-spenso> 0: __rustc::rust_begin_unwind
182.36 s
gammaloop-nextest-spenso> 1: core::panicking::panic_fmt
182.36 s
gammaloop-nextest-spenso> 2: core::panicking::panic
182.36 s
gammaloop-nextest-spenso> 3: spynso3::tests::tensor_indexing_stubs_document_logical_order
182.36 s
gammaloop-nextest-spenso> 4: <spynso3::tests::tensor_indexing_stubs_document_logical_order::{closure#0} as core::ops::function::FnOnce<()>>::call_once
182.36 s
gammaloop-nextest-spenso> note: Some details are omitted, run with `RUST_BACKTRACE=full` for a verbose backtrace.
182.36 s
gammaloop-nextest-spenso> system-out
182.36 s
gammaloop-nextest-spenso> running 1 test
182.36 s
gammaloop-nextest-spenso> test tests::tensor_indexing_stubs_document_logical_order ... FAILED
182.36 s
gammaloop-nextest-spenso>
182.36 s
gammaloop-nextest-spenso> failures:
182.36 s
gammaloop-nextest-spenso>
182.36 s
gammaloop-nextest-spenso> failures:
182.36 s
gammaloop-nextest-spenso> tests::tensor_indexing_stubs_document_logical_order
182.36 s
gammaloop-nextest-spenso>
182.36 s
gammaloop-nextest-spenso> test result: FAILED. 0 passed; 1 failed; 0 ignored; 0 measured; 134 filtered out; finished in 0.01s
182.36 s
gammaloop-nextest-spenso> system-err
182.36 s
gammaloop-nextest-spenso> thread 'tests::tensor_indexing_stubs_document_logical_order' (5867) panicked at crates/spynso3/src/lib.rs:2334:9:
182.36 s
gammaloop-nextest-spenso> assertion failed: getitem.iter().all(|method|
182.36 s
gammaloop-nextest-spenso> {
182.36 s
gammaloop-nextest-spenso> method.doc.contains("logical row-major") &&
182.36 s
gammaloop-nextest-spenso> method.doc.contains("canonical storage-axis order is not exposed")
182.36 s
gammaloop-nextest-spenso> })
182.36 s
gammaloop-nextest-spenso> stack backtrace:
182.36 s
gammaloop-nextest-spenso> 0: __rustc::rust_begin_unwind
182.36 s
gammaloop-nextest-spenso> 1: core::panicking::panic_fmt
182.36 s
gammaloop-nextest-spenso> 2: core::panicking::panic
182.36 s
gammaloop-nextest-spenso> 3: spynso3::tests::tensor_indexing_stubs_document_logical_order
182.36 s
gammaloop-nextest-spenso> 4: <spynso3::tests::tensor_indexing_stubs_document_logical_order::{closure#0} as core::ops::function::FnOnce<()>>::call_once
182.36 s
gammaloop-nextest-spenso> note: Some details are omitted, run with `RUST_BACKTRACE=full` for a verbose backtrace.
182.36 s
gammaloop-nextest-spenso> =========================================
182.38 s
gammaloop-nextest-spenso> Extracting 1 binary and 1 linked path to /build/source
182.46 s
gammaloop-nextest-spenso> Extracted 7 files to /build/source in 0.08s
182.47 s
gammaloop-nextest-spenso> ------------
182.47 s
gammaloop-nextest-spenso> Nextest run ID e2f1a4bb-4bb6-412b-8bf5-e0912a266434 with nextest profile: ci_gammaloop
182.47 s
gammaloop-nextest-spenso> Starting 4 tests across 1 binary
182.47 s
gammaloop-nextest-spenso> ------------
182.47 s
gammaloop-nextest-spenso> Summary [ 0.006s] 4 tests run: 4 passed , 0 skipped
182.50 s
gammaloop-nextest-spenso>
182.50 s
gammaloop-nextest-spenso> ========== nextest test summary ==========
182.50 s
gammaloop-nextest-spenso> report: target/nextest/ci_gammaloop/junit.xml
182.50 s
gammaloop-nextest-spenso> tests: 4, failures: 0, errors: 0
182.50 s
gammaloop-nextest-spenso> No failing testcases found.
182.50 s
gammaloop-nextest-spenso> =========================================
182.51 s
gammaloop-nextest-spenso> Extracting 1 binary to /build/source
182.55 s
gammaloop-nextest-spenso> Extracted 4 files to /build/source in 0.04s
182.56 s
gammaloop-nextest-spenso> ------------
182.56 s
gammaloop-nextest-spenso> Nextest run ID c87a4b4f-2529-4706-be07-4693691fbbe9 with nextest profile: ci_gammaloop
182.56 s
gammaloop-nextest-spenso> Starting 2 tests across 1 binary
182.56 s
gammaloop-nextest-spenso> ------------
182.56 s
gammaloop-nextest-spenso> Summary [ 0.004s] 2 tests run: 2 passed , 0 skipped
182.59 s
gammaloop-nextest-spenso>
182.59 s
gammaloop-nextest-spenso> ========== nextest test summary ==========
182.59 s
gammaloop-nextest-spenso> report: target/nextest/ci_gammaloop/junit.xml
182.59 s
gammaloop-nextest-spenso> tests: 2, failures: 0, errors: 0
182.59 s
gammaloop-nextest-spenso> No failing testcases found.
182.59 s
gammaloop-nextest-spenso> =========================================
182.83 s
error: Cannot build '/nix/store/zc1jmsz4gf36w3nhmcyr3l14f2xqrbm4-gammaloop-nextest-spenso.drv '.
182.83 s
Reason: builder failed with exit code 100 .
182.83 s
Output paths:
182.83 s
/nix/store/vpyzqis4243vddrs7f05fqsc90rf7nf5-gammaloop-nextest-spenso
182.83 s
Last 190 log lines:
182.83 s
> Nextest worker budget: 16
182.83 s
> Extracting 6 binaries (including 1 non-test binary) and 2 linked paths to /build/source
182.83 s
> Extracted 21 files to /build/source in 0.32s
182.83 s
> ------------
182.83 s
> Nextest run ID efdd37ab-a458-4754-9045-d948242c8dff with nextest profile: ci_gammaloop
182.83 s
> Starting 1068 tests across 5 binaries (24 tests skipped , including 2 tests via profile.default.default-filter )
182.83 s
> ------------
182.83 s
> Summary [ 33.576s] 1068 tests run: 1068 passed , 24 skipped
182.83 s
>
182.83 s
> ========== nextest test summary ==========
182.83 s
> report: target/nextest/ci_gammaloop/junit.xml
182.83 s
> tests: 1068, failures: 0, errors: 0
182.83 s
> No failing testcases found.
182.83 s
> =========================================
182.83 s
> Extracting 4 binaries (including 1 non-test binary) and 2 linked paths to /build/source
182.83 s
> Extracted 19 files to /build/source in 0.16s
182.83 s
> ------------
182.83 s
> Nextest run ID dec14dd7-9706-4c48-a2a4-a0cf7236b1aa with nextest profile: ci_gammaloop
182.83 s
> Starting 393 tests across 3 binaries
182.83 s
> ------------
182.83 s
> Summary [ 1.305s] 393 tests run: 393 passed , 0 skipped
182.83 s
>
182.83 s
> ========== nextest test summary ==========
182.83 s
> report: target/nextest/ci_gammaloop/junit.xml
182.83 s
> tests: 393, failures: 0, errors: 0
182.83 s
> No failing testcases found.
182.83 s
> =========================================
182.83 s
> Extracting 11 binaries (including 1 non-test binary) and 2 linked paths to /build/source
182.83 s
> Extracted 26 files to /build/source in 0.63s
182.83 s
> ------------
182.83 s
> Nextest run ID dd71adbd-7533-4411-91a5-1a97de15c925 with nextest profile: ci_gammaloop
182.83 s
> Starting 134 tests across 10 binaries (2 tests skipped )
182.83 s
> ------------
182.83 s
> Summary [ 36.925s] 134 tests run: 134 passed , 2 skipped
182.83 s
>
182.83 s
> ========== nextest test summary ==========
182.83 s
> report: target/nextest/ci_gammaloop/junit.xml
182.83 s
> tests: 134, failures: 0, errors: 0
182.83 s
> No failing testcases found.
182.83 s
> =========================================
182.83 s
> Extracting 2 binaries to /build/source
182.83 s
> Extracted 5 files to /build/source in 0.04s
182.83 s
> ------------
182.83 s
> Nextest run ID 9c06c6a4-80d7-4cc7-a232-961dcc31a1c1 with nextest profile: ci_gammaloop
182.83 s
> Starting 2 tests across 2 binaries
182.83 s
> ------------
182.83 s
> Summary [ 0.004s] 2 tests run: 2 passed , 0 skipped
182.83 s
>
182.83 s
> ========== nextest test summary ==========
182.83 s
> report: target/nextest/ci_gammaloop/junit.xml
182.83 s
> tests: 2, failures: 0, errors: 0
182.83 s
> No failing testcases found.
182.83 s
> =========================================
182.83 s
> Extracting 7 binaries (including 3 non-test binaries), 1 build script output directory, and 3 linked paths to /build/source
182.83 s
> Extracted 27 files to /build/source in 0.85s
182.83 s
> ------------
182.83 s
> Nextest run ID 490a75ba-c7e8-4661-bb0d-d53727c0abbd with nextest profile: ci_gammaloop
182.83 s
> Starting 146 tests across 4 binaries
182.83 s
> FAIL [ 0.018s] (131/146) spynso3 tests :: tensor_indexing_stubs_document_logical_order
182.83 s
> stdout ---
182.83 s
>
182.83 s
> running 1 test
182.83 s
> test tests::tensor_indexing_stubs_document_logical_order ... FAILED
182.83 s
>
182.83 s
> failures:
182.83 s
>
182.83 s
> failures:
182.83 s
> tests::tensor_indexing_stubs_document_logical_order
182.83 s
>
182.83 s
> test result: FAILED. 0 passed; 1 failed; 0 ignored; 0 measured; 134 filtered out; finished in 0.01s
182.83 s
>
182.83 s
> stderr ---
182.83 s
>
182.83 s
> thread 'tests::tensor_indexing_stubs_document_logical_order' (5867) panicked at crates/spynso3/src/lib.rs:2334:9:
182.83 s
> assertion failed: getitem.iter().all(|method|
182.83 s
> {
182.83 s
> method.doc.contains("logical row-major") &&
182.83 s
> method.doc.contains("canonical storage-axis order is not exposed")
182.83 s
> })
182.83 s
> stack backtrace:
182.83 s
> 0: __rustc::rust_begin_unwind
182.83 s
> 1: core::panicking::panic_fmt
182.83 s
> 2: core::panicking::panic
182.83 s
> 3: spynso3::tests::tensor_indexing_stubs_document_logical_order
182.83 s
> 4: <spynso3::tests::tensor_indexing_stubs_document_logical_order::{closure#0} as core::ops::function::FnOnce<()>>::call_once
182.83 s
> note: Some details are omitted, run with `RUST_BACKTRACE=full` for a verbose backtrace.
182.83 s
>
182.83 s
> ------------
182.83 s
> Summary [ 0.240s] 146 tests run: 145 passed , 1 failed , 0 skipped
182.83 s
> FAIL [ 0.018s] (131/146) spynso3 tests :: tensor_indexing_stubs_document_logical_order
182.83 s
> stdout ---
182.83 s
>
182.83 s
> running 1 test
182.83 s
> test tests::tensor_indexing_stubs_document_logical_order ... FAILED
182.83 s
>
182.83 s
> failures:
182.83 s
>
182.83 s
> failures:
182.83 s
> tests::tensor_indexing_stubs_document_logical_order
182.83 s
>
182.83 s
> test result: FAILED. 0 passed; 1 failed; 0 ignored; 0 measured; 134 filtered out; finished in 0.01s
182.83 s
>
182.83 s
> stderr ---
182.83 s
>
182.83 s
> thread 'tests::tensor_indexing_stubs_document_logical_order' (5867) panicked at crates/spynso3/src/lib.rs:2334:9:
182.83 s
> assertion failed: getitem.iter().all(|method|
182.83 s
> {
182.83 s
> method.doc.contains("logical row-major") &&
182.83 s
> method.doc.contains("canonical storage-axis order is not exposed")
182.83 s
> })
182.83 s
> stack backtrace:
182.83 s
> 0: __rustc::rust_begin_unwind
182.83 s
> 1: core::panicking::panic_fmt
182.83 s
> 2: core::panicking::panic
182.83 s
> 3: spynso3::tests::tensor_indexing_stubs_document_logical_order
182.83 s
> 4: <spynso3::tests::tensor_indexing_stubs_document_logical_order::{closure#0} as core::ops::function::FnOnce<()>>::call_once
182.83 s
> note: Some details are omitted, run with `RUST_BACKTRACE=full` for a verbose backtrace.
182.83 s
>
182.83 s
> error : test run failed
182.83 s
>
182.83 s
> ========== nextest test summary ==========
182.83 s
> report: target/nextest/ci_gammaloop/junit.xml
182.83 s
> tests: 146, failures: 1, errors: 0
182.83 s
>
182.83 s
> 1. spynso3::tests::tensor_indexing_stubs_document_logical_order
182.83 s
> failure: test failure with exit code 101
182.83 s
> thread 'tests::tensor_indexing_stubs_document_logical_order' (5867) panicked at crates/spynso3/src/lib.rs:2334:9:
182.83 s
> assertion failed: getitem.iter().all(|method|
182.83 s
> {
182.83 s
> method.doc.contains("logical row-major") &&
182.83 s
> method.doc.contains("canonical storage-axis order is not exposed")
182.83 s
> })
182.83 s
> stack backtrace:
182.83 s
> 0: __rustc::rust_begin_unwind
182.83 s
> 1: core::panicking::panic_fmt
182.83 s
> 2: core::panicking::panic
182.83 s
> 3: spynso3::tests::tensor_indexing_stubs_document_logical_order
182.83 s
> 4: <spynso3::tests::tensor_indexing_stubs_document_logical_order::{closure#0} as core::ops::function::FnOnce<()>>::call_once
182.83 s
> note: Some details are omitted, run with `RUST_BACKTRACE=full` for a verbose backtrace.
182.83 s
> system-out
182.83 s
> running 1 test
182.83 s
> test tests::tensor_indexing_stubs_document_logical_order ... FAILED
182.83 s
>
182.83 s
> failures:
182.83 s
>
182.83 s
> failures:
182.83 s
> tests::tensor_indexing_stubs_document_logical_order
182.83 s
>
182.83 s
> test result: FAILED. 0 passed; 1 failed; 0 ignored; 0 measured; 134 filtered out; finished in 0.01s
182.83 s
> system-err
182.83 s
> thread 'tests::tensor_indexing_stubs_document_logical_order' (5867) panicked at crates/spynso3/src/lib.rs:2334:9:
182.83 s
> assertion failed: getitem.iter().all(|method|
182.83 s
> {
182.83 s
> method.doc.contains("logical row-major") &&
182.83 s
> method.doc.contains("canonical storage-axis order is not exposed")
182.83 s
> })
182.83 s
> stack backtrace:
182.83 s
> 0: __rustc::rust_begin_unwind
182.83 s
> 1: core::panicking::panic_fmt
182.83 s
> 2: core::panicking::panic
182.83 s
> 3: spynso3::tests::tensor_indexing_stubs_document_logical_order
182.83 s
> 4: <spynso3::tests::tensor_indexing_stubs_document_logical_order::{closure#0} as core::ops::function::FnOnce<()>>::call_once
182.83 s
> note: Some details are omitted, run with `RUST_BACKTRACE=full` for a verbose backtrace.
182.83 s
> =========================================
182.83 s
> Extracting 1 binary and 1 linked path to /build/source
182.83 s
> Extracted 7 files to /build/source in 0.08s
182.83 s
> ------------
182.83 s
> Nextest run ID e2f1a4bb-4bb6-412b-8bf5-e0912a266434 with nextest profile: ci_gammaloop
182.83 s
> Starting 4 tests across 1 binary
182.83 s
> ------------
182.83 s
> Summary [ 0.006s] 4 tests run: 4 passed , 0 skipped
182.83 s
>
182.83 s
> ========== nextest test summary ==========
182.83 s
> report: target/nextest/ci_gammaloop/junit.xml
182.83 s
> tests: 4, failures: 0, errors: 0
182.83 s
> No failing testcases found.
182.83 s
> =========================================
182.83 s
> Extracting 1 binary to /build/source
182.83 s
> Extracted 4 files to /build/source in 0.04s
182.83 s
> ------------
182.83 s
> Nextest run ID c87a4b4f-2529-4706-be07-4693691fbbe9 with nextest profile: ci_gammaloop
182.83 s
> Starting 2 tests across 1 binary
182.83 s
> ------------
182.83 s
> Summary [ 0.004s] 2 tests run: 2 passed , 0 skipped
182.83 s
>
182.83 s
> ========== nextest test summary ==========
182.83 s
> report: target/nextest/ci_gammaloop/junit.xml
182.83 s
> tests: 2, failures: 0, errors: 0
182.83 s
> No failing testcases found.
182.83 s
> =========================================
182.83 s
For full logs, run:
182.83 s
nix log /nix/store/zc1jmsz4gf36w3nhmcyr3l14f2xqrbm4-gammaloop-nextest-spenso.drv
183.05 s
[4 built (1 failed ), 72 Run failed.