test packages.x86_64-linux.nix-ci-check-gammaloop-nextest-clinnet

Reproduce this run
Original Run
  1. 33.13 s $ /nix/store/bhv6xyvqw6gjs3j488gi1z6wdv18bdpa-coreutils-9.11/bin/timeout --kill-after=15s 7200s /nix/store/b1wn5clix1mz4vpfih7x9cnj9qfh7c6h-git-2.54.0/bin/git -c advice.detachedHead=false checkout 8959f063dd3a21d9dfa4be72260815fa7c625bde
  2. 33.63 s HEAD is now at 8959f063d record indexed tensor qualification and remaining performance limits
  3. 33.65 s $ /nix/store/bhv6xyvqw6gjs3j488gi1z6wdv18bdpa-coreutils-9.11/bin/timeout --kill-after=15s 7200s /nix/store/bxgja2ppiqi6w2bgn0r07d7mgnl1k6k2-nix-2.34.8/bin/nix --extra-experimental-features nix-command --extra-experimental-features flakes --log-format internal-json run .#packages.x86_64-linux.nix-ci-check-gammaloop-nextest-clinnet --print-build-logs
  4. 34.26 s warning: ignoring untrusted flake configuration setting 'extra-substituters'.
  5. 34.26 s Pass '--accept-flake-config' to trust it
  6. 34.26 s warning: ignoring untrusted flake configuration setting 'extra-trusted-public-keys'.
  7. 34.26 s Pass '--accept-flake-config' to trust it
  8. 43.61 s
  9. 51.32 s evaluating derivation 'gdo you want to allow configuration setting 'extra-substituters' to be set to 'https://cache.nix-ci.com' (y/N)? do you want to permanently mark this value as untrusted (y/N)? warning: ignoring untrusted flake configuration setting 'extra-substituters'.
  10. 51.32 s Pass '--accept-flake-config' to trust it
  11. 51.32 s do you want to allow configuration setting 'extra-trusted-public-keys' to be set to 'nix-ci:g3xV5BDTLtIBZr/A00IU1x0EtKKlb7YLgBN2SgYgM6A=' (y/N)? do you want to permanently mark this value as untrusted (y/N)? warning: ignoring untrusted flake configuration setting 'extra-trusted-public-keys'.
  12. 51.32 s Pass '--accept-flake-config' to trust it
  13. 60.34 s copying '/nix/store/vrm9 evaluating derivation 'g copying '/nix/store/vrm9 evaluating derivation 'g copying '/nix/store/vrm9 evaluating derivation 'g copying '/nix/store/vrm9 evaluating derivation 'g copying '/nix/store/vrm9 evaluating derivation 'g copying '/nix/store/vrm9 evaluating derivation 'g
  14. 76.28 s [0/1 built] [1/0/1 built] building ggammaloop-nextest-clinnet> Nextest worker budget: 16
  15. 76.32 s gammaloop-nextest-clinnet> Extracting 4 binaries (including 1 non-test binary), 1 build script output directory, and 1 linked path to /build/source
  16. 76.42 s gammaloop-nextest-clinnet> Extracted 16 files to /build/source in 0.10s
  17. 76.48 s gammaloop-nextest-clinnet> ------------
  18. 76.48 s gammaloop-nextest-clinnet> Nextest run ID d43b21c7-030c-44d7-88ee-6150135e3f26 with nextest profile: ci_gammaloop
  19. 76.48 s gammaloop-nextest-clinnet> Starting 38 tests across 3 binaries
  20. 227.54 s gammaloop-nextest-clinnet> FAIL [ 150.774s] (32/38) clinnet::public_typst_behavior public_linnest_overlays_follow_the_unit
  21. 227.54 s gammaloop-nextest-clinnet> stdout ---
  22. 227.54 s gammaloop-nextest-clinnet>
  23. 227.54 s gammaloop-nextest-clinnet> running 1 test
  24. 227.54 s gammaloop-nextest-clinnet> test public_linnest_overlays_follow_the_unit has been running for over 60 seconds
  25. 227.54 s gammaloop-nextest-clinnet> test public_linnest_overlays_follow_the_unit ... FAILED
  26. 227.54 s gammaloop-nextest-clinnet>
  27. 227.54 s gammaloop-nextest-clinnet> failures:
  28. 227.54 s gammaloop-nextest-clinnet>
  29. 227.54 s gammaloop-nextest-clinnet> failures:
  30. 227.54 s gammaloop-nextest-clinnet> public_linnest_overlays_follow_the_unit
  31. 227.54 s gammaloop-nextest-clinnet>
  32. 227.54 s gammaloop-nextest-clinnet> test result: FAILED. 0 passed; 1 failed; 0 ignored; 0 measured; 17 filtered out; finished in 150.74s
  33. 227.54 s gammaloop-nextest-clinnet>
  34. 227.54 s gammaloop-nextest-clinnet> stderr ---
  35. 227.54 s gammaloop-nextest-clinnet>
  36. 227.54 s gammaloop-nextest-clinnet> thread 'public_linnest_overlays_follow_the_unit' (312) panicked at crates/clinnet/tests/public_typst_behavior.rs:81:55:
  37. 227.54 s gammaloop-nextest-clinnet> called `Result::unwrap()` on an `Err` value: typst failed while compiling template /build/.tmpHd9i0l/.clinnet/templates/linnest-public-behavior.svg
  38. 227.54 s gammaloop-nextest-clinnet>
  39. 227.54 s gammaloop-nextest-clinnet> Command executed:
  40. 227.54 s gammaloop-nextest-clinnet> "typst" "c" "/build/.tmpHd9i0l/.clinnet/templates/linnest-public-behavior.typ" "/build/.tmpHd9i0l/.clinnet/templates/linnest-public-behavior.svg" "--root" "/build/.tmpHd9i0l/.clinnet/templates"
  41. 227.54 s gammaloop-nextest-clinnet>
  42. 227.54 s gammaloop-nextest-clinnet> Typst stdout:
  43. 227.54 s gammaloop-nextest-clinnet>
  44. 227.54 s gammaloop-nextest-clinnet>
  45. 227.54 s gammaloop-nextest-clinnet> Typst stderr:
  46. 227.54 s gammaloop-nextest-clinnet>
  47. 227.54 s gammaloop-nextest-clinnet>
  48. 227.54 s gammaloop-nextest-clinnet> Location:
  49. 227.54 s gammaloop-nextest-clinnet> crates/clinnet/src/lib.rs:741:13
  50. 227.54 s gammaloop-nextest-clinnet> stack backtrace:
  51. 227.54 s gammaloop-nextest-clinnet> 0: __rustc::rust_begin_unwind
  52. 227.54 s gammaloop-nextest-clinnet> 1: core::panicking::panic_fmt
  53. 227.54 s gammaloop-nextest-clinnet> 2: core::result::unwrap_failed
  54. 227.54 s gammaloop-nextest-clinnet> 3: public_typst_behavior::render
  55. 227.54 s gammaloop-nextest-clinnet> 4: <std::sync::once::Once>::call_once_force::<<std::sync::once_lock::OnceLock<alloc::string::String>>::initialize<<std::sync::once_lock::OnceLock<alloc::string::String>>::get_or_init<public_typst_behavior::linnest_public_svg::{closure#0}>::{closure#0}, !>::{closure#0}>::{closure#0}
  56. 227.54 s gammaloop-nextest-clinnet> 5: <std::sys::sync::once::futex::Once>::call
  57. 227.54 s gammaloop-nextest-clinnet> 6: <std::sync::once_lock::OnceLock<alloc::string::String>>::initialize::<<std::sync::once_lock::OnceLock<alloc::string::String>>::get_or_init<public_typst_behavior::linnest_public_svg::{closure#0}>::{closure#0}, !>
  58. 227.54 s gammaloop-nextest-clinnet> 7: <public_typst_behavior::public_linnest_overlays_follow_the_unit::{closure#0} as core::ops::function::FnOnce<()>>::call_once
  59. 227.54 s gammaloop-nextest-clinnet> note: Some details are omitted, run with `RUST_BACKTRACE=full` for a verbose backtrace.
  60. 227.54 s gammaloop-nextest-clinnet>
  61. 250.65 s gammaloop-nextest-clinnet> FAIL [ 174.028s] (33/38) clinnet::public_typst_behavior public_linnest_momentum_layers_place_shafts_and_labels
  62. 250.65 s gammaloop-nextest-clinnet> stdout ---
  63. 250.65 s gammaloop-nextest-clinnet>
  64. 250.65 s gammaloop-nextest-clinnet> running 1 test
  65. 250.65 s gammaloop-nextest-clinnet> test public_linnest_momentum_layers_place_shafts_and_labels has been running for over 60 seconds
  66. 250.65 s gammaloop-nextest-clinnet> test public_linnest_momentum_layers_place_shafts_and_labels ... FAILED
  67. 250.65 s gammaloop-nextest-clinnet>
  68. 250.65 s gammaloop-nextest-clinnet> failures:
  69. 250.65 s gammaloop-nextest-clinnet>
  70. 250.65 s gammaloop-nextest-clinnet> failures:
  71. 250.65 s gammaloop-nextest-clinnet> public_linnest_momentum_layers_place_shafts_and_labels
  72. 250.65 s gammaloop-nextest-clinnet>
  73. 250.65 s gammaloop-nextest-clinnet> test result: FAILED. 0 passed; 1 failed; 0 ignored; 0 measured; 17 filtered out; finished in 174.00s
  74. 250.65 s gammaloop-nextest-clinnet>
  75. 250.65 s gammaloop-nextest-clinnet> stderr ---
  76. 250.65 s gammaloop-nextest-clinnet>
  77. 250.65 s gammaloop-nextest-clinnet> thread 'public_linnest_momentum_layers_place_shafts_and_labels' (309) panicked at crates/clinnet/tests/public_typst_behavior.rs:81:55:
  78. 250.65 s gammaloop-nextest-clinnet> called `Result::unwrap()` on an `Err` value: typst failed while compiling template /build/.tmppG4UAR/.clinnet/templates/linnest-public-behavior.svg
  79. 250.65 s gammaloop-nextest-clinnet>
  80. 250.65 s gammaloop-nextest-clinnet> Command executed:
  81. 250.65 s gammaloop-nextest-clinnet> "typst" "c" "/build/.tmppG4UAR/.clinnet/templates/linnest-public-behavior.typ" "/build/.tmppG4UAR/.clinnet/templates/linnest-public-behavior.svg" "--root" "/build/.tmppG4UAR/.clinnet/templates"
  82. 250.65 s gammaloop-nextest-clinnet>
  83. 250.65 s gammaloop-nextest-clinnet> Typst stdout:
  84. 250.65 s gammaloop-nextest-clinnet>
  85. 250.65 s gammaloop-nextest-clinnet>
  86. 250.65 s gammaloop-nextest-clinnet> Typst stderr:
  87. 250.65 s gammaloop-nextest-clinnet>
  88. 250.65 s gammaloop-nextest-clinnet>
  89. 250.65 s gammaloop-nextest-clinnet> Location:
  90. 250.65 s gammaloop-nextest-clinnet> crates/clinnet/src/lib.rs:741:13
  91. 250.65 s gammaloop-nextest-clinnet> stack backtrace:
  92. 250.65 s gammaloop-nextest-clinnet> 0: __rustc::rust_begin_unwind
  93. 250.65 s gammaloop-nextest-clinnet> 1: core::panicking::panic_fmt
  94. 250.65 s gammaloop-nextest-clinnet> 2: core::result::unwrap_failed
  95. 250.65 s gammaloop-nextest-clinnet> 3: public_typst_behavior::render
  96. 250.65 s gammaloop-nextest-clinnet> 4: <std::sync::once::Once>::call_once_force::<<std::sync::once_lock::OnceLock<alloc::string::String>>::initialize<<std::sync::once_lock::OnceLock<alloc::string::String>>::get_or_init<public_typst_behavior::linnest_public_svg::{closure#0}>::{closure#0}, !>::{closure#0}>::{closure#0}
  97. 250.65 s gammaloop-nextest-clinnet> 5: <std::sys::sync::once::futex::Once>::call
  98. 250.65 s gammaloop-nextest-clinnet> 6: <std::sync::once_lock::OnceLock<alloc::string::String>>::initialize::<<std::sync::once_lock::OnceLock<alloc::string::String>>::get_or_init<public_typst_behavior::linnest_public_svg::{closure#0}>::{closure#0}, !>
  99. 250.65 s gammaloop-nextest-clinnet> 7: <public_typst_behavior::public_linnest_momentum_layers_place_shafts_and_labels::{closure#0} as core::ops::function::FnOnce<()>>::call_once
  100. 250.65 s gammaloop-nextest-clinnet> note: Some details are omitted, run with `RUST_BACKTRACE=full` for a verbose backtrace.
  101. 250.65 s gammaloop-nextest-clinnet>
  102. 258.88 s gammaloop-nextest-clinnet> FAIL [ 182.223s] (34/38) clinnet::public_typst_behavior public_linnest_endpoint_anchor_distances_stay_local
  103. 258.88 s gammaloop-nextest-clinnet> stdout ---
  104. 258.88 s gammaloop-nextest-clinnet>
  105. 258.88 s gammaloop-nextest-clinnet> running 1 test
  106. 258.88 s gammaloop-nextest-clinnet> test public_linnest_endpoint_anchor_distances_stay_local has been running for over 60 seconds
  107. 258.88 s gammaloop-nextest-clinnet> test public_linnest_endpoint_anchor_distances_stay_local ... FAILED
  108. 258.88 s gammaloop-nextest-clinnet>
  109. 258.88 s gammaloop-nextest-clinnet> failures:
  110. 258.88 s gammaloop-nextest-clinnet>
  111. 258.88 s gammaloop-nextest-clinnet> failures:
  112. 258.88 s gammaloop-nextest-clinnet> public_linnest_endpoint_anchor_distances_stay_local
  113. 258.88 s gammaloop-nextest-clinnet>
  114. 258.88 s gammaloop-nextest-clinnet> test result: FAILED. 0 passed; 1 failed; 0 ignored; 0 measured; 17 filtered out; finished in 182.20s
  115. 258.88 s gammaloop-nextest-clinnet>
  116. 258.88 s gammaloop-nextest-clinnet> stderr ---
  117. 258.88 s gammaloop-nextest-clinnet>
  118. 258.88 s gammaloop-nextest-clinnet> thread 'public_linnest_endpoint_anchor_distances_stay_local' (274) panicked at crates/clinnet/tests/public_typst_behavior.rs:81:55:
  119. 258.88 s gammaloop-nextest-clinnet> called `Result::unwrap()` on an `Err` value: typst failed while compiling template /build/.tmpP7SwkF/.clinnet/templates/linnest-public-behavior.svg
  120. 258.88 s gammaloop-nextest-clinnet>
  121. 258.88 s gammaloop-nextest-clinnet> Command executed:
  122. 258.88 s gammaloop-nextest-clinnet> "typst" "c" "/build/.tmpP7SwkF/.clinnet/templates/linnest-public-behavior.typ" "/build/.tmpP7SwkF/.clinnet/templates/linnest-public-behavior.svg" "--root" "/build/.tmpP7SwkF/.clinnet/templates"
  123. 258.88 s gammaloop-nextest-clinnet>
  124. 258.88 s gammaloop-nextest-clinnet> Typst stdout:
  125. 258.88 s gammaloop-nextest-clinnet>
  126. 258.88 s gammaloop-nextest-clinnet>
  127. 258.88 s gammaloop-nextest-clinnet> Typst stderr:
  128. 258.88 s gammaloop-nextest-clinnet>
  129. 258.88 s gammaloop-nextest-clinnet>
  130. 258.88 s gammaloop-nextest-clinnet> Location:
  131. 258.88 s gammaloop-nextest-clinnet> crates/clinnet/src/lib.rs:741:13
  132. 258.88 s gammaloop-nextest-clinnet> stack backtrace:
  133. 258.88 s gammaloop-nextest-clinnet> 0: __rustc::rust_begin_unwind
  134. 258.88 s gammaloop-nextest-clinnet> 1: core::panicking::panic_fmt
  135. 258.88 s gammaloop-nextest-clinnet> 2: core::result::unwrap_failed
  136. 258.88 s gammaloop-nextest-clinnet> 3: public_typst_behavior::render
  137. 258.88 s gammaloop-nextest-clinnet> 4: <std::sync::once::Once>::call_once_force::<<std::sync::once_lock::OnceLock<alloc::string::String>>::initialize<<std::sync::once_lock::OnceLock<alloc::string::String>>::get_or_init<public_typst_behavior::linnest_public_svg::{closure#0}>::{closure#0}, !>::{closure#0}>::{closure#0}
  138. 258.88 s gammaloop-nextest-clinnet> 5: <std::sys::sync::once::futex::Once>::call
  139. 258.88 s gammaloop-nextest-clinnet> 6: <std::sync::once_lock::OnceLock<alloc::string::String>>::initialize::<<std::sync::once_lock::OnceLock<alloc::string::String>>::get_or_init<public_typst_behavior::linnest_public_svg::{closure#0}>::{closure#0}, !>
  140. 258.88 s gammaloop-nextest-clinnet> 7: <public_typst_behavior::public_linnest_endpoint_anchor_distances_stay_local::{closure#0} as core::ops::function::FnOnce<()>>::call_once
  141. 258.88 s gammaloop-nextest-clinnet> note: Some details are omitted, run with `RUST_BACKTRACE=full` for a verbose backtrace.