1. 0.00 s $ /nix/store/61685rbaxmpigwi3z23i33sv3jyfl70q-coreutils-9.11/bin/timeout --kill-after=15s 7200s /nix/store/wknkybkzrc16r11vk5vrykh4wmw7a353-nix-2.34.8/bin/nix --extra-experimental-features nix-command --extra-experimental-features flakes flake clone git+https://github.com/alphal00p/gammaloop --dest /tmp/nix-ci-worker/stable-pwd/repo/
  2. 0.07 s Cloning into '/tmp/nix-ci-worker/stable-pwd/repo'...
  3. 0.77 s remote: Enumerating objects: 103100, done.
  4. 0.88 s remote: Counting objects: 0% (1/9584) remote: Counting objects: 1% (96/9584) remote: Counting objects: 2% (192/9584) remote: Counting objects: 3% (288/9584) remote: Counting objects: 4% (384/9584) remote: Counting objects: 5% (480/9584) remote: Counting objects: 6% (576/9584) remote: Counting objects: 7% (671/9584) remote: Counting objects: 8% (767/9584) remote: Counting objects: 9% (863/9584) remote: Counting objects: 10% (959/9584) remote: Counting objects: 11% (1055/9584) remote: Counting objects: 12% (1151/9584) remote: Counting objects: 13% (1246/9584) remote: Counting objects: 14% (1342/9584) remote: Counting objects: 15% (1438/9584) remote: Counting objects: 16% (1534/9584) remote: Counting objects: 17% (1630/9584) remote: Counting objects: 18% (1726/9584) remote: Counting objects: 19% (1821/9584) remote: Counting objects: 20% (1917/9584) remote: Counting objects: 21% (2013/9584) remote: Counting objects: 22% (2109/9584) remote: Counting objects: 23% (2205/9584) remote: Counting objects: 24% (2301/9584) remote: Counting objects: 25% (2396/9584) remote: Counting objects: 26% (2492/9584) remote: Counting objects: 27% (2588/9584) remote: Counting objects: 28% (2684/9584) remote: Counting objects: 29% (2780/9584) remote: Counting objects: 30% (2876/9584) remote: Counting objects: 31% (2972/9584) remote: Counting objects: 32% (3067/9584) remote: Counting objects: 33% (3163/9584) remote: Counting objects: 34% (3259/9584) remote: Counting objects: 35% (3355/9584) remote: Counting objects: 36% (3451/9584) remote: Counting objects: 37% (3547/9584) remote: Counting objects: 38% (3642/9584) remote: Counting objects: 39% (3738/9584) remote: Counting objects: 40% (3834/9584) remote: Counting objects: 41% (3930/9584) remote: Counting objects: 42% (4026/9584) remote: Counting objects: 43% (4122/9584) remote: Counting objects: 44% (4217/9584) remote: Counting objects: 45% (4313/9584) remote: Counting objects: 46% (4409/9584) remote: Counting objects: 47% (4505/9584) remote: Counting objects: 48% (4601/9584) remote: Counting objects: 49% (4697/9584) remote: Counting objects: 50% (4792/9584) remote: Counting objects: 51% (4888/9584) remote: Counting objects: 52% (4984/9584) remote: Counting objects: 53% (5080/9584) remote: Counting objects: 54% (5176/9584) remote: Counting objects: 55% (5272/9584) remote: Counting objects: 56% (5368/9584) remote: Counting objects: 57% (5463/9584) remote: Counting objects: 58% (5559/9584) remote: Counting objects: 59% (5655/9584) remote: Counting objects: 60% (5751/9584) remote: Counting objects: 61% (5847/9584) remote: Counting objects: 62% (5943/9584) remote: Counting objects: 63% (6038/9584) remote: Counting objects: 64% (6134/9584) remote: Counting objects: 65% (6230/9584) remote: Counting objects: 66% (6326/9584) remote: Counting objects: 67% (6422/9584) remote: Counting objects: 68% (6518/9584) remote: Counting objects: 69% (6613/9584) remote: Counting objects: 70% (6709/9584) remote: Counting objects: 71% (6805/9584) remote: Counting objects: 72% (6901/9584) remote: Counting objects: 73% (6997/9584) remote: Counting objects: 74% (7093/9584) remote: Counting objects: 75% (7188/9584) remote: Counting objects: 76% (7284/9584) remote: Counting objects: 77% (7380/9584) remote: Counting objects: 78% (7476/9584) remote: Counting objects: 79% (7572/9584) remote: Counting objects: 80% (7668/9584) remote: Counting objects: 81% (7764/9584) remote: Counting objects: 82% (7859/9584) remote: Counting objects: 83% (7955/9584) remote: Counting objects: 84% (8051/9584) remote: Counting objects: 85% (8147/9584) remote: Counting objects: 86% (8243/9584) remote: Counting objects: 87% (8339/9584) remote: Counting objects: 88% (8434/9584) remote: Counting objects: 89% (8530/9584) remote: Counting objects: 90% (8626/9584) remote: Counting objects: 91% (8722/9584) remote: Counting objects: 92% (8818/9584) remote: Counting objects: 93% (8914/9584) remote: Counting objects: 94% (9009/9584) remote: Counting objects: 95% (9105/9584) remote: Counting objects: 96% (9201/9584) remote: Counting objects: 97% (9297/9584) remote: Counting objects: 98% (9393/9584) remote: Counting objects: 99% (9489/9584) remote: Counting objects: 100% (9584/9584) remote: Counting objects: 100% (9584/9584), done.
  5. 3.22 s remote: Compressing objects: 0% (1/2108) remote: Compressing objects: 1% (22/2108) remote: Compressing objects: 2% (43/2108) remote: Compressing objects: 3% (64/2108) remote: Compressing objects: 4% (85/2108) remote: Compressing objects: 5% (106/2108) remote: Compressing objects: 6% (127/2108) remote: Compressing objects: 7% (148/2108) remote: Compressing objects: 8% (169/2108) remote: Compressing objects: 8% (171/2108) remote: Compressing objects: 9% (190/2108) remote: Compressing objects: 10% (211/2108) remote: Compressing objects: 11% (232/2108) remote: Compressing objects: 12% (253/2108) remote: Compressing objects: 13% (275/2108) remote: Compressing objects: 14% (296/2108) remote: Compressing objects: 15% (317/2108) remote: Compressing objects: 16% (338/2108) remote: Compressing objects: 17% (359/2108) remote: Compressing objects: 18% (380/2108) remote: Compressing objects: 18% (399/2108) remote: Compressing objects: 19% (401/2108) remote: Compressing objects: 20% (422/2108) remote: Compressing objects: 21% (443/2108) remote: Compressing objects: 22% (464/2108) remote: Compressing objects: 23% (485/2108) remote: Compressing objects: 24% (506/2108) remote: Compressing objects: 25% (527/2108) remote: Compressing objects: 26% (549/2108) remote: Compressing objects: 27% (570/2108) remote: Compressing objects: 28% (591/2108) remote: Compressing objects: 29% (612/2108) remote: Compressing objects: 30% (633/2108) remote: Compressing objects: 31% (654/2108) remote: Compressing objects: 32% (675/2108) remote: Compressing objects: 33% (696/2108) remote: Compressing objects: 34% (717/2108) remote: Compressing objects: 35% (738/2108) remote: Compressing objects: 36% (759/2108) remote: Compressing objects: 37% (780/2108) remote: Compressing objects: 38% (802/2108) remote: Compressing objects: 39% (823/2108) remote: Compressing objects: 40% (844/2108) remote: Compressing objects: 41% (865/2108) remote: Compressing objects: 42% (886/2108) remote: Compressing objects: 43% (907/2108) remote: Compressing objects: 44% (928/2108) remote: Compressing objects: 45% (949/2108) remote: Compressing objects: 46% (970/2108) remote: Compressing objects: 47% (991/2108) remote: Compressing objects: 48% (1012/2108) remote: Compressing objects: 49% (1033/2108) remote: Compressing objects: 50% (1054/2108) remote: Compressing objects: 51% (1076/2108) remote: Compressing objects: 52% (1097/2108) remote: Compressing objects: 53% (1118/2108) remote: Compressing objects: 54% (1139/2108) remote: Compressing objects: 55% (1160/2108) remote: Compressing objects: 56% (1181/2108) remote: Compressing objects: 57% (1202/2108) remote: Compressing objects: 58% (1223/2108) remote: Compressing objects: 59% (1244/2108) remote: Compressing objects: 60% (1265/2108) remote: Compressing objects: 61% (1286/2108) remote: Compressing objects: 62% (1307/2108) remote: Compressing objects: 63% (1329/2108) remote: Compressing objects: 64% (1350/2108) remote: Compressing objects: 65% (1371/2108) remote: Compressing objects: 66% (1392/2108) remote: Compressing objects: 67% (1413/2108) remote: Compressing objects: 68% (1434/2108) remote: Compressing objects: 69% (1455/2108) remote: Compressing objects: 70% (1476/2108) remote: Compressing objects: 71% (1497/2108) remote: Compressing objects: 72% (1518/2108) remote: Compressing objects: 73% (1539/2108) remote: Compressing objects: 74% (1560/2108) remote: Compressing objects: 75% (1581/2108) remote: Compressing objects: 76% (1603/2108) remote: Compressing objects: 77% (1624/2108) remote: Compressing objects: 78% (1645/2108) remote: Compressing objects: 79% (1666/2108) remote: Compressing objects: 80% (1687/2108) remote: Compressing objects: 81% (1708/2108) remote: Compressing objects: 82% (1729/2108) remote: Compressing objects: 83% (1750/2108) remote: Compressing objects: 84% (1771/2108) remote: Compressing objects: 85% (1792/2108) remote: Compressing objects: 86% (1813/2108) remote: Compressing objects: 87% (1834/2108) remote: Compressing objects: 88% (1856/2108) remote: Compressing objects: 89% (1877/2108) remote: Compressing objects: 90% (1898/2108) remote: Compressing objects: 91% (1919/2108) remote: Compressing objects: 92% (1940/2108) remote: Compressing objects: 93% (1961/2108) remote: Compressing objects: 94% (1982/2108) remote: Compressing objects: 95% (2003/2108) remote: Compressing objects: 96% (2024/2108) remote: Compressing objects: 97% (2045/2108) remote: Compressing objects: 98% (2066/2108) remote: Compressing objects: 99% (2087/2108) remote: Compressing objects: 100% (2108/2108) remote: Compressing objects: 100% (2108/2108), done.
  6. 14.20 s Receiving objects: 0% (1/103100) Receiving objects: 1% (1031/103100) Receiving objects: 2% (2062/103100) Receiving objects: 3% (3093/103100) Receiving objects: 4% (4124/103100) Receiving objects: 5% (5155/103100) Receiving objects: 6% (6186/103100) Receiving objects: 7% (7217/103100) Receiving objects: 8% (8248/103100), 16.37 MiB | 32.73 MiB/s Receiving objects: 9% (9279/103100), 16.37 MiB | 32.73 MiB/s Receiving objects: 10% (10310/103100), 16.37 MiB | 32.73 MiB/s Receiving objects: 11% (11341/103100), 16.37 MiB | 32.73 MiB/s Receiving objects: 12% (12372/103100), 16.37 MiB | 32.73 MiB/s Receiving objects: 13% (13403/103100), 16.37 MiB | 32.73 MiB/s Receiving objects: 14% (14434/103100), 16.37 MiB | 32.73 MiB/s Receiving objects: 15% (15465/103100), 16.37 MiB | 32.73 MiB/s Receiving objects: 16% (16496/103100), 16.37 MiB | 32.73 MiB/s Receiving objects: 17% (17527/103100), 16.37 MiB | 32.73 MiB/s Receiving objects: 18% (18558/103100), 16.37 MiB | 32.73 MiB/s Receiving objects: 19% (19589/103100), 16.37 MiB | 32.73 MiB/s Receiving objects: 20% (20620/103100), 16.37 MiB | 32.73 MiB/s Receiving objects: 21% (21651/103100), 16.37 MiB | 32.73 MiB/s Receiving objects: 22% (22682/103100), 16.37 MiB | 32.73 MiB/s Receiving objects: 23% (23713/103100), 16.37 MiB | 32.73 MiB/s Receiving objects: 24% (24744/103100), 16.37 MiB | 32.73 MiB/s Receiving objects: 25% (25775/103100), 16.37 MiB | 32.73 MiB/s Receiving objects: 26% (26806/103100), 16.37 MiB | 32.73 MiB/s Receiving objects: 27% (27837/103100), 16.37 MiB | 32.73 MiB/s Receiving objects: 28% (28868/103100), 16.37 MiB | 32.73 MiB/s Receiving objects: 29% (29899/103100), 16.37 MiB | 32.73 MiB/s Receiving objects: 30% (30930/103100), 16.37 MiB | 32.73 MiB/s Receiving objects: 31% (31961/103100), 16.37 MiB | 32.73 MiB/s Receiving objects: 32% (32992/103100), 16.37 MiB | 32.73 MiB/s Receiving objects: 33% (34023/103100), 16.37 MiB | 32.73 MiB/s Receiving objects: 33% (34359/103100), 16.37 MiB | 32.73 MiB/s Receiving objects: 34% (35054/103100), 35.89 MiB | 35.88 MiB/s Receiving objects: 35% (36085/103100), 35.89 MiB | 35.88 MiB/s Receiving objects: 36% (37116/103100), 35.89 MiB | 35.88 MiB/s Receiving objects: 37% (38147/103100), 35.89 MiB | 35.88 MiB/s Receiving objects: 38% (39178/103100), 35.89 MiB | 35.88 MiB/s Receiving objects: 39% (40209/103100), 35.89 MiB | 35.88 MiB/s Receiving objects: 40% (41240/103100), 35.89 MiB | 35.88 MiB/s Receiving objects: 41% (42271/103100), 35.89 MiB | 35.88 MiB/s Receiving objects: 42% (43302/103100), 35.89 MiB | 35.88 MiB/s Receiving objects: 43% (44333/103100), 53.19 MiB | 35.46 MiB/s Receiving objects: 44% (45364/103100), 53.19 MiB | 35.46 MiB/s Receiving objects: 45% (46395/103100), 53.19 MiB | 35.46 MiB/s Receiving objects: 46% (47426/103100), 53.19 MiB | 35.46 MiB/s Receiving objects: 47% (48457/103100), 53.19 MiB | 35.46 MiB/s Receiving objects: 48% (49488/103100), 53.19 MiB | 35.46 MiB/s Receiving objects: 48% (50187/103100), 70.27 MiB | 35.06 MiB/s Receiving objects: 49% (50519/103100), 70.27 MiB | 35.06 MiB/s Receiving objects: 50% (51550/103100), 70.27 MiB | 35.06 MiB/s Receiving objects: 51% (52581/103100), 70.27 MiB | 35.06 MiB/s Receiving objects: 52% (53612/103100), 70.27 MiB | 35.06 MiB/s Receiving objects: 53% (54643/103100), 70.27 MiB | 35.06 MiB/s Receiving objects: 54% (55674/103100), 70.27 MiB | 35.06 MiB/s Receiving objects: 55% (56705/103100), 70.27 MiB | 35.06 MiB/s Receiving objects: 56% (57736/103100), 89.11 MiB | 35.60 MiB/s Receiving objects: 57% (58767/103100), 89.11 MiB | 35.60 MiB/s Receiving objects: 58% (59798/103100), 89.11 MiB | 35.60 MiB/s Receiving objects: 58% (60645/103100), 107.14 MiB | 35.68 MiB/s Receiving objects: 59% (60829/103100), 107.14 MiB | 35.68 MiB/s Receiving objects: 60% (61860/103100), 107.14 MiB | 35.68 MiB/s Receiving objects: 61% (62891/103100), 107.14 MiB | 35.68 MiB/s Receiving objects: 62% (63922/103100), 107.14 MiB | 35.68 MiB/s Receiving objects: 62% (64283/103100), 142.77 MiB | 35.58 MiB/s Receiving objects: 63% (64953/103100), 142.77 MiB | 35.58 MiB/s Receiving objects: 64% (65984/103100), 142.77 MiB | 35.58 MiB/s Receiving objects: 64% (66257/103100), 179.65 MiB | 36.18 MiB/s Receiving objects: 64% (66367/103100), 197.80 MiB | 35.88 MiB/s Receiving objects: 64% (66446/103100), 234.72 MiB | 36.48 MiB/s Receiving objects: 64% (66552/103100), 289.50 MiB | 36.51 MiB/s Receiving objects: 65% (67015/103100), 289.50 MiB | 36.51 MiB/s Receiving objects: 66% (68046/103100), 289.50 MiB | 36.51 MiB/s Receiving objects: 67% (69077/103100), 289.50 MiB | 36.51 MiB/s Receiving objects: 68% (70108/103100), 289.50 MiB | 36.51 MiB/s Receiving objects: 69% (71139/103100), 289.50 MiB | 36.51 MiB/s Receiving objects: 70% (72170/103100), 289.50 MiB | 36.51 MiB/s Receiving objects: 71% (73201/103100), 307.55 MiB | 36.63 MiB/s Receiving objects: 72% (74232/103100), 307.55 MiB | 36.63 MiB/s Receiving objects: 73% (75263/103100), 307.55 MiB | 36.63 MiB/s Receiving objects: 74% (76294/103100), 307.55 MiB | 36.63 MiB/s Receiving objects: 75% (77325/103100), 307.55 MiB | 36.63 MiB/s Receiving objects: 76% (78356/103100), 307.55 MiB | 36.63 MiB/s Receiving objects: 77% (79387/103100), 307.55 MiB | 36.63 MiB/s Receiving objects: 77% (80063/103100), 307.55 MiB | 36.63 MiB/s Receiving objects: 78% (80418/103100), 307.55 MiB | 36.63 MiB/s Receiving objects: 79% (81449/103100), 325.74 MiB | 36.49 MiB/s Receiving objects: 80% (82480/103100), 325.74 MiB | 36.49 MiB/s Receiving objects: 81% (83511/103100), 325.74 MiB | 36.49 MiB/s Receiving objects: 82% (84542/103100), 325.74 MiB | 36.49 MiB/s Receiving objects: 83% (85573/103100), 325.74 MiB | 36.49 MiB/s Receiving objects: 83% (86464/103100), 343.24 MiB | 36.34 MiB/s Receiving objects: 84% (86604/103100), 361.84 MiB | 36.44 MiB/s Receiving objects: 85% (87635/103100), 361.84 MiB | 36.44 MiB/s Receiving objects: 86% (88666/103100), 361.84 MiB | 36.44 MiB/s Receiving objects: 87% (89697/103100), 361.84 MiB | 36.44 MiB/s Receiving objects: 88% (90728/103100), 361.84 MiB | 36.44 MiB/s Receiving objects: 89% (91759/103100), 361.84 MiB | 36.44 MiB/s Receiving objects: 90% (92790/103100), 376.21 MiB | 35.50 MiB/s Receiving objects: 91% (93821/103100), 376.21 MiB | 35.50 MiB/s Receiving objects: 92% (94852/103100), 376.21 MiB | 35.50 MiB/s Receiving objects: 93% (95883/103100), 376.21 MiB | 35.50 MiB/s Receiving objects: 94% (96914/103100), 376.21 MiB | 35.50 MiB/s Receiving objects: 95% (97945/103100), 376.21 MiB | 35.50 MiB/s Receiving objects: 96% (98976/103100), 376.21 MiB | 35.50 MiB/s Receiving objects: 97% (100007/103100), 376.21 MiB | 35.50 MiB/s Receiving objects: 98% (101038/103100), 376.21 MiB | 35.50 MiB/s Receiving objects: 99% (102069/103100), 376.21 MiB | 35.50 MiB/s remote: Total 103100 (delta 8262), reused 7565 (delta 7464), pack-reused 93516 (from 4)
  7. 14.20 s Receiving objects: 100% (103100/103100), 376.21 MiB | 35.50 MiB/s Receiving objects: 100% (103100/103100), 391.60 MiB | 35.68 MiB/s, done.
  8. 15.91 s Resolving deltas: 0% (0/67531) Resolving deltas: 1% (677/67531) Resolving deltas: 2% (1351/67531) Resolving deltas: 3% (2026/67531) Resolving deltas: 4% (2702/67531) Resolving deltas: 5% (3378/67531) Resolving deltas: 6% (4052/67531) Resolving deltas: 7% (4728/67531) Resolving deltas: 8% (5404/67531) Resolving deltas: 9% (6078/67531) Resolving deltas: 10% (6754/67531) Resolving deltas: 11% (7429/67531) Resolving deltas: 12% (8104/67531) Resolving deltas: 13% (8780/67531) Resolving deltas: 14% (9455/67531) Resolving deltas: 15% (10130/67531) Resolving deltas: 16% (10805/67531) Resolving deltas: 17% (11481/67531) Resolving deltas: 18% (12156/67531) Resolving deltas: 19% (12831/67531) Resolving deltas: 20% (13507/67531) Resolving deltas: 21% (14182/67531) Resolving deltas: 22% (14857/67531) Resolving deltas: 23% (15537/67531) Resolving deltas: 24% (16209/67531) Resolving deltas: 25% (16883/67531) Resolving deltas: 26% (17559/67531) Resolving deltas: 27% (18236/67531) Resolving deltas: 28% (18909/67531) Resolving deltas: 29% (19584/67531) Resolving deltas: 30% (20260/67531) Resolving deltas: 31% (20935/67531) Resolving deltas: 32% (21610/67531) Resolving deltas: 33% (22286/67531) Resolving deltas: 34% (22962/67531) Resolving deltas: 35% (23636/67531) Resolving deltas: 36% (24312/67531) Resolving deltas: 37% (24989/67531) Resolving deltas: 38% (25662/67531) Resolving deltas: 39% (26338/67531) Resolving deltas: 40% (27014/67531) Resolving deltas: 41% (27688/67531) Resolving deltas: 42% (28365/67531) Resolving deltas: 43% (29039/67531) Resolving deltas: 44% (29714/67531) Resolving deltas: 45% (30389/67531) Resolving deltas: 46% (31065/67531) Resolving deltas: 47% (31740/67531) Resolving deltas: 48% (32415/67531) Resolving deltas: 49% (33091/67531) Resolving deltas: 50% (33766/67531) Resolving deltas: 51% (34441/67531) Resolving deltas: 52% (35117/67531) Resolving deltas: 53% (35792/67531) Resolving deltas: 54% (36469/67531) Resolving deltas: 55% (37145/67531) Resolving deltas: 56% (37818/67531) Resolving deltas: 57% (38493/67531) Resolving deltas: 58% (39168/67531) Resolving deltas: 59% (39848/67531) Resolving deltas: 60% (40519/67531) Resolving deltas: 61% (41194/67531) Resolving deltas: 62% (41870/67531) Resolving deltas: 62% (42370/67531) Resolving deltas: 63% (42545/67531) Resolving deltas: 64% (43221/67531) Resolving deltas: 65% (43896/67531) Resolving deltas: 66% (44571/67531) Resolving deltas: 67% (45246/67531) Resolving deltas: 68% (45922/67531) Resolving deltas: 69% (46597/67531) Resolving deltas: 70% (47272/67531) Resolving deltas: 71% (47948/67531) Resolving deltas: 72% (48623/67531) Resolving deltas: 73% (49298/67531) Resolving deltas: 74% (49973/67531) Resolving deltas: 75% (50650/67531) Resolving deltas: 76% (51324/67531) Resolving deltas: 77% (51999/67531) Resolving deltas: 78% (52675/67531) Resolving deltas: 79% (53352/67531) Resolving deltas: 80% (54025/67531) Resolving deltas: 81% (54701/67531) Resolving deltas: 82% (55376/67531) Resolving deltas: 83% (56051/67531) Resolving deltas: 84% (56727/67531) Resolving deltas: 85% (57402/67531) Resolving deltas: 86% (58077/67531) Resolving deltas: 87% (58752/67531) Resolving deltas: 88% (59429/67531) Resolving deltas: 89% (60103/67531) Resolving deltas: 90% (60778/67531) Resolving deltas: 91% (61454/67531) Resolving deltas: 92% (62129/67531) Resolving deltas: 93% (62804/67531) Resolving deltas: 94% (63480/67531) Resolving deltas: 95% (64155/67531) Resolving deltas: 96% (64831/67531) Resolving deltas: 97% (65508/67531) Resolving deltas: 98% (66181/67531) Resolving deltas: 99% (66859/67531) Resolving deltas: 100% (67531/67531) Resolving deltas: 100% (67531/67531), done.
  9. 16.63 s Fetching commit e825dd904bec36e475ba5e4734659c1f4762247e for feynkit ...
  10. 16.63 s $ /nix/store/5vpcfsdx1lcnlb2y4k7xyc74shp5qwbh-git-2.54.0/bin/git fetch origin e825dd904bec36e475ba5e4734659c1f4762247e
  11. 17.11 s From https://github.com/alphal00p/gammaloop
  12. 17.11 s * branch e825dd904bec36e475ba5e4734659c1f4762247e -> FETCH_HEAD
  13. 17.12 s $ /nix/store/61685rbaxmpigwi3z23i33sv3jyfl70q-coreutils-9.11/bin/timeout --kill-after=15s 7200s /nix/store/5vpcfsdx1lcnlb2y4k7xyc74shp5qwbh-git-2.54.0/bin/git -c advice.detachedHead=false checkout e825dd904bec36e475ba5e4734659c1f4762247e
  14. 17.40 s HEAD is now at e825dd904 expose generation progress and live Python filters
  15. 17.40 s $ /nix/store/61685rbaxmpigwi3z23i33sv3jyfl70q-coreutils-9.11/bin/timeout --kill-after=15s 7200s /nix/store/wknkybkzrc16r11vk5vrykh4wmw7a353-nix-2.34.8/bin/nix --extra-experimental-features nix-command --extra-experimental-features flakes --log-format internal-json run .#packages.x86_64-linux.nix-ci-check-gammaloop-nextest-feynkit --print-build-logs
  16. 17.58 s warning: ignoring untrusted flake configuration setting 'extra-substituters'.
  17. 17.58 s Pass '--accept-flake-config' to trust it
  18. 17.58 s warning: ignoring untrusted flake configuration setting 'extra-trusted-public-keys'.
  19. 17.58 s Pass '--accept-flake-config' to trust it
  20. 23.42 s
  21. 23.69 s do you want to allow configuration setting 'extra-substituters' to be set to 'https://cache.nix-ci.com' (y/N)? do you want to permanently mark this value as untrusted (y/N)? warning: ignoring untrusted flake configuration setting 'extra-substituters'.
  22. 23.69 s Pass '--accept-flake-config' to trust it
  23. 23.69 s evaluating derivation 'gdo you want to allow configuration setting 'extra-trusted-public-keys' to be set to 'nix-ci:g3xV5BDTLtIBZr/A00IU1x0EtKKlb7YLgBN2SgYgM6A=' (y/N)? do you want to permanently mark this value as untrusted (y/N)? warning: ignoring untrusted flake configuration setting 'extra-trusted-public-keys'.
  24. 23.69 s Pass '--accept-flake-config' to trust it
  25. 35.03 s copying '/nix/store/wli3 evaluating derivation 'g copying '/nix/store/wli3 evaluating derivation 'g copying '/nix/store/wli3 evaluating derivation 'g copying '/nix/store/wli3 evaluating derivation 'g querying gammaloop-nexte [7.3 KiB DL] querying fl [11.2 KiB DL] querying i [0/14 built, 13/0/18 cop [0/13 built, 12/2/18 cop [0/13 built, 12/3/18 cop [0/12 built, 11/5/18 cop [0/12 built, 10/6/18 cop [0/12 built, 10/7/18 cop [0/12 built, 10/8/18 cop [0/11 built, 9/9/18 copi [0/9 built, 7/11/18 copi [0/8 built, 6/12/18 copi [0/6 built, 4/14/18 copi [0/5 built, 3/15/18 copi [0/4 built, 2/16/18 copi [0/3 built, 1/17/18 copi [0/2 built, 18 copied (3 [1/0/2 built, 18 copied gammaloop-nextest-binaries-feynkit (post)> Uploading to the NixCI cache: /nix/store/9b92axf3sxbmf1w12q9ggg4k61y4qm03-gammaloop-nextest-binaries-feynkit
  26. 35.08 s gammaloop-nextest-binaries-feynkit (post)> warning: 'warn-short-path-literals' is deprecated, use 'lint-short-path-literals = ignore' instead
  27. 35.13 s gammaloop-nextest-binaries-feynkit (post)> copying 0 paths...
  28. 35.19 s gammaloop-nextest-binaries-feynkit (post)> warning: 'warn-short-path-literals' is deprecated, use 'lint-short-path-literals = ignore' instead
  29. 37.47 s gammaloop-nextest-binaries-feynkit (post)> copying 0 paths...
  30. 37.85 s [1/3 built, 18 copied (3 [1/1/2 built, 18 copied gammaloop-nextest-feynkit> Extracting 1 binary and 2 linked paths to /build/source
  31. 37.94 s gammaloop-nextest-feynkit> Extracted 15 files to /build/source in 0.09s
  32. 37.95 s gammaloop-nextest-feynkit> ------------
  33. 37.95 s gammaloop-nextest-feynkit> Nextest run ID 23cc95af-8f8b-4a69-be89-cb28641e67bb with nextest profile: ci_gammaloop
  34. 37.95 s gammaloop-nextest-feynkit> Starting 1 test across 1 binary
  35. 37.96 s gammaloop-nextest-feynkit> ------------
  36. 37.96 s gammaloop-nextest-feynkit> Summary [ 0.006s] 1 test run: 1 passed, 0 skipped
  37. 37.99 s gammaloop-nextest-feynkit>
  38. 37.99 s gammaloop-nextest-feynkit> ========== nextest test summary ==========
  39. 37.99 s gammaloop-nextest-feynkit> report: target/nextest/ci_gammaloop/junit.xml
  40. 37.99 s gammaloop-nextest-feynkit> tests: 1, failures: 0, errors: 0
  41. 37.99 s gammaloop-nextest-feynkit> No failing testcases found.
  42. 37.99 s gammaloop-nextest-feynkit> =========================================
  43. 38.01 s gammaloop-nextest-feynkit> Extracting 1 binary and 2 linked paths to /build/source
  44. 38.10 s gammaloop-nextest-feynkit> Extracted 15 files to /build/source in 0.10s
  45. 38.11 s gammaloop-nextest-feynkit> ------------
  46. 38.11 s gammaloop-nextest-feynkit> Nextest run ID b41048db-83e5-4b8a-9f8b-674e34c2142c with nextest profile: ci_gammaloop
  47. 38.11 s gammaloop-nextest-feynkit> Starting 33 tests across 1 binary
  48. 38.13 s gammaloop-nextest-feynkit> ------------
  49. 38.13 s gammaloop-nextest-feynkit> Summary [ 0.021s] 33 tests run: 33 passed, 0 skipped
  50. 38.17 s gammaloop-nextest-feynkit>
  51. 38.17 s gammaloop-nextest-feynkit> ========== nextest test summary ==========
  52. 38.17 s gammaloop-nextest-feynkit> report: target/nextest/ci_gammaloop/junit.xml
  53. 38.17 s gammaloop-nextest-feynkit> tests: 33, failures: 0, errors: 0
  54. 38.17 s gammaloop-nextest-feynkit> No failing testcases found.
  55. 38.17 s gammaloop-nextest-feynkit> =========================================
  56. 38.18 s gammaloop-nextest-feynkit> Extracting 2 binaries and 2 linked paths to /build/source
  57. 38.33 s gammaloop-nextest-feynkit> Extracted 16 files to /build/source in 0.15s
  58. 38.34 s gammaloop-nextest-feynkit> ------------
  59. 38.34 s gammaloop-nextest-feynkit> Nextest run ID da48e0c5-8a0c-417e-a42d-8035b7977f7d with nextest profile: ci_gammaloop
  60. 38.34 s gammaloop-nextest-feynkit> Starting 59 tests across 2 binaries
  61. 38.41 s gammaloop-nextest-feynkit> ------------
  62. 38.41 s gammaloop-nextest-feynkit> Summary [ 0.062s] 59 tests run: 59 passed, 0 skipped
  63. 38.45 s gammaloop-nextest-feynkit>
  64. 38.45 s gammaloop-nextest-feynkit> ========== nextest test summary ==========
  65. 38.45 s gammaloop-nextest-feynkit> report: target/nextest/ci_gammaloop/junit.xml
  66. 38.45 s gammaloop-nextest-feynkit> tests: 59, failures: 0, errors: 0
  67. 38.45 s gammaloop-nextest-feynkit> No failing testcases found.
  68. 38.45 s gammaloop-nextest-feynkit> =========================================
  69. 38.47 s gammaloop-nextest-feynkit> Extracting 1 binary and 2 linked paths to /build/source
  70. 38.58 s gammaloop-nextest-feynkit> Extracted 15 files to /build/source in 0.11s
  71. 38.59 s gammaloop-nextest-feynkit> ------------
  72. 38.59 s gammaloop-nextest-feynkit> Nextest run ID f78b2fc2-7f85-47d2-8c7d-5fbd4095d85a with nextest profile: ci_gammaloop
  73. 38.59 s gammaloop-nextest-feynkit> Starting 27 tests across 1 binary
  74. 38.61 s gammaloop-nextest-feynkit> ------------
  75. 38.61 s gammaloop-nextest-feynkit> Summary [ 0.022s] 27 tests run: 27 passed, 0 skipped
  76. 38.65 s gammaloop-nextest-feynkit>
  77. 38.65 s gammaloop-nextest-feynkit> ========== nextest test summary ==========
  78. 38.65 s gammaloop-nextest-feynkit> report: target/nextest/ci_gammaloop/junit.xml
  79. 38.65 s gammaloop-nextest-feynkit> tests: 27, failures: 0, errors: 0
  80. 38.65 s gammaloop-nextest-feynkit> No failing testcases found.
  81. 38.65 s gammaloop-nextest-feynkit> =========================================
  82. 38.66 s gammaloop-nextest-feynkit> Extracting 1 binary and 1 linked path to /build/source
  83. 38.76 s gammaloop-nextest-feynkit> Extracted 7 files to /build/source in 0.09s
  84. 38.77 s gammaloop-nextest-feynkit> ------------
  85. 38.77 s gammaloop-nextest-feynkit> Nextest run ID 4ff29777-00ec-4183-a84e-d9048d65f9af with nextest profile: ci_gammaloop
  86. 38.77 s gammaloop-nextest-feynkit> Starting 21 tests across 1 binary
  87. 38.78 s gammaloop-nextest-feynkit> ------------
  88. 38.78 s gammaloop-nextest-feynkit> Summary [ 0.012s] 21 tests run: 21 passed, 0 skipped
  89. 38.81 s gammaloop-nextest-feynkit>
  90. 38.81 s gammaloop-nextest-feynkit> ========== nextest test summary ==========
  91. 38.81 s gammaloop-nextest-feynkit> report: target/nextest/ci_gammaloop/junit.xml
  92. 38.81 s gammaloop-nextest-feynkit> tests: 21, failures: 0, errors: 0
  93. 38.81 s gammaloop-nextest-feynkit> No failing testcases found.
  94. 38.81 s gammaloop-nextest-feynkit> =========================================
  95. 38.83 s gammaloop-nextest-feynkit> Extracting 2 binaries and 2 linked paths to /build/source
  96. 38.97 s gammaloop-nextest-feynkit> Extracted 16 files to /build/source in 0.15s
  97. 38.99 s gammaloop-nextest-feynkit> ------------
  98. 38.99 s gammaloop-nextest-feynkit> Nextest run ID 1ecee66f-4355-46ae-9f46-48809e143418 with nextest profile: ci_gammaloop
  99. 38.99 s gammaloop-nextest-feynkit> Starting 14 tests across 2 binaries
  100. 39.00 s gammaloop-nextest-feynkit> ------------
  101. 39.00 s gammaloop-nextest-feynkit> Summary [ 0.013s] 14 tests run: 14 passed, 0 skipped
  102. 39.03 s gammaloop-nextest-feynkit>
  103. 39.03 s gammaloop-nextest-feynkit> ========== nextest test summary ==========
  104. 39.03 s gammaloop-nextest-feynkit> report: target/nextest/ci_gammaloop/junit.xml
  105. 39.03 s gammaloop-nextest-feynkit> tests: 14, failures: 0, errors: 0
  106. 39.03 s gammaloop-nextest-feynkit> No failing testcases found.
  107. 39.03 s gammaloop-nextest-feynkit> =========================================
  108. 39.05 s gammaloop-nextest-feynkit> Extracting 5 binaries (including 3 non-test binaries) and 2 linked paths to /build/source
  109. 39.69 s gammaloop-nextest-feynkit> Extracted 22 files to /build/source in 0.64s
  110. 39.71 s gammaloop-nextest-feynkit> ------------
  111. 39.71 s gammaloop-nextest-feynkit> Nextest run ID 6339edd5-62de-4bcc-9e2a-efbfb0b72acb with nextest profile: ci_gammaloop
  112. 39.71 s gammaloop-nextest-feynkit> Starting 14 tests across 2 binaries
  113. 39.78 s gammaloop-nextest-feynkit> FAIL [ 0.074s] (10/14) feynkit-py tests::standalone_python_pipeline_covers_generation_graphs_cff_and_kinematics
  114. 39.78 s gammaloop-nextest-feynkit> stdout ---
  115. 39.78 s gammaloop-nextest-feynkit>
  116. 39.78 s gammaloop-nextest-feynkit> running 1 test
  117. 39.78 s gammaloop-nextest-feynkit> test tests::standalone_python_pipeline_covers_generation_graphs_cff_and_kinematics ... FAILED
  118. 39.78 s gammaloop-nextest-feynkit>
  119. 39.78 s gammaloop-nextest-feynkit> failures:
  120. 39.78 s gammaloop-nextest-feynkit>
  121. 39.78 s gammaloop-nextest-feynkit> failures:
  122. 39.78 s gammaloop-nextest-feynkit> tests::standalone_python_pipeline_covers_generation_graphs_cff_and_kinematics
  123. 39.78 s gammaloop-nextest-feynkit>
  124. 39.78 s gammaloop-nextest-feynkit> test result: FAILED. 0 passed; 1 failed; 0 ignored; 0 measured; 12 filtered out; finished in 0.06s
  125. 39.78 s gammaloop-nextest-feynkit>
  126. 39.78 s gammaloop-nextest-feynkit> stderr ---
  127. 39.78 s gammaloop-nextest-feynkit>
  128. 39.78 s gammaloop-nextest-feynkit> thread 'tests::standalone_python_pipeline_covers_generation_graphs_cff_and_kinematics' (902) panicked at crates/feynkit-py/src/lib.rs:439:57:
  129. 39.78 s gammaloop-nextest-feynkit> called `Result::unwrap()` on an `Err` value: PyErr { type: <class 'AssertionError'>, value: AssertionError(), traceback: Some("Traceback (most recent call last):\n File \"<string>\", line 39, in <module>\n") }
  130. 39.78 s gammaloop-nextest-feynkit> stack backtrace:
  131. 39.78 s gammaloop-nextest-feynkit> 0: __rustc::rust_begin_unwind
  132. 39.78 s gammaloop-nextest-feynkit> 1: core::panicking::panic_fmt
  133. 39.78 s gammaloop-nextest-feynkit> 2: core::result::unwrap_failed
  134. 39.78 s gammaloop-nextest-feynkit> 3: feynkit_py::tests::standalone_python_pipeline_covers_generation_graphs_cff_and_kinematics
  135. 39.78 s gammaloop-nextest-feynkit> 4: <feynkit_py::tests::standalone_python_pipeline_covers_generation_graphs_cff_and_kinematics::{closure#0} as core::ops::function::FnOnce<()>>::call_once
  136. 39.78 s gammaloop-nextest-feynkit> note: Some details are omitted, run with `RUST_BACKTRACE=full` for a verbose backtrace.
  137. 39.78 s gammaloop-nextest-feynkit>
  138. 40.82 s gammaloop-nextest-feynkit> ------------
  139. 40.82 s gammaloop-nextest-feynkit> Summary [ 1.110s] 14 tests run: 13 passed, 1 failed, 0 skipped
  140. 40.82 s gammaloop-nextest-feynkit> FAIL [ 0.074s] (10/14) feynkit-py tests::standalone_python_pipeline_covers_generation_graphs_cff_and_kinematics
  141. 40.82 s gammaloop-nextest-feynkit> stdout ---
  142. 40.82 s gammaloop-nextest-feynkit>
  143. 40.82 s gammaloop-nextest-feynkit> running 1 test
  144. 40.82 s gammaloop-nextest-feynkit> test tests::standalone_python_pipeline_covers_generation_graphs_cff_and_kinematics ... FAILED
  145. 40.82 s gammaloop-nextest-feynkit>
  146. 40.82 s gammaloop-nextest-feynkit> failures:
  147. 40.82 s gammaloop-nextest-feynkit>
  148. 40.82 s gammaloop-nextest-feynkit> failures:
  149. 40.82 s gammaloop-nextest-feynkit> tests::standalone_python_pipeline_covers_generation_graphs_cff_and_kinematics
  150. 40.82 s gammaloop-nextest-feynkit>
  151. 40.82 s gammaloop-nextest-feynkit> test result: FAILED. 0 passed; 1 failed; 0 ignored; 0 measured; 12 filtered out; finished in 0.06s
  152. 40.82 s gammaloop-nextest-feynkit>
  153. 40.82 s gammaloop-nextest-feynkit> stderr ---
  154. 40.82 s gammaloop-nextest-feynkit>
  155. 40.82 s gammaloop-nextest-feynkit> thread 'tests::standalone_python_pipeline_covers_generation_graphs_cff_and_kinematics' (902) panicked at crates/feynkit-py/src/lib.rs:439:57:
  156. 40.82 s gammaloop-nextest-feynkit> called `Result::unwrap()` on an `Err` value: PyErr { type: <class 'AssertionError'>, value: AssertionError(), traceback: Some("Traceback (most recent call last):\n File \"<string>\", line 39, in <module>\n") }
  157. 40.82 s gammaloop-nextest-feynkit> stack backtrace:
  158. 40.82 s gammaloop-nextest-feynkit> 0: __rustc::rust_begin_unwind
  159. 40.82 s gammaloop-nextest-feynkit> 1: core::panicking::panic_fmt
  160. 40.82 s gammaloop-nextest-feynkit> 2: core::result::unwrap_failed
  161. 40.82 s gammaloop-nextest-feynkit> 3: feynkit_py::tests::standalone_python_pipeline_covers_generation_graphs_cff_and_kinematics
  162. 40.82 s gammaloop-nextest-feynkit> 4: <feynkit_py::tests::standalone_python_pipeline_covers_generation_graphs_cff_and_kinematics::{closure#0} as core::ops::function::FnOnce<()>>::call_once
  163. 40.82 s gammaloop-nextest-feynkit> note: Some details are omitted, run with `RUST_BACKTRACE=full` for a verbose backtrace.
  164. 40.82 s gammaloop-nextest-feynkit>
  165. 40.82 s gammaloop-nextest-feynkit> error: test run failed
  166. 40.85 s gammaloop-nextest-feynkit>
  167. 40.85 s gammaloop-nextest-feynkit> ========== nextest test summary ==========
  168. 40.85 s gammaloop-nextest-feynkit> report: target/nextest/ci_gammaloop/junit.xml
  169. 40.85 s gammaloop-nextest-feynkit> tests: 14, failures: 1, errors: 0
  170. 40.85 s gammaloop-nextest-feynkit>
  171. 40.85 s gammaloop-nextest-feynkit> 1. feynkit-py::tests::standalone_python_pipeline_covers_generation_graphs_cff_and_kinematics
  172. 40.85 s gammaloop-nextest-feynkit> failure: test failure with exit code 101
  173. 40.85 s gammaloop-nextest-feynkit> thread 'tests::standalone_python_pipeline_covers_generation_graphs_cff_and_kinematics' (902) panicked at crates/feynkit-py/src/lib.rs:439:57:
  174. 40.85 s gammaloop-nextest-feynkit> called `Result::unwrap()` on an `Err` value: PyErr { type: <class 'AssertionError'>, value: AssertionError(), traceback: Some("Traceback (most recent call last):\n File \"<string>\", line 39, in <module>\n") }
  175. 40.85 s gammaloop-nextest-feynkit> stack backtrace:
  176. 40.85 s gammaloop-nextest-feynkit> 0: __rustc::rust_begin_unwind
  177. 40.85 s gammaloop-nextest-feynkit> 1: core::panicking::panic_fmt
  178. 40.85 s gammaloop-nextest-feynkit> 2: core::result::unwrap_failed
  179. 40.85 s gammaloop-nextest-feynkit> 3: feynkit_py::tests::standalone_python_pipeline_covers_generation_graphs_cff_and_kinematics
  180. 40.85 s gammaloop-nextest-feynkit> 4: <feynkit_py::tests::standalone_python_pipeline_covers_generation_graphs_cff_and_kinematics::{closure#0} as core::ops::function::FnOnce<()>>::call_once
  181. 40.85 s gammaloop-nextest-feynkit> note: Some details are omitted, run with `RUST_BACKTRACE=full` for a verbose backtrace.
  182. 40.85 s gammaloop-nextest-feynkit> system-out
  183. 40.85 s gammaloop-nextest-feynkit> running 1 test
  184. 40.85 s gammaloop-nextest-feynkit> test tests::standalone_python_pipeline_covers_generation_graphs_cff_and_kinematics ... FAILED
  185. 40.85 s gammaloop-nextest-feynkit>
  186. 40.85 s gammaloop-nextest-feynkit> failures:
  187. 40.85 s gammaloop-nextest-feynkit>
  188. 40.85 s gammaloop-nextest-feynkit> failures:
  189. 40.85 s gammaloop-nextest-feynkit> tests::standalone_python_pipeline_covers_generation_graphs_cff_and_kinematics
  190. 40.85 s gammaloop-nextest-feynkit>
  191. 40.85 s gammaloop-nextest-feynkit> test result: FAILED. 0 passed; 1 failed; 0 ignored; 0 measured; 12 filtered out; finished in 0.06s
  192. 40.85 s gammaloop-nextest-feynkit> system-err
  193. 40.85 s gammaloop-nextest-feynkit> thread 'tests::standalone_python_pipeline_covers_generation_graphs_cff_and_kinematics' (902) panicked at crates/feynkit-py/src/lib.rs:439:57:
  194. 40.85 s gammaloop-nextest-feynkit> called `Result::unwrap()` on an `Err` value: PyErr { type: <class 'AssertionError'>, value: AssertionError(), traceback: Some("Traceback (most recent call last):\n File \"<string>\", line 39, in <module>\n") }
  195. 40.85 s gammaloop-nextest-feynkit> stack backtrace:
  196. 40.85 s gammaloop-nextest-feynkit> 0: __rustc::rust_begin_unwind
  197. 40.85 s gammaloop-nextest-feynkit> 1: core::panicking::panic_fmt
  198. 40.85 s gammaloop-nextest-feynkit> 2: core::result::unwrap_failed
  199. 40.85 s gammaloop-nextest-feynkit> 3: feynkit_py::tests::standalone_python_pipeline_covers_generation_graphs_cff_and_kinematics
  200. 40.85 s gammaloop-nextest-feynkit> 4: <feynkit_py::tests::standalone_python_pipeline_covers_generation_graphs_cff_and_kinematics::{closure#0} as core::ops::function::FnOnce<()>>::call_once
  201. 40.85 s gammaloop-nextest-feynkit> note: Some details are omitted, run with `RUST_BACKTRACE=full` for a verbose backtrace.
  202. 40.85 s gammaloop-nextest-feynkit> =========================================
  203. 40.86 s gammaloop-nextest-feynkit> Extracting 1 binary and 2 linked paths to /build/source
  204. 40.96 s gammaloop-nextest-feynkit> Extracted 15 files to /build/source in 0.10s
  205. 40.97 s gammaloop-nextest-feynkit> ------------
  206. 40.97 s gammaloop-nextest-feynkit> Nextest run ID c68249ef-fa18-4081-988b-90a4e10722b7 with nextest profile: ci_gammaloop
  207. 40.97 s gammaloop-nextest-feynkit> Starting 45 tests across 1 binary (1 test skipped)
  208. 41.08 s gammaloop-nextest-feynkit> ------------
  209. 41.08 s gammaloop-nextest-feynkit> Summary [ 0.114s] 45 tests run: 45 passed, 1 skipped
  210. 41.12 s gammaloop-nextest-feynkit>
  211. 41.12 s gammaloop-nextest-feynkit> ========== nextest test summary ==========
  212. 41.12 s gammaloop-nextest-feynkit> report: target/nextest/ci_gammaloop/junit.xml
  213. 41.12 s gammaloop-nextest-feynkit> tests: 45, failures: 0, errors: 0
  214. 41.12 s gammaloop-nextest-feynkit> No failing testcases found.
  215. 41.12 s gammaloop-nextest-feynkit> =========================================
  216. 41.13 s gammaloop-nextest-feynkit> Extracting 1 binary and 2 linked paths to /build/source
  217. 41.21 s gammaloop-nextest-feynkit> Extracted 15 files to /build/source in 0.08s
  218. 41.22 s gammaloop-nextest-feynkit> ------------
  219. 41.22 s gammaloop-nextest-feynkit> Nextest run ID c347c5ae-3f56-4ef9-8311-5881910285a7 with nextest profile: ci_gammaloop
  220. 41.22 s gammaloop-nextest-feynkit> Starting 2 tests across 1 binary
  221. 41.24 s gammaloop-nextest-feynkit> ------------
  222. 41.24 s gammaloop-nextest-feynkit> Summary [ 0.017s] 2 tests run: 2 passed, 0 skipped
  223. 41.27 s gammaloop-nextest-feynkit>
  224. 41.27 s gammaloop-nextest-feynkit> ========== nextest test summary ==========
  225. 41.27 s gammaloop-nextest-feynkit> report: target/nextest/ci_gammaloop/junit.xml
  226. 41.27 s gammaloop-nextest-feynkit> tests: 2, failures: 0, errors: 0
  227. 41.27 s gammaloop-nextest-feynkit> No failing testcases found.
  228. 41.27 s gammaloop-nextest-feynkit> =========================================
  229. 41.43 s error: Cannot build '/nix/store/kb0lr4h0gq0x5sqkq38ia6ralwg0mmq8-gammaloop-nextest-feynkit.drv'.
  230. 41.43 s Reason: builder failed with exit code 100.
  231. 41.43 s Output paths:
  232. 41.43 s /nix/store/ahpf8mz4pdljmdp9r23wz3kjl8xw3ph3-gammaloop-nextest-feynkit
  233. 41.43 s Last 199 log lines:
  234. 41.43 s > Extracting 1 binary and 2 linked paths to /build/source
  235. 41.43 s > Extracted 15 files to /build/source in 0.09s
  236. 41.43 s > ------------
  237. 41.43 s > Nextest run ID 23cc95af-8f8b-4a69-be89-cb28641e67bb with nextest profile: ci_gammaloop
  238. 41.43 s > Starting 1 test across 1 binary
  239. 41.43 s > ------------
  240. 41.43 s > Summary [ 0.006s] 1 test run: 1 passed, 0 skipped
  241. 41.43 s >
  242. 41.43 s > ========== nextest test summary ==========
  243. 41.43 s > report: target/nextest/ci_gammaloop/junit.xml
  244. 41.43 s > tests: 1, failures: 0, errors: 0
  245. 41.43 s > No failing testcases found.
  246. 41.43 s > =========================================
  247. 41.43 s > Extracting 1 binary and 2 linked paths to /build/source
  248. 41.43 s > Extracted 15 files to /build/source in 0.10s
  249. 41.43 s > ------------
  250. 41.43 s > Nextest run ID b41048db-83e5-4b8a-9f8b-674e34c2142c with nextest profile: ci_gammaloop
  251. 41.43 s > Starting 33 tests across 1 binary
  252. 41.43 s > ------------
  253. 41.43 s > Summary [ 0.021s] 33 tests run: 33 passed, 0 skipped
  254. 41.43 s >
  255. 41.43 s > ========== nextest test summary ==========
  256. 41.43 s > report: target/nextest/ci_gammaloop/junit.xml
  257. 41.43 s > tests: 33, failures: 0, errors: 0
  258. 41.43 s > No failing testcases found.
  259. 41.43 s > =========================================
  260. 41.43 s > Extracting 2 binaries and 2 linked paths to /build/source
  261. 41.43 s > Extracted 16 files to /build/source in 0.15s
  262. 41.43 s > ------------
  263. 41.43 s > Nextest run ID da48e0c5-8a0c-417e-a42d-8035b7977f7d with nextest profile: ci_gammaloop
  264. 41.43 s > Starting 59 tests across 2 binaries
  265. 41.43 s > ------------
  266. 41.43 s > Summary [ 0.062s] 59 tests run: 59 passed, 0 skipped
  267. 41.43 s >
  268. 41.43 s > ========== nextest test summary ==========
  269. 41.43 s > report: target/nextest/ci_gammaloop/junit.xml
  270. 41.43 s > tests: 59, failures: 0, errors: 0
  271. 41.43 s > No failing testcases found.
  272. 41.43 s > =========================================
  273. 41.43 s > Extracting 1 binary and 2 linked paths to /build/source
  274. 41.43 s > Extracted 15 files to /build/source in 0.11s
  275. 41.43 s > ------------
  276. 41.43 s > Nextest run ID f78b2fc2-7f85-47d2-8c7d-5fbd4095d85a with nextest profile: ci_gammaloop
  277. 41.43 s > Starting 27 tests across 1 binary
  278. 41.43 s > ------------
  279. 41.43 s > Summary [ 0.022s] 27 tests run: 27 passed, 0 skipped
  280. 41.43 s >
  281. 41.43 s > ========== nextest test summary ==========
  282. 41.43 s > report: target/nextest/ci_gammaloop/junit.xml
  283. 41.43 s > tests: 27, failures: 0, errors: 0
  284. 41.43 s > No failing testcases found.
  285. 41.43 s > =========================================
  286. 41.43 s > Extracting 1 binary and 1 linked path to /build/source
  287. 41.43 s > Extracted 7 files to /build/source in 0.09s
  288. 41.43 s > ------------
  289. 41.43 s > Nextest run ID 4ff29777-00ec-4183-a84e-d9048d65f9af with nextest profile: ci_gammaloop
  290. 41.43 s > Starting 21 tests across 1 binary
  291. 41.43 s > ------------
  292. 41.43 s > Summary [ 0.012s] 21 tests run: 21 passed, 0 skipped
  293. 41.43 s >
  294. 41.43 s > ========== nextest test summary ==========
  295. 41.43 s > report: target/nextest/ci_gammaloop/junit.xml
  296. 41.43 s > tests: 21, failures: 0, errors: 0
  297. 41.43 s > No failing testcases found.
  298. 41.43 s > =========================================
  299. 41.43 s > Extracting 2 binaries and 2 linked paths to /build/source
  300. 41.43 s > Extracted 16 files to /build/source in 0.15s
  301. 41.43 s > ------------
  302. 41.43 s > Nextest run ID 1ecee66f-4355-46ae-9f46-48809e143418 with nextest profile: ci_gammaloop
  303. 41.43 s > Starting 14 tests across 2 binaries
  304. 41.43 s > ------------
  305. 41.43 s > Summary [ 0.013s] 14 tests run: 14 passed, 0 skipped
  306. 41.43 s >
  307. 41.43 s > ========== nextest test summary ==========
  308. 41.43 s > report: target/nextest/ci_gammaloop/junit.xml
  309. 41.43 s > tests: 14, failures: 0, errors: 0
  310. 41.43 s > No failing testcases found.
  311. 41.43 s > =========================================
  312. 41.43 s > Extracting 5 binaries (including 3 non-test binaries) and 2 linked paths to /build/source
  313. 41.43 s > Extracted 22 files to /build/source in 0.64s
  314. 41.43 s > ------------
  315. 41.43 s > Nextest run ID 6339edd5-62de-4bcc-9e2a-efbfb0b72acb with nextest profile: ci_gammaloop
  316. 41.43 s > Starting 14 tests across 2 binaries
  317. 41.43 s > FAIL [ 0.074s] (10/14) feynkit-py tests::standalone_python_pipeline_covers_generation_graphs_cff_and_kinematics
  318. 41.43 s > stdout ---
  319. 41.43 s >
  320. 41.43 s > running 1 test
  321. 41.43 s > test tests::standalone_python_pipeline_covers_generation_graphs_cff_and_kinematics ... FAILED
  322. 41.43 s >
  323. 41.43 s > failures:
  324. 41.43 s >
  325. 41.43 s > failures:
  326. 41.43 s > tests::standalone_python_pipeline_covers_generation_graphs_cff_and_kinematics
  327. 41.43 s >
  328. 41.43 s > test result: FAILED. 0 passed; 1 failed; 0 ignored; 0 measured; 12 filtered out; finished in 0.06s
  329. 41.43 s >
  330. 41.43 s > stderr ---
  331. 41.43 s >
  332. 41.43 s > thread 'tests::standalone_python_pipeline_covers_generation_graphs_cff_and_kinematics' (902) panicked at crates/feynkit-py/src/lib.rs:439:57:
  333. 41.43 s > called `Result::unwrap()` on an `Err` value: PyErr { type: <class 'AssertionError'>, value: AssertionError(), traceback: Some("Traceback (most recent call last):\n File \"<string>\", line 39, in <module>\n") }
  334. 41.43 s > stack backtrace:
  335. 41.43 s > 0: __rustc::rust_begin_unwind
  336. 41.43 s > 1: core::panicking::panic_fmt
  337. 41.43 s > 2: core::result::unwrap_failed
  338. 41.43 s > 3: feynkit_py::tests::standalone_python_pipeline_covers_generation_graphs_cff_and_kinematics
  339. 41.43 s > 4: <feynkit_py::tests::standalone_python_pipeline_covers_generation_graphs_cff_and_kinematics::{closure#0} as core::ops::function::FnOnce<()>>::call_once
  340. 41.43 s > note: Some details are omitted, run with `RUST_BACKTRACE=full` for a verbose backtrace.
  341. 41.43 s >
  342. 41.43 s > ------------
  343. 41.43 s > Summary [ 1.110s] 14 tests run: 13 passed, 1 failed, 0 skipped
  344. 41.43 s > FAIL [ 0.074s] (10/14) feynkit-py tests::standalone_python_pipeline_covers_generation_graphs_cff_and_kinematics
  345. 41.43 s > stdout ---
  346. 41.43 s >
  347. 41.43 s > running 1 test
  348. 41.43 s > test tests::standalone_python_pipeline_covers_generation_graphs_cff_and_kinematics ... FAILED
  349. 41.43 s >
  350. 41.43 s > failures:
  351. 41.43 s >
  352. 41.43 s > failures:
  353. 41.43 s > tests::standalone_python_pipeline_covers_generation_graphs_cff_and_kinematics
  354. 41.43 s >
  355. 41.43 s > test result: FAILED. 0 passed; 1 failed; 0 ignored; 0 measured; 12 filtered out; finished in 0.06s
  356. 41.43 s >
  357. 41.43 s > stderr ---
  358. 41.43 s >
  359. 41.43 s > thread 'tests::standalone_python_pipeline_covers_generation_graphs_cff_and_kinematics' (902) panicked at crates/feynkit-py/src/lib.rs:439:57:
  360. 41.43 s > called `Result::unwrap()` on an `Err` value: PyErr { type: <class 'AssertionError'>, value: AssertionError(), traceback: Some("Traceback (most recent call last):\n File \"<string>\", line 39, in <module>\n") }
  361. 41.43 s > stack backtrace:
  362. 41.43 s > 0: __rustc::rust_begin_unwind
  363. 41.43 s > 1: core::panicking::panic_fmt
  364. 41.43 s > 2: core::result::unwrap_failed
  365. 41.43 s > 3: feynkit_py::tests::standalone_python_pipeline_covers_generation_graphs_cff_and_kinematics
  366. 41.43 s > 4: <feynkit_py::tests::standalone_python_pipeline_covers_generation_graphs_cff_and_kinematics::{closure#0} as core::ops::function::FnOnce<()>>::call_once
  367. 41.43 s > note: Some details are omitted, run with `RUST_BACKTRACE=full` for a verbose backtrace.
  368. 41.43 s >
  369. 41.43 s > error: test run failed
  370. 41.43 s >
  371. 41.43 s > ========== nextest test summary ==========
  372. 41.43 s > report: target/nextest/ci_gammaloop/junit.xml
  373. 41.43 s > tests: 14, failures: 1, errors: 0
  374. 41.43 s >
  375. 41.43 s > 1. feynkit-py::tests::standalone_python_pipeline_covers_generation_graphs_cff_and_kinematics
  376. 41.43 s > failure: test failure with exit code 101
  377. 41.43 s > thread 'tests::standalone_python_pipeline_covers_generation_graphs_cff_and_kinematics' (902) panicked at crates/feynkit-py/src/lib.rs:439:57:
  378. 41.43 s > called `Result::unwrap()` on an `Err` value: PyErr { type: <class 'AssertionError'>, value: AssertionError(), traceback: Some("Traceback (most recent call last):\n File \"<string>\", line 39, in <module>\n") }
  379. 41.43 s > stack backtrace:
  380. 41.43 s > 0: __rustc::rust_begin_unwind
  381. 41.43 s > 1: core::panicking::panic_fmt
  382. 41.43 s > 2: core::result::unwrap_failed
  383. 41.43 s > 3: feynkit_py::tests::standalone_python_pipeline_covers_generation_graphs_cff_and_kinematics
  384. 41.43 s > 4: <feynkit_py::tests::standalone_python_pipeline_covers_generation_graphs_cff_and_kinematics::{closure#0} as core::ops::function::FnOnce<()>>::call_once
  385. 41.43 s > note: Some details are omitted, run with `RUST_BACKTRACE=full` for a verbose backtrace.
  386. 41.43 s > system-out
  387. 41.43 s > running 1 test
  388. 41.43 s > test tests::standalone_python_pipeline_covers_generation_graphs_cff_and_kinematics ... FAILED
  389. 41.43 s >
  390. 41.43 s > failures:
  391. 41.43 s >
  392. 41.43 s > failures:
  393. 41.43 s > tests::standalone_python_pipeline_covers_generation_graphs_cff_and_kinematics
  394. 41.43 s >
  395. 41.43 s > test result: FAILED. 0 passed; 1 failed; 0 ignored; 0 measured; 12 filtered out; finished in 0.06s
  396. 41.43 s > system-err
  397. 41.43 s > thread 'tests::standalone_python_pipeline_covers_generation_graphs_cff_and_kinematics' (902) panicked at crates/feynkit-py/src/lib.rs:439:57:
  398. 41.43 s > called `Result::unwrap()` on an `Err` value: PyErr { type: <class 'AssertionError'>, value: AssertionError(), traceback: Some("Traceback (most recent call last):\n File \"<string>\", line 39, in <module>\n") }
  399. 41.43 s > stack backtrace:
  400. 41.43 s > 0: __rustc::rust_begin_unwind
  401. 41.43 s > 1: core::panicking::panic_fmt
  402. 41.43 s > 2: core::result::unwrap_failed
  403. 41.43 s > 3: feynkit_py::tests::standalone_python_pipeline_covers_generation_graphs_cff_and_kinematics
  404. 41.43 s > 4: <feynkit_py::tests::standalone_python_pipeline_covers_generation_graphs_cff_and_kinematics::{closure#0} as core::ops::function::FnOnce<()>>::call_once
  405. 41.43 s > note: Some details are omitted, run with `RUST_BACKTRACE=full` for a verbose backtrace.
  406. 41.43 s > =========================================
  407. 41.43 s > Extracting 1 binary and 2 linked paths to /build/source
  408. 41.43 s > Extracted 15 files to /build/source in 0.10s
  409. 41.43 s > ------------
  410. 41.43 s > Nextest run ID c68249ef-fa18-4081-988b-90a4e10722b7 with nextest profile: ci_gammaloop
  411. 41.43 s > Starting 45 tests across 1 binary (1 test skipped)
  412. 41.43 s > ------------
  413. 41.43 s > Summary [ 0.114s] 45 tests run: 45 passed, 1 skipped
  414. 41.43 s >
  415. 41.43 s > ========== nextest test summary ==========
  416. 41.43 s > report: target/nextest/ci_gammaloop/junit.xml
  417. 41.43 s > tests: 45, failures: 0, errors: 0
  418. 41.43 s > No failing testcases found.
  419. 41.43 s > =========================================
  420. 41.43 s > Extracting 1 binary and 2 linked paths to /build/source
  421. 41.43 s > Extracted 15 files to /build/source in 0.08s
  422. 41.43 s > ------------
  423. 41.43 s > Nextest run ID c347c5ae-3f56-4ef9-8311-5881910285a7 with nextest profile: ci_gammaloop
  424. 41.43 s > Starting 2 tests across 1 binary
  425. 41.43 s > ------------
  426. 41.43 s > Summary [ 0.017s] 2 tests run: 2 passed, 0 skipped
  427. 41.43 s >
  428. 41.43 s > ========== nextest test summary ==========
  429. 41.43 s > report: target/nextest/ci_gammaloop/junit.xml
  430. 41.43 s > tests: 2, failures: 0, errors: 0
  431. 41.43 s > No failing testcases found.
  432. 41.43 s > =========================================
  433. 41.43 s For full logs, run:
  434. 41.43 s nix log /nix/store/kb0lr4h0gq0x5sqkq38ia6ralwg0mmq8-gammaloop-nextest-feynkit.drv
  435. 41.59 s [1 built (1 failed), 18 Run failed.