1. 0.00 s $ /nix/store/61685rbaxmpigwi3z23i33sv3jyfl70q-coreutils-9.11/bin/timeout --kill-after=15s 7200s /nix/store/wknkybkzrc16r11vk5vrykh4wmw7a353-nix-2.34.8/bin/nix --extra-experimental-features nix-command --extra-experimental-features flakes flake clone git+https://github.com/alphal00p/gammaloop --dest /tmp/nix-ci-worker/stable-pwd/repo/
  2. 0.08 s Cloning into '/tmp/nix-ci-worker/stable-pwd/repo'...
  3. 1.95 s remote: Enumerating objects: 93516 remote: Enumerating objects: 103115, done.
  4. 2.17 s remote: Counting objects: 0% (1/9599) remote: Counting objects: 1% (96/9599) remote: Counting objects: 2% (192/9599) remote: Counting objects: 3% (288/9599) remote: Counting objects: 4% (384/9599) remote: Counting objects: 5% (480/9599) remote: Counting objects: 6% (576/9599) remote: Counting objects: 7% (672/9599) remote: Counting objects: 8% (768/9599) remote: Counting objects: 9% (864/9599) remote: Counting objects: 10% (960/9599) remote: Counting objects: 11% (1056/9599) remote: Counting objects: 12% (1152/9599) remote: Counting objects: 13% (1248/9599) remote: Counting objects: 14% (1344/9599) remote: Counting objects: 15% (1440/9599) remote: Counting objects: 16% (1536/9599) remote: Counting objects: 17% (1632/9599) remote: Counting objects: 18% (1728/9599) remote: Counting objects: 19% (1824/9599) remote: Counting objects: 20% (1920/9599) remote: Counting objects: 21% (2016/9599) remote: Counting objects: 22% (2112/9599) remote: Counting objects: 23% (2208/9599) remote: Counting objects: 24% (2304/9599) remote: Counting objects: 25% (2400/9599) remote: Counting objects: 26% (2496/9599) remote: Counting objects: 27% (2592/9599) remote: Counting objects: 28% (2688/9599) remote: Counting objects: 29% (2784/9599) remote: Counting objects: 30% (2880/9599) remote: Counting objects: 31% (2976/9599) remote: Counting objects: 32% (3072/9599) remote: Counting objects: 33% (3168/9599) remote: Counting objects: 34% (3264/9599) remote: Counting objects: 35% (3360/9599) remote: Counting objects: 36% (3456/9599) remote: Counting objects: 37% (3552/9599) remote: Counting objects: 38% (3648/9599) remote: Counting objects: 39% (3744/9599) remote: Counting objects: 40% (3840/9599) remote: Counting objects: 41% (3936/9599) remote: Counting objects: 42% (4032/9599) remote: Counting objects: 43% (4128/9599) remote: Counting objects: 44% (4224/9599) remote: Counting objects: 45% (4320/9599) remote: Counting objects: 46% (4416/9599) remote: Counting objects: 47% (4512/9599) remote: Counting objects: 48% (4608/9599) remote: Counting objects: 49% (4704/9599) remote: Counting objects: 50% (4800/9599) remote: Counting objects: 51% (4896/9599) remote: Counting objects: 52% (4992/9599) remote: Counting objects: 53% (5088/9599) remote: Counting objects: 54% (5184/9599) remote: Counting objects: 55% (5280/9599) remote: Counting objects: 56% (5376/9599) remote: Counting objects: 57% (5472/9599) remote: Counting objects: 58% (5568/9599) remote: Counting objects: 59% (5664/9599) remote: Counting objects: 60% (5760/9599) remote: Counting objects: 61% (5856/9599) remote: Counting objects: 62% (5952/9599) remote: Counting objects: 63% (6048/9599) remote: Counting objects: 64% (6144/9599) remote: Counting objects: 65% (6240/9599) remote: Counting objects: 66% (6336/9599) remote: Counting objects: 67% (6432/9599) remote: Counting objects: 68% (6528/9599) remote: Counting objects: 69% (6624/9599) remote: Counting objects: 70% (6720/9599) remote: Counting objects: 71% (6816/9599) remote: Counting objects: 72% (6912/9599) remote: Counting objects: 73% (7008/9599) remote: Counting objects: 74% (7104/9599) remote: Counting objects: 75% (7200/9599) remote: Counting objects: 76% (7296/9599) remote: Counting objects: 77% (7392/9599) remote: Counting objects: 78% (7488/9599) remote: Counting objects: 79% (7584/9599) remote: Counting objects: 80% (7680/9599) remote: Counting objects: 81% (7776/9599) remote: Counting objects: 82% (7872/9599) remote: Counting objects: 83% (7968/9599) remote: Counting objects: 84% (8064/9599) remote: Counting objects: 85% (8160/9599) remote: Counting objects: 86% (8256/9599) remote: Counting objects: 87% (8352/9599) remote: Counting objects: 88% (8448/9599) remote: Counting objects: 89% (8544/9599) remote: Counting objects: 90% (8640/9599) remote: Counting objects: 91% (8736/9599) remote: Counting objects: 92% (8832/9599) remote: Counting objects: 93% (8928/9599) remote: Counting objects: 94% (9024/9599) remote: Counting objects: 95% (9120/9599) remote: Counting objects: 96% (9216/9599) remote: Counting objects: 97% (9312/9599) remote: Counting objects: 98% (9408/9599) remote: Counting objects: 99% (9504/9599) remote: Counting objects: 100% (9599/9599) remote: Counting objects: 100% (9599/9599), done.
  5. 4.38 s remote: Compressing objects: 0% (1/2114) remote: Compressing objects: 1% (22/2114) remote: Compressing objects: 2% (43/2114) remote: Compressing objects: 3% (64/2114) remote: Compressing objects: 4% (85/2114) remote: Compressing objects: 5% (106/2114) remote: Compressing objects: 6% (127/2114) remote: Compressing objects: 7% (148/2114) remote: Compressing objects: 8% (170/2114) remote: Compressing objects: 8% (178/2114) remote: Compressing objects: 9% (191/2114) remote: Compressing objects: 10% (212/2114) remote: Compressing objects: 11% (233/2114) remote: Compressing objects: 12% (254/2114) remote: Compressing objects: 13% (275/2114) remote: Compressing objects: 14% (296/2114) remote: Compressing objects: 15% (318/2114) remote: Compressing objects: 16% (339/2114) remote: Compressing objects: 17% (360/2114) remote: Compressing objects: 18% (381/2114) remote: Compressing objects: 19% (402/2114) remote: Compressing objects: 19% (418/2114) remote: Compressing objects: 20% (423/2114) remote: Compressing objects: 21% (444/2114) remote: Compressing objects: 22% (466/2114) remote: Compressing objects: 23% (487/2114) remote: Compressing objects: 24% (508/2114) remote: Compressing objects: 25% (529/2114) remote: Compressing objects: 26% (550/2114) remote: Compressing objects: 27% (571/2114) remote: Compressing objects: 28% (592/2114) remote: Compressing objects: 29% (614/2114) remote: Compressing objects: 30% (635/2114) remote: Compressing objects: 31% (656/2114) remote: Compressing objects: 32% (677/2114) remote: Compressing objects: 33% (698/2114) remote: Compressing objects: 34% (719/2114) remote: Compressing objects: 35% (740/2114) remote: Compressing objects: 36% (762/2114) remote: Compressing objects: 37% (783/2114) remote: Compressing objects: 38% (804/2114) remote: Compressing objects: 39% (825/2114) remote: Compressing objects: 40% (846/2114) remote: Compressing objects: 41% (867/2114) remote: Compressing objects: 42% (888/2114) remote: Compressing objects: 43% (910/2114) remote: Compressing objects: 44% (931/2114) remote: Compressing objects: 45% (952/2114) remote: Compressing objects: 46% (973/2114) remote: Compressing objects: 47% (994/2114) remote: Compressing objects: 48% (1015/2114) remote: Compressing objects: 49% (1036/2114) remote: Compressing objects: 50% (1057/2114) remote: Compressing objects: 51% (1079/2114) remote: Compressing objects: 52% (1100/2114) remote: Compressing objects: 53% (1121/2114) remote: Compressing objects: 54% (1142/2114) remote: Compressing objects: 55% (1163/2114) remote: Compressing objects: 56% (1184/2114) remote: Compressing objects: 57% (1205/2114) remote: Compressing objects: 58% (1227/2114) remote: Compressing objects: 59% (1248/2114) remote: Compressing objects: 60% (1269/2114) remote: Compressing objects: 61% (1290/2114) remote: Compressing objects: 62% (1311/2114) remote: Compressing objects: 63% (1332/2114) remote: Compressing objects: 64% (1353/2114) remote: Compressing objects: 65% (1375/2114) remote: Compressing objects: 66% (1396/2114) remote: Compressing objects: 67% (1417/2114) remote: Compressing objects: 68% (1438/2114) remote: Compressing objects: 69% (1459/2114) remote: Compressing objects: 70% (1480/2114) remote: Compressing objects: 71% (1501/2114) remote: Compressing objects: 72% (1523/2114) remote: Compressing objects: 73% (1544/2114) remote: Compressing objects: 74% (1565/2114) remote: Compressing objects: 75% (1586/2114) remote: Compressing objects: 76% (1607/2114) remote: Compressing objects: 77% (1628/2114) remote: Compressing objects: 78% (1649/2114) remote: Compressing objects: 79% (1671/2114) remote: Compressing objects: 80% (1692/2114) remote: Compressing objects: 81% (1713/2114) remote: Compressing objects: 82% (1734/2114) remote: Compressing objects: 83% (1755/2114) remote: Compressing objects: 84% (1776/2114) remote: Compressing objects: 85% (1797/2114) remote: Compressing objects: 86% (1819/2114) remote: Compressing objects: 87% (1840/2114) remote: Compressing objects: 88% (1861/2114) remote: Compressing objects: 89% (1882/2114) remote: Compressing objects: 90% (1903/2114) remote: Compressing objects: 91% (1924/2114) remote: Compressing objects: 92% (1945/2114) remote: Compressing objects: 93% (1967/2114) remote: Compressing objects: 94% (1988/2114) remote: Compressing objects: 95% (2009/2114) remote: Compressing objects: 96% (2030/2114) remote: Compressing objects: 97% (2051/2114) remote: Compressing objects: 98% (2072/2114) remote: Compressing objects: 99% (2093/2114) remote: Compressing objects: 100% (2114/2114) remote: Compressing objects: 100% (2114/2114), done.
  6. 18.30 s Receiving objects: 0% (1/103115) Receiving objects: 1% (1032/103115) Receiving objects: 2% (2063/103115) Receiving objects: 3% (3094/103115), 6.44 MiB | 12.87 MiB/s Receiving objects: 4% (4125/103115), 6.44 MiB | 12.87 MiB/s Receiving objects: 5% (5156/103115), 6.44 MiB | 12.87 MiB/s Receiving objects: 6% (6187/103115), 6.44 MiB | 12.87 MiB/s Receiving objects: 7% (7219/103115), 6.44 MiB | 12.87 MiB/s Receiving objects: 7% (7233/103115), 16.25 MiB | 16.24 MiB/s Receiving objects: 8% (8250/103115), 16.25 MiB | 16.24 MiB/s Receiving objects: 9% (9281/103115), 16.25 MiB | 16.24 MiB/s Receiving objects: 10% (10312/103115), 16.25 MiB | 16.24 MiB/s Receiving objects: 11% (11343/103115), 16.25 MiB | 16.24 MiB/s Receiving objects: 12% (12374/103115), 16.25 MiB | 16.24 MiB/s Receiving objects: 13% (13405/103115), 16.25 MiB | 16.24 MiB/s Receiving objects: 14% (14437/103115), 16.25 MiB | 16.24 MiB/s Receiving objects: 15% (15468/103115), 16.25 MiB | 16.24 MiB/s Receiving objects: 16% (16499/103115), 16.25 MiB | 16.24 MiB/s Receiving objects: 17% (17530/103115), 16.25 MiB | 16.24 MiB/s Receiving objects: 18% (18561/103115), 16.25 MiB | 16.24 MiB/s Receiving objects: 19% (19592/103115), 16.25 MiB | 16.24 MiB/s Receiving objects: 20% (20623/103115), 16.25 MiB | 16.24 MiB/s Receiving objects: 21% (21655/103115), 16.25 MiB | 16.24 MiB/s Receiving objects: 22% (22686/103115), 16.25 MiB | 16.24 MiB/s Receiving objects: 23% (23717/103115), 16.25 MiB | 16.24 MiB/s Receiving objects: 24% (24748/103115), 16.25 MiB | 16.24 MiB/s Receiving objects: 25% (25779/103115), 26.27 MiB | 17.50 MiB/s Receiving objects: 26% (26810/103115), 26.27 MiB | 17.50 MiB/s Receiving objects: 27% (27842/103115), 26.27 MiB | 17.50 MiB/s Receiving objects: 28% (28873/103115), 26.27 MiB | 17.50 MiB/s Receiving objects: 29% (29904/103115), 26.27 MiB | 17.50 MiB/s Receiving objects: 30% (30935/103115), 26.27 MiB | 17.50 MiB/s Receiving objects: 31% (31966/103115), 26.27 MiB | 17.50 MiB/s Receiving objects: 32% (32997/103115), 26.27 MiB | 17.50 MiB/s Receiving objects: 33% (34028/103115), 26.27 MiB | 17.50 MiB/s Receiving objects: 33% (34949/103115), 36.80 MiB | 18.39 MiB/s Receiving objects: 34% (35060/103115), 36.80 MiB | 18.39 MiB/s Receiving objects: 35% (36091/103115), 36.80 MiB | 18.39 MiB/s Receiving objects: 36% (37122/103115), 36.80 MiB | 18.39 MiB/s Receiving objects: 37% (38153/103115), 36.80 MiB | 18.39 MiB/s Receiving objects: 38% (39184/103115), 36.80 MiB | 18.39 MiB/s Receiving objects: 39% (40215/103115), 46.86 MiB | 18.74 MiB/s Receiving objects: 40% (41246/103115), 46.86 MiB | 18.74 MiB/s Receiving objects: 41% (42278/103115), 46.86 MiB | 18.74 MiB/s Receiving objects: 42% (43309/103115), 46.86 MiB | 18.74 MiB/s Receiving objects: 43% (44340/103115), 46.86 MiB | 18.74 MiB/s Receiving objects: 44% (45371/103115), 46.86 MiB | 18.74 MiB/s Receiving objects: 45% (46402/103115), 46.86 MiB | 18.74 MiB/s Receiving objects: 45% (47083/103115), 59.49 MiB | 19.83 MiB/s Receiving objects: 46% (47433/103115), 59.49 MiB | 19.83 MiB/s Receiving objects: 47% (48465/103115), 59.49 MiB | 19.83 MiB/s Receiving objects: 48% (49496/103115), 59.49 MiB | 19.83 MiB/s Receiving objects: 49% (50527/103115), 59.49 MiB | 19.83 MiB/s Receiving objects: 50% (51558/103115), 73.06 MiB | 20.87 MiB/s Receiving objects: 51% (52589/103115), 73.06 MiB | 20.87 MiB/s Receiving objects: 52% (53620/103115), 73.06 MiB | 20.87 MiB/s Receiving objects: 53% (54651/103115), 73.06 MiB | 20.87 MiB/s Receiving objects: 54% (55683/103115), 73.06 MiB | 20.87 MiB/s Receiving objects: 55% (56714/103115), 73.06 MiB | 20.87 MiB/s Receiving objects: 55% (57523/103115), 85.07 MiB | 21.26 MiB/s Receiving objects: 56% (57745/103115), 85.07 MiB | 21.26 MiB/s Receiving objects: 57% (58776/103115), 85.07 MiB | 21.26 MiB/s Receiving objects: 58% (59807/103115), 95.98 MiB | 21.33 MiB/s Receiving objects: 59% (60838/103115), 95.98 MiB | 21.33 MiB/s Receiving objects: 60% (61869/103115), 95.98 MiB | 21.33 MiB/s Receiving objects: 61% (62901/103115), 95.98 MiB | 21.33 MiB/s Receiving objects: 61% (63002/103115), 95.98 MiB | 21.33 MiB/s Receiving objects: 62% (63932/103115), 112.79 MiB | 23.63 MiB/s Receiving objects: 62% (64396/103115), 129.48 MiB | 25.16 MiB/s Receiving objects: 63% (64963/103115), 146.90 MiB | 26.81 MiB/s Receiving objects: 64% (65994/103115), 146.90 MiB | 26.81 MiB/s Receiving objects: 64% (66257/103115), 170.45 MiB | 26.87 MiB/s Receiving objects: 64% (66262/103115), 186.41 MiB | 25.59 MiB/s Receiving objects: 64% (66390/103115), 224.01 MiB | 27.95 MiB/s Receiving objects: 64% (66471/103115), 258.67 MiB | 29.21 MiB/s Receiving objects: 64% (66841/103115), 275.59 MiB | 29.17 MiB/s Receiving objects: 65% (67025/103115), 292.92 MiB | 29.07 MiB/s Receiving objects: 66% (68056/103115), 292.92 MiB | 29.07 MiB/s Receiving objects: 67% (69088/103115), 292.92 MiB | 29.07 MiB/s Receiving objects: 68% (70119/103115), 292.92 MiB | 29.07 MiB/s Receiving objects: 69% (71150/103115), 292.92 MiB | 29.07 MiB/s Receiving objects: 70% (72181/103115), 292.92 MiB | 29.07 MiB/s Receiving objects: 71% (73212/103115), 310.57 MiB | 29.03 MiB/s Receiving objects: 72% (74243/103115), 310.57 MiB | 29.03 MiB/s Receiving objects: 73% (75274/103115), 310.57 MiB | 29.03 MiB/s Receiving objects: 74% (76306/103115), 310.57 MiB | 29.03 MiB/s Receiving objects: 75% (77337/103115), 310.57 MiB | 29.03 MiB/s Receiving objects: 76% (78368/103115), 310.57 MiB | 29.03 MiB/s Receiving objects: 77% (79399/103115), 310.57 MiB | 29.03 MiB/s Receiving objects: 78% (80430/103115), 310.57 MiB | 29.03 MiB/s Receiving objects: 78% (80604/103115), 310.57 MiB | 29.03 MiB/s Receiving objects: 79% (81461/103115), 310.57 MiB | 29.03 MiB/s Receiving objects: 80% (82492/103115), 310.57 MiB | 29.03 MiB/s Receiving objects: 81% (83524/103115), 328.17 MiB | 31.99 MiB/s Receiving objects: 82% (84555/103115), 328.17 MiB | 31.99 MiB/s Receiving objects: 83% (85586/103115), 328.17 MiB | 31.99 MiB/s Receiving objects: 83% (86467/103115), 344.95 MiB | 34.68 MiB/s Receiving objects: 84% (86617/103115), 362.18 MiB | 33.92 MiB/s Receiving objects: 85% (87648/103115), 362.18 MiB | 33.92 MiB/s Receiving objects: 86% (88679/103115), 362.18 MiB | 33.92 MiB/s Receiving objects: 87% (89711/103115), 362.18 MiB | 33.92 MiB/s Receiving objects: 88% (90742/103115), 362.18 MiB | 33.92 MiB/s Receiving objects: 89% (91773/103115), 362.18 MiB | 33.92 MiB/s Receiving objects: 90% (92804/103115), 362.18 MiB | 33.92 MiB/s Receiving objects: 91% (93835/103115), 379.12 MiB | 34.00 MiB/s Receiving objects: 92% (94866/103115), 379.12 MiB | 34.00 MiB/s Receiving objects: 93% (95897/103115), 379.12 MiB | 34.00 MiB/s Receiving objects: 94% (96929/103115), 379.12 MiB | 34.00 MiB/s Receiving objects: 95% (97960/103115), 379.12 MiB | 34.00 MiB/s Receiving objects: 96% (98991/103115), 379.12 MiB | 34.00 MiB/s Receiving objects: 97% (100022/103115), 379.12 MiB | 34.00 MiB/s Receiving objects: 98% (101053/103115), 379.12 MiB | 34.00 MiB/s Receiving objects: 99% (102084/103115), 379.12 MiB | 34.00 MiB/s remote: Total 103115 (delta 8271), reused 7578 (delta 7473), pack-reused 93516 (from 4)
  7. 18.31 s Receiving objects: 100% (103115/103115), 379.12 MiB | 34.00 MiB/s Receiving objects: 100% (103115/103115), 391.61 MiB | 28.12 MiB/s, done.
  8. 21.27 s Resolving deltas: 0% (0/67540) Resolving deltas: 1% (676/67540) Resolving deltas: 2% (1351/67540) Resolving deltas: 3% (2027/67540) Resolving deltas: 4% (2702/67540) Resolving deltas: 5% (3377/67540) Resolving deltas: 6% (4053/67540) Resolving deltas: 7% (4728/67540) Resolving deltas: 8% (5404/67540) Resolving deltas: 9% (6079/67540) Resolving deltas: 10% (6754/67540) Resolving deltas: 11% (7430/67540) Resolving deltas: 12% (8105/67540) Resolving deltas: 13% (8781/67540) Resolving deltas: 14% (9456/67540) Resolving deltas: 15% (10132/67540) Resolving deltas: 16% (10807/67540) Resolving deltas: 17% (11482/67540) Resolving deltas: 18% (12162/67540) Resolving deltas: 19% (12835/67540) Resolving deltas: 20% (13508/67540) Resolving deltas: 21% (14184/67540) Resolving deltas: 22% (14859/67540) Resolving deltas: 23% (15535/67540) Resolving deltas: 24% (16210/67540) Resolving deltas: 25% (16885/67540) Resolving deltas: 26% (17562/67540) Resolving deltas: 27% (18236/67540) Resolving deltas: 28% (18912/67540) Resolving deltas: 29% (19587/67540) Resolving deltas: 30% (20264/67540) Resolving deltas: 31% (20938/67540) Resolving deltas: 32% (21613/67540) Resolving deltas: 33% (22289/67540) Resolving deltas: 34% (22964/67540) Resolving deltas: 35% (23639/67540) Resolving deltas: 36% (24315/67540) Resolving deltas: 37% (24990/67540) Resolving deltas: 38% (25666/67540) Resolving deltas: 39% (26342/67540) Resolving deltas: 40% (27016/67540) Resolving deltas: 41% (27692/67540) Resolving deltas: 42% (28367/67540) Resolving deltas: 43% (29043/67540) Resolving deltas: 44% (29718/67540) Resolving deltas: 45% (30393/67540) Resolving deltas: 46% (31069/67540) Resolving deltas: 46% (31740/67540) Resolving deltas: 47% (31744/67540) Resolving deltas: 48% (32420/67540) Resolving deltas: 49% (33095/67540) Resolving deltas: 50% (33770/67540) Resolving deltas: 51% (34446/67540) Resolving deltas: 52% (35121/67540) Resolving deltas: 53% (35797/67540) Resolving deltas: 54% (36472/67540) Resolving deltas: 55% (37147/67540) Resolving deltas: 56% (37823/67540) Resolving deltas: 57% (38498/67540) Resolving deltas: 58% (39174/67540) Resolving deltas: 59% (39849/67540) Resolving deltas: 60% (40524/67540) Resolving deltas: 61% (41200/67540) Resolving deltas: 62% (41875/67540) Resolving deltas: 63% (42551/67540) Resolving deltas: 64% (43226/67540) Resolving deltas: 65% (43901/67540) Resolving deltas: 66% (44577/67540) Resolving deltas: 67% (45252/67540) Resolving deltas: 67% (45429/67540) Resolving deltas: 68% (45928/67540) Resolving deltas: 69% (46604/67540) Resolving deltas: 70% (47278/67540) Resolving deltas: 71% (47954/67540) Resolving deltas: 72% (48629/67540) Resolving deltas: 73% (49305/67540) Resolving deltas: 74% (49980/67540) Resolving deltas: 75% (50655/67540) Resolving deltas: 76% (51331/67540) Resolving deltas: 77% (52006/67540) Resolving deltas: 78% (52682/67540) Resolving deltas: 79% (53357/67540) Resolving deltas: 80% (54032/67540) Resolving deltas: 81% (54708/67540) Resolving deltas: 82% (55383/67540) Resolving deltas: 83% (56059/67540) Resolving deltas: 84% (56734/67540) Resolving deltas: 85% (57409/67540) Resolving deltas: 86% (58085/67540) Resolving deltas: 87% (58760/67540) Resolving deltas: 88% (59436/67540) Resolving deltas: 89% (60111/67540) Resolving deltas: 90% (60786/67540) Resolving deltas: 91% (61462/67540) Resolving deltas: 92% (62137/67540) Resolving deltas: 93% (62813/67540) Resolving deltas: 94% (63488/67540) Resolving deltas: 95% (64163/67540) Resolving deltas: 96% (64839/67540) Resolving deltas: 97% (65514/67540) Resolving deltas: 98% (66190/67540) Resolving deltas: 99% (66865/67540) Resolving deltas: 100% (67540/67540) Resolving deltas: 100% (67540/67540), done.
  9. 22.09 s Fetching commit e825dd904bec36e475ba5e4734659c1f4762247e for feynkit ...
  10. 22.09 s $ /nix/store/5vpcfsdx1lcnlb2y4k7xyc74shp5qwbh-git-2.54.0/bin/git fetch origin e825dd904bec36e475ba5e4734659c1f4762247e
  11. 22.66 s From https://github.com/alphal00p/gammaloop
  12. 22.66 s * branch e825dd904bec36e475ba5e4734659c1f4762247e -> FETCH_HEAD
  13. 22.69 s $ /nix/store/61685rbaxmpigwi3z23i33sv3jyfl70q-coreutils-9.11/bin/timeout --kill-after=15s 7200s /nix/store/5vpcfsdx1lcnlb2y4k7xyc74shp5qwbh-git-2.54.0/bin/git -c advice.detachedHead=false checkout e825dd904bec36e475ba5e4734659c1f4762247e
  14. 23.02 s HEAD is now at e825dd904 expose generation progress and live Python filters
  15. 23.03 s $ /nix/store/61685rbaxmpigwi3z23i33sv3jyfl70q-coreutils-9.11/bin/timeout --kill-after=15s 7200s /nix/store/wknkybkzrc16r11vk5vrykh4wmw7a353-nix-2.34.8/bin/nix --extra-experimental-features nix-command --extra-experimental-features flakes --log-format internal-json run .#packages.x86_64-linux.nix-ci-check-gammaloop-nextest-core --print-build-logs
  16. 23.39 s warning: ignoring untrusted flake configuration setting 'extra-substituters'.
  17. 23.39 s Pass '--accept-flake-config' to trust it
  18. 23.39 s warning: ignoring untrusted flake configuration setting 'extra-trusted-public-keys'.
  19. 23.39 s Pass '--accept-flake-config' to trust it
  20. 28.94 s
  21. 29.29 s evaluating derivation 'gdo you want to allow configuration setting 'extra-substituters' to be set to 'https://cache.nix-ci.com' (y/N)? do you want to permanently mark this value as untrusted (y/N)? warning: ignoring untrusted flake configuration setting 'extra-substituters'.
  22. 29.29 s Pass '--accept-flake-config' to trust it
  23. 29.29 s do you want to allow configuration setting 'extra-trusted-public-keys' to be set to 'nix-ci:g3xV5BDTLtIBZr/A00IU1x0EtKKlb7YLgBN2SgYgM6A=' (y/N)? do you want to permanently mark this value as untrusted (y/N)? warning: ignoring untrusted flake configuration setting 'extra-trusted-public-keys'.
  24. 29.29 s Pass '--accept-flake-config' to trust it
  25. 34.72 s copying '/nix/store/wli3 evaluating derivation 'g copying '/nix/store/wli3 evaluating derivation 'g copying '/nix/store/wli3 evaluating derivation 'g copying '/nix/store/wli3 evaluating derivation 'g copying '/nix/store/wli3 evaluating derivation 'g copying '/nix/store/wli3 evaluating derivation 'g copying '/nix/store/wli3 evaluating derivation 'g [0/1 built] [1/0/1 built] building ggammaloop-nextest-core> Extracting 4 binaries (including 2 non-test binaries), 1 build script output directory, and 2 linked paths to /build/source
  26. 35.24 s gammaloop-nextest-core> Extracted 20 files to /build/source in 0.52s
  27. 35.25 s gammaloop-nextest-core> ------------
  28. 35.25 s gammaloop-nextest-core> Nextest run ID 17fdbd31-234c-4c6b-8142-0114370e1834 with nextest profile: ci_gammaloop
  29. 35.25 s gammaloop-nextest-core> Starting 341 tests across 2 binaries (1 test skipped)
  30. 35.67 s gammaloop-nextest-core> ------------
  31. 35.67 s gammaloop-nextest-core> Summary [ 0.419s] 341 tests run: 341 passed, 1 skipped
  32. 35.71 s gammaloop-nextest-core>
  33. 35.71 s gammaloop-nextest-core> ========== nextest test summary ==========
  34. 35.71 s gammaloop-nextest-core> report: target/nextest/ci_gammaloop/junit.xml
  35. 35.71 s gammaloop-nextest-core> tests: 341, failures: 0, errors: 0
  36. 35.71 s gammaloop-nextest-core> No failing testcases found.
  37. 35.71 s gammaloop-nextest-core> =========================================
  38. 35.72 s gammaloop-nextest-core> Extracting 1 binary and 1 linked path to /build/source
  39. 35.80 s gammaloop-nextest-core> Extracted 7 files to /build/source in 0.08s
  40. 35.81 s gammaloop-nextest-core> ------------
  41. 35.81 s gammaloop-nextest-core> Nextest run ID 6601a9a5-25c1-48ab-a01f-a10f35c56bc0 with nextest profile: ci_gammaloop
  42. 35.81 s gammaloop-nextest-core> Starting 19 tests across 1 binary
  43. 35.82 s gammaloop-nextest-core> ------------
  44. 35.82 s gammaloop-nextest-core> Summary [ 0.012s] 19 tests run: 19 passed, 0 skipped
  45. 35.85 s gammaloop-nextest-core>
  46. 35.85 s gammaloop-nextest-core> ========== nextest test summary ==========
  47. 35.85 s gammaloop-nextest-core> report: target/nextest/ci_gammaloop/junit.xml
  48. 35.85 s gammaloop-nextest-core> tests: 19, failures: 0, errors: 0
  49. 35.85 s gammaloop-nextest-core> No failing testcases found.
  50. 35.85 s gammaloop-nextest-core> =========================================
  51. 35.86 s gammaloop-nextest-core> Extracting 1 binary to /build/source
  52. 35.90 s gammaloop-nextest-core> Extracted 4 files to /build/source in 0.04s
  53. 35.91 s gammaloop-nextest-core> ------------
  54. 35.91 s gammaloop-nextest-core> Nextest run ID 59c61a08-f857-45d2-b6e7-8b924e7e404a with nextest profile: ci_gammaloop
  55. 35.91 s gammaloop-nextest-core> Starting 0 tests across 1 binary
  56. 35.91 s gammaloop-nextest-core> ------------
  57. 35.91 s gammaloop-nextest-core> Summary [ 0.000s] 0 tests run: 0 passed, 0 skipped
  58. 35.94 s gammaloop-nextest-core>
  59. 35.94 s gammaloop-nextest-core> ========== nextest test summary ==========
  60. 35.94 s gammaloop-nextest-core> report: target/nextest/ci_gammaloop/junit.xml
  61. 35.94 s gammaloop-nextest-core> tests: 0, failures: 0, errors: 0
  62. 35.94 s gammaloop-nextest-core> No failing testcases found.
  63. 35.94 s gammaloop-nextest-core> =========================================
  64. 35.95 s gammaloop-nextest-core> Extracting 4 binaries (including 1 non-test binary), 1 build script output directory, and 2 linked paths to /build/source
  65. 36.45 s gammaloop-nextest-core> Extracted 19 files to /build/source in 0.50s
  66. 36.46 s gammaloop-nextest-core> ------------
  67. 36.46 s gammaloop-nextest-core> Nextest run ID 7f54f609-78d6-47c5-8e75-4a3735dfa5f6 with nextest profile: ci_gammaloop
  68. 36.46 s gammaloop-nextest-core> Starting 421 tests across 3 binaries (31 tests skipped, including 30 tests via profile.ci_gammaloop.default-filter)
  69. 37.02 s gammaloop-nextest-core> FAIL [ 0.051s] (365/421) gammalooprs utils::test_utils::normalization
  70. 37.02 s gammaloop-nextest-core> stdout ---
  71. 37.02 s gammaloop-nextest-core>
  72. 37.02 s gammaloop-nextest-core> running 1 test
  73. 37.02 s gammaloop-nextest-core> ━━━━━━━━━━━━━━━━━━━━━━━━━━━━━━━ Snapshot Summary ━━━━━━━━━━━━━━━━━━━━━━━━━━━━━━━
  74. 37.02 s gammaloop-nextest-core> Snapshot: normalization-2
  75. 37.02 s gammaloop-nextest-core> Source: crates/gammalooprs/src/utils/test_utils.rs:44
  76. 37.02 s gammaloop-nextest-core> ────────────────────────────────────────────────────────────────────────────────
  77. 37.02 s gammaloop-nextest-core> Expression: b.to_canonical_string()
  78. 37.02 s gammaloop-nextest-core> ────────────────────────────────────────────────────────────────────────────────
  79. 37.02 s gammaloop-nextest-core> -old snapshot
  80. 37.02 s gammaloop-nextest-core> +new results
  81. 37.02 s gammaloop-nextest-core> ────────────┬───────────────────────────────────────────────────────────────────
  82. 37.02 s gammaloop-nextest-core> 1 │-gammalooprs::{spenso::rank1,spenso::tensor}::Q(1,spenso::{}::cind(1))
  83. 37.02 s gammaloop-nextest-core> 1 │+gammalooprs::{spenso::rank1,spenso::tensor,spenso::tensor-label:q}::Q(1,spenso::{}::cind(1))
  84. 37.02 s gammaloop-nextest-core> ────────────┴───────────────────────────────────────────────────────────────────
  85. 37.02 s gammaloop-nextest-core> To update snapshots run `cargo insta review`
  86. 37.02 s gammaloop-nextest-core> Stopped on the first failure. Run `cargo insta test` to run all snapshots.
  87. 37.02 s gammaloop-nextest-core> test utils::test_utils::normalization ... FAILED
  88. 37.02 s gammaloop-nextest-core>
  89. 37.02 s gammaloop-nextest-core> failures:
  90. 37.02 s gammaloop-nextest-core>
  91. 37.02 s gammaloop-nextest-core> failures:
  92. 37.02 s gammaloop-nextest-core> utils::test_utils::normalization
  93. 37.02 s gammaloop-nextest-core>
  94. 37.02 s gammaloop-nextest-core> test result: FAILED. 0 passed; 1 failed; 0 ignored; 0 measured; 445 filtered out; finished in 0.04s
  95. 37.02 s gammaloop-nextest-core>
  96. 37.02 s gammaloop-nextest-core> stderr ---
  97. 37.02 s gammaloop-nextest-core>
  98. 37.02 s gammaloop-nextest-core> thread 'utils::test_utils::normalization' (2239) panicked at /nix/store/c7lwckzlfrfsdw1ay0aqz4dpc2j7ry8d-vendor-cargo-deps/c19b7c6f923b580ac259164a89f2577984ad5ab09ee9d583b888f934adbbe8d0/insta-1.47.2/src/runtime.rs:719:13:
  99. 37.02 s gammaloop-nextest-core> snapshot assertion for 'normalization-2' failed in line 44
  100. 37.02 s gammaloop-nextest-core> stack backtrace:
  101. 37.02 s gammaloop-nextest-core> 0: __rustc::rust_begin_unwind
  102. 37.02 s gammaloop-nextest-core> 1: core::panicking::panic_fmt
  103. 37.02 s gammaloop-nextest-core> 2: insta::runtime::assert_snapshot
  104. 37.02 s gammaloop-nextest-core> 3: gammalooprs::utils::test_utils::normalization
  105. 37.02 s gammaloop-nextest-core> 4: <gammalooprs::utils::test_utils::normalization::{closure#0} as core::ops::function::FnOnce<()>>::call_once
  106. 37.02 s gammaloop-nextest-core> note: Some details are omitted, run with `RUST_BACKTRACE=full` for a verbose backtrace.
  107. 37.02 s gammaloop-nextest-core>
  108. 42.97 s gammaloop-nextest-core> ------------
  109. 42.97 s gammaloop-nextest-core> Summary [ 6.512s] 421 tests run: 420 passed, 1 failed, 31 skipped
  110. 42.97 s gammaloop-nextest-core> FAIL [ 0.051s] (365/421) gammalooprs utils::test_utils::normalization
  111. 42.97 s gammaloop-nextest-core> stdout ---
  112. 42.97 s gammaloop-nextest-core>
  113. 42.97 s gammaloop-nextest-core> running 1 test
  114. 42.97 s gammaloop-nextest-core> ━━━━━━━━━━━━━━━━━━━━━━━━━━━━━━━ Snapshot Summary ━━━━━━━━━━━━━━━━━━━━━━━━━━━━━━━
  115. 42.97 s gammaloop-nextest-core> Snapshot: normalization-2
  116. 42.97 s gammaloop-nextest-core> Source: crates/gammalooprs/src/utils/test_utils.rs:44
  117. 42.97 s gammaloop-nextest-core> ────────────────────────────────────────────────────────────────────────────────
  118. 42.97 s gammaloop-nextest-core> Expression: b.to_canonical_string()
  119. 42.97 s gammaloop-nextest-core> ────────────────────────────────────────────────────────────────────────────────
  120. 42.97 s gammaloop-nextest-core> -old snapshot
  121. 42.97 s gammaloop-nextest-core> +new results
  122. 42.97 s gammaloop-nextest-core> ────────────┬───────────────────────────────────────────────────────────────────
  123. 42.97 s gammaloop-nextest-core> 1 │-gammalooprs::{spenso::rank1,spenso::tensor}::Q(1,spenso::{}::cind(1))
  124. 42.97 s gammaloop-nextest-core> 1 │+gammalooprs::{spenso::rank1,spenso::tensor,spenso::tensor-label:q}::Q(1,spenso::{}::cind(1))
  125. 42.97 s gammaloop-nextest-core> ────────────┴───────────────────────────────────────────────────────────────────
  126. 42.97 s gammaloop-nextest-core> To update snapshots run `cargo insta review`
  127. 42.97 s gammaloop-nextest-core> Stopped on the first failure. Run `cargo insta test` to run all snapshots.
  128. 42.97 s gammaloop-nextest-core> test utils::test_utils::normalization ... FAILED
  129. 42.97 s gammaloop-nextest-core>
  130. 42.97 s gammaloop-nextest-core> failures:
  131. 42.97 s gammaloop-nextest-core>
  132. 42.97 s gammaloop-nextest-core> failures:
  133. 42.97 s gammaloop-nextest-core> utils::test_utils::normalization
  134. 42.97 s gammaloop-nextest-core>
  135. 42.97 s gammaloop-nextest-core> test result: FAILED. 0 passed; 1 failed; 0 ignored; 0 measured; 445 filtered out; finished in 0.04s
  136. 42.97 s gammaloop-nextest-core>
  137. 42.97 s gammaloop-nextest-core> stderr ---
  138. 42.97 s gammaloop-nextest-core>
  139. 42.97 s gammaloop-nextest-core> thread 'utils::test_utils::normalization' (2239) panicked at /nix/store/c7lwckzlfrfsdw1ay0aqz4dpc2j7ry8d-vendor-cargo-deps/c19b7c6f923b580ac259164a89f2577984ad5ab09ee9d583b888f934adbbe8d0/insta-1.47.2/src/runtime.rs:719:13:
  140. 42.97 s gammaloop-nextest-core> snapshot assertion for 'normalization-2' failed in line 44
  141. 42.97 s gammaloop-nextest-core> stack backtrace:
  142. 42.97 s gammaloop-nextest-core> 0: __rustc::rust_begin_unwind
  143. 42.97 s gammaloop-nextest-core> 1: core::panicking::panic_fmt
  144. 42.97 s gammaloop-nextest-core> 2: insta::runtime::assert_snapshot
  145. 42.97 s gammaloop-nextest-core> 3: gammalooprs::utils::test_utils::normalization
  146. 42.97 s gammaloop-nextest-core> 4: <gammalooprs::utils::test_utils::normalization::{closure#0} as core::ops::function::FnOnce<()>>::call_once
  147. 42.97 s gammaloop-nextest-core> note: Some details are omitted, run with `RUST_BACKTRACE=full` for a verbose backtrace.
  148. 42.97 s gammaloop-nextest-core>
  149. 42.98 s gammaloop-nextest-core> error: test run failed
  150. 43.00 s gammaloop-nextest-core>
  151. 43.00 s gammaloop-nextest-core> ========== nextest test summary ==========
  152. 43.00 s gammaloop-nextest-core> report: target/nextest/ci_gammaloop/junit.xml
  153. 43.00 s gammaloop-nextest-core> tests: 421, failures: 1, errors: 0
  154. 43.00 s gammaloop-nextest-core>
  155. 43.00 s gammaloop-nextest-core> 1. gammalooprs::utils::test_utils::normalization
  156. 43.00 s gammaloop-nextest-core> failure: test failure with exit code 101
  157. 43.00 s gammaloop-nextest-core> thread 'utils::test_utils::normalization' (2239) panicked at /nix/store/c7lwckzlfrfsdw1ay0aqz4dpc2j7ry8d-vendor-cargo-deps/c19b7c6f923b580ac259164a89f2577984ad5ab09ee9d583b888f934adbbe8d0/insta-1.47.2/src/runtime.rs:719:13:
  158. 43.00 s gammaloop-nextest-core> snapshot assertion for 'normalization-2' failed in line 44
  159. 43.00 s gammaloop-nextest-core> stack backtrace:
  160. 43.00 s gammaloop-nextest-core> 0: __rustc::rust_begin_unwind
  161. 43.00 s gammaloop-nextest-core> 1: core::panicking::panic_fmt
  162. 43.00 s gammaloop-nextest-core> 2: insta::runtime::assert_snapshot
  163. 43.00 s gammaloop-nextest-core> 3: gammalooprs::utils::test_utils::normalization
  164. 43.00 s gammaloop-nextest-core> 4: <gammalooprs::utils::test_utils::normalization::{closure#0} as core::ops::function::FnOnce<()>>::call_once
  165. 43.00 s gammaloop-nextest-core> note: Some details are omitted, run with `RUST_BACKTRACE=full` for a verbose backtrace.
  166. 43.00 s gammaloop-nextest-core> system-out
  167. 43.00 s gammaloop-nextest-core> running 1 test
  168. 43.00 s gammaloop-nextest-core> ━━━━━━━━━━━━━━━━━━━━━━━━━━━━━━━ Snapshot Summary ━━━━━━━━━━━━━━━━━━━━━━━━━━━━━━━
  169. 43.00 s gammaloop-nextest-core> Snapshot: normalization-2
  170. 43.00 s gammaloop-nextest-core> Source: crates/gammalooprs/src/utils/test_utils.rs:44
  171. 43.00 s gammaloop-nextest-core> ────────────────────────────────────────────────────────────────────────────────
  172. 43.00 s gammaloop-nextest-core> Expression: b.to_canonical_string()
  173. 43.00 s gammaloop-nextest-core> ────────────────────────────────────────────────────────────────────────────────
  174. 43.00 s gammaloop-nextest-core> -old snapshot
  175. 43.00 s gammaloop-nextest-core> +new results
  176. 43.00 s gammaloop-nextest-core> ────────────┬───────────────────────────────────────────────────────────────────
  177. 43.00 s gammaloop-nextest-core> 1 │-gammalooprs::{spenso::rank1,spenso::tensor}::Q(1,spenso::{}::cind(1))
  178. 43.00 s gammaloop-nextest-core> 1 │+gammalooprs::{spenso::rank1,spenso::tensor,spenso::tensor-label:q}::Q(1,spenso::{}::cind(1))
  179. 43.00 s gammaloop-nextest-core> ────────────┴───────────────────────────────────────────────────────────────────
  180. 43.00 s gammaloop-nextest-core> To update snapshots run `cargo insta review`
  181. 43.00 s gammaloop-nextest-core> Stopped on the first failure. Run `cargo insta test` to run all snapshots.
  182. 43.00 s gammaloop-nextest-core> test utils::test_utils::normalization ... FAILED
  183. 43.00 s gammaloop-nextest-core>
  184. 43.00 s gammaloop-nextest-core> failures:
  185. 43.00 s gammaloop-nextest-core>
  186. 43.00 s gammaloop-nextest-core> failures:
  187. 43.00 s gammaloop-nextest-core> utils::test_utils::normalization
  188. 43.00 s gammaloop-nextest-core>
  189. 43.00 s gammaloop-nextest-core> test result: FAILED. 0 passed; 1 failed; 0 ignored; 0 measured; 445 filtered out; finished in 0.04s
  190. 43.00 s gammaloop-nextest-core> system-err
  191. 43.00 s gammaloop-nextest-core> thread 'utils::test_utils::normalization' (2239) panicked at /nix/store/c7lwckzlfrfsdw1ay0aqz4dpc2j7ry8d-vendor-cargo-deps/c19b7c6f923b580ac259164a89f2577984ad5ab09ee9d583b888f934adbbe8d0/insta-1.47.2/src/runtime.rs:719:13:
  192. 43.00 s gammaloop-nextest-core> snapshot assertion for 'normalization-2' failed in line 44
  193. 43.00 s gammaloop-nextest-core> stack backtrace:
  194. 43.00 s gammaloop-nextest-core> 0: __rustc::rust_begin_unwind
  195. 43.00 s gammaloop-nextest-core> 1: core::panicking::panic_fmt
  196. 43.00 s gammaloop-nextest-core> 2: insta::runtime::assert_snapshot
  197. 43.00 s gammaloop-nextest-core> 3: gammalooprs::utils::test_utils::normalization
  198. 43.00 s gammaloop-nextest-core> 4: <gammalooprs::utils::test_utils::normalization::{closure#0} as core::ops::function::FnOnce<()>>::call_once
  199. 43.00 s gammaloop-nextest-core> note: Some details are omitted, run with `RUST_BACKTRACE=full` for a verbose backtrace.
  200. 43.00 s gammaloop-nextest-core> =========================================
  201. 43.18 s [0 built (1 failed)]error: Cannot build '/nix/store/l52j9zy411yz62lvl4219gkr5z2l9zhq-gammaloop-nextest-core.drv'.
  202. 43.18 s Reason: builder failed with exit code 100.
  203. 43.18 s Output paths:
  204. 43.18 s /nix/store/bafxvy9fy868lgw50y1gdd9zrfk0pb6a-gammaloop-nextest-core
  205. 43.18 s Last 176 log lines:
  206. 43.18 s > Extracting 4 binaries (including 2 non-test binaries), 1 build script output directory, and 2 linked paths to /build/source
  207. 43.18 s > Extracted 20 files to /build/source in 0.52s
  208. 43.18 s > ------------
  209. 43.18 s > Nextest run ID 17fdbd31-234c-4c6b-8142-0114370e1834 with nextest profile: ci_gammaloop
  210. 43.18 s > Starting 341 tests across 2 binaries (1 test skipped)
  211. 43.18 s > ------------
  212. 43.18 s > Summary [ 0.419s] 341 tests run: 341 passed, 1 skipped
  213. 43.18 s >
  214. 43.18 s > ========== nextest test summary ==========
  215. 43.18 s > report: target/nextest/ci_gammaloop/junit.xml
  216. 43.18 s > tests: 341, failures: 0, errors: 0
  217. 43.18 s > No failing testcases found.
  218. 43.18 s > =========================================
  219. 43.18 s > Extracting 1 binary and 1 linked path to /build/source
  220. 43.18 s > Extracted 7 files to /build/source in 0.08s
  221. 43.18 s > ------------
  222. 43.18 s > Nextest run ID 6601a9a5-25c1-48ab-a01f-a10f35c56bc0 with nextest profile: ci_gammaloop
  223. 43.18 s > Starting 19 tests across 1 binary
  224. 43.18 s > ------------
  225. 43.18 s > Summary [ 0.012s] 19 tests run: 19 passed, 0 skipped
  226. 43.18 s >
  227. 43.18 s > ========== nextest test summary ==========
  228. 43.18 s > report: target/nextest/ci_gammaloop/junit.xml
  229. 43.18 s > tests: 19, failures: 0, errors: 0
  230. 43.18 s > No failing testcases found.
  231. 43.18 s > =========================================
  232. 43.18 s > Extracting 1 binary to /build/source
  233. 43.18 s > Extracted 4 files to /build/source in 0.04s
  234. 43.18 s > ------------
  235. 43.18 s > Nextest run ID 59c61a08-f857-45d2-b6e7-8b924e7e404a with nextest profile: ci_gammaloop
  236. 43.18 s > Starting 0 tests across 1 binary
  237. 43.18 s > ------------
  238. 43.18 s > Summary [ 0.000s] 0 tests run: 0 passed, 0 skipped
  239. 43.18 s >
  240. 43.18 s > ========== nextest test summary ==========
  241. 43.18 s > report: target/nextest/ci_gammaloop/junit.xml
  242. 43.18 s > tests: 0, failures: 0, errors: 0
  243. 43.18 s > No failing testcases found.
  244. 43.18 s > =========================================
  245. 43.18 s > Extracting 4 binaries (including 1 non-test binary), 1 build script output directory, and 2 linked paths to /build/source
  246. 43.18 s > Extracted 19 files to /build/source in 0.50s
  247. 43.18 s > ------------
  248. 43.18 s > Nextest run ID 7f54f609-78d6-47c5-8e75-4a3735dfa5f6 with nextest profile: ci_gammaloop
  249. 43.18 s > Starting 421 tests across 3 binaries (31 tests skipped, including 30 tests via profile.ci_gammaloop.default-filter)
  250. 43.18 s > FAIL [ 0.051s] (365/421) gammalooprs utils::test_utils::normalization
  251. 43.18 s > stdout ---
  252. 43.18 s >
  253. 43.18 s > running 1 test
  254. 43.18 s > ━━━━━━━━━━━━━━━━━━━━━━━━━━━━━━━ Snapshot Summary ━━━━━━━━━━━━━━━━━━━━━━━━━━━━━━━
  255. 43.18 s > Snapshot: normalization-2
  256. 43.18 s > Source: crates/gammalooprs/src/utils/test_utils.rs:44
  257. 43.18 s > ────────────────────────────────────────────────────────────────────────────────
  258. 43.18 s > Expression: b.to_canonical_string()
  259. 43.18 s > ────────────────────────────────────────────────────────────────────────────────
  260. 43.18 s > -old snapshot
  261. 43.18 s > +new results
  262. 43.18 s > ────────────┬───────────────────────────────────────────────────────────────────
  263. 43.18 s > 1 │-gammalooprs::{spenso::rank1,spenso::tensor}::Q(1,spenso::{}::cind(1))
  264. 43.18 s > 1 │+gammalooprs::{spenso::rank1,spenso::tensor,spenso::tensor-label:q}::Q(1,spenso::{}::cind(1))
  265. 43.18 s > ────────────┴───────────────────────────────────────────────────────────────────
  266. 43.18 s > To update snapshots run `cargo insta review`
  267. 43.18 s > Stopped on the first failure. Run `cargo insta test` to run all snapshots.
  268. 43.18 s > test utils::test_utils::normalization ... FAILED
  269. 43.18 s >
  270. 43.18 s > failures:
  271. 43.18 s >
  272. 43.18 s > failures:
  273. 43.18 s > utils::test_utils::normalization
  274. 43.18 s >
  275. 43.18 s > test result: FAILED. 0 passed; 1 failed; 0 ignored; 0 measured; 445 filtered out; finished in 0.04s
  276. 43.18 s >
  277. 43.18 s > stderr ---
  278. 43.18 s >
  279. 43.18 s > thread 'utils::test_utils::normalization' (2239) panicked at /nix/store/c7lwckzlfrfsdw1ay0aqz4dpc2j7ry8d-vendor-cargo-deps/c19b7c6f923b580ac259164a89f2577984ad5ab09ee9d583b888f934adbbe8d0/insta-1.47.2/src/runtime.rs:719:13:
  280. 43.18 s > snapshot assertion for 'normalization-2' failed in line 44
  281. 43.18 s > stack backtrace:
  282. 43.18 s > 0: __rustc::rust_begin_unwind
  283. 43.18 s > 1: core::panicking::panic_fmt
  284. 43.18 s > 2: insta::runtime::assert_snapshot
  285. 43.18 s > 3: gammalooprs::utils::test_utils::normalization
  286. 43.18 s > 4: <gammalooprs::utils::test_utils::normalization::{closure#0} as core::ops::function::FnOnce<()>>::call_once
  287. 43.18 s > note: Some details are omitted, run with `RUST_BACKTRACE=full` for a verbose backtrace.
  288. 43.18 s >
  289. 43.18 s > ------------
  290. 43.18 s > Summary [ 6.512s] 421 tests run: 420 passed, 1 failed, 31 skipped
  291. 43.18 s > FAIL [ 0.051s] (365/421) gammalooprs utils::test_utils::normalization
  292. 43.18 s > stdout ---
  293. 43.18 s >
  294. 43.18 s > running 1 test
  295. 43.18 s > ━━━━━━━━━━━━━━━━━━━━━━━━━━━━━━━ Snapshot Summary ━━━━━━━━━━━━━━━━━━━━━━━━━━━━━━━
  296. 43.18 s > Snapshot: normalization-2
  297. 43.18 s > Source: crates/gammalooprs/src/utils/test_utils.rs:44
  298. 43.18 s > ────────────────────────────────────────────────────────────────────────────────
  299. 43.18 s > Expression: b.to_canonical_string()
  300. 43.18 s > ────────────────────────────────────────────────────────────────────────────────
  301. 43.18 s > -old snapshot
  302. 43.18 s > +new results
  303. 43.18 s > ────────────┬───────────────────────────────────────────────────────────────────
  304. 43.18 s > 1 │-gammalooprs::{spenso::rank1,spenso::tensor}::Q(1,spenso::{}::cind(1))
  305. 43.18 s > 1 │+gammalooprs::{spenso::rank1,spenso::tensor,spenso::tensor-label:q}::Q(1,spenso::{}::cind(1))
  306. 43.18 s > ────────────┴───────────────────────────────────────────────────────────────────
  307. 43.18 s > To update snapshots run `cargo insta review`
  308. 43.18 s > Stopped on the first failure. Run `cargo insta test` to run all snapshots.
  309. 43.18 s > test utils::test_utils::normalization ... FAILED
  310. 43.18 s >
  311. 43.18 s > failures:
  312. 43.18 s >
  313. 43.18 s > failures:
  314. 43.18 s > utils::test_utils::normalization
  315. 43.18 s >
  316. 43.18 s > test result: FAILED. 0 passed; 1 failed; 0 ignored; 0 measured; 445 filtered out; finished in 0.04s
  317. 43.18 s >
  318. 43.18 s > stderr ---
  319. 43.18 s >
  320. 43.18 s > thread 'utils::test_utils::normalization' (2239) panicked at /nix/store/c7lwckzlfrfsdw1ay0aqz4dpc2j7ry8d-vendor-cargo-deps/c19b7c6f923b580ac259164a89f2577984ad5ab09ee9d583b888f934adbbe8d0/insta-1.47.2/src/runtime.rs:719:13:
  321. 43.18 s > snapshot assertion for 'normalization-2' failed in line 44
  322. 43.18 s > stack backtrace:
  323. 43.18 s > 0: __rustc::rust_begin_unwind
  324. 43.18 s > 1: core::panicking::panic_fmt
  325. 43.18 s > 2: insta::runtime::assert_snapshot
  326. 43.18 s > 3: gammalooprs::utils::test_utils::normalization
  327. 43.18 s > 4: <gammalooprs::utils::test_utils::normalization::{closure#0} as core::ops::function::FnOnce<()>>::call_once
  328. 43.18 s > note: Some details are omitted, run with `RUST_BACKTRACE=full` for a verbose backtrace.
  329. 43.18 s >
  330. 43.18 s > error: test run failed
  331. 43.18 s >
  332. 43.18 s > ========== nextest test summary ==========
  333. 43.18 s > report: target/nextest/ci_gammaloop/junit.xml
  334. 43.18 s > tests: 421, failures: 1, errors: 0
  335. 43.18 s >
  336. 43.18 s > 1. gammalooprs::utils::test_utils::normalization
  337. 43.18 s > failure: test failure with exit code 101
  338. 43.18 s > thread 'utils::test_utils::normalization' (2239) panicked at /nix/store/c7lwckzlfrfsdw1ay0aqz4dpc2j7ry8d-vendor-cargo-deps/c19b7c6f923b580ac259164a89f2577984ad5ab09ee9d583b888f934adbbe8d0/insta-1.47.2/src/runtime.rs:719:13:
  339. 43.18 s > snapshot assertion for 'normalization-2' failed in line 44
  340. 43.18 s > stack backtrace:
  341. 43.18 s > 0: __rustc::rust_begin_unwind
  342. 43.18 s > 1: core::panicking::panic_fmt
  343. 43.18 s > 2: insta::runtime::assert_snapshot
  344. 43.18 s > 3: gammalooprs::utils::test_utils::normalization
  345. 43.18 s > 4: <gammalooprs::utils::test_utils::normalization::{closure#0} as core::ops::function::FnOnce<()>>::call_once
  346. 43.18 s > note: Some details are omitted, run with `RUST_BACKTRACE=full` for a verbose backtrace.
  347. 43.18 s > system-out
  348. 43.18 s > running 1 test
  349. 43.18 s > ━━━━━━━━━━━━━━━━━━━━━━━━━━━━━━━ Snapshot Summary ━━━━━━━━━━━━━━━━━━━━━━━━━━━━━━━
  350. 43.18 s > Snapshot: normalization-2
  351. 43.18 s > Source: crates/gammalooprs/src/utils/test_utils.rs:44
  352. 43.18 s > ────────────────────────────────────────────────────────────────────────────────
  353. 43.18 s > Expression: b.to_canonical_string()
  354. 43.18 s > ────────────────────────────────────────────────────────────────────────────────
  355. 43.18 s > -old snapshot
  356. 43.18 s > +new results
  357. 43.18 s > ────────────┬───────────────────────────────────────────────────────────────────
  358. 43.18 s > 1 │-gammalooprs::{spenso::rank1,spenso::tensor}::Q(1,spenso::{}::cind(1))
  359. 43.18 s > 1 │+gammalooprs::{spenso::rank1,spenso::tensor,spenso::tensor-label:q}::Q(1,spenso::{}::cind(1))
  360. 43.18 s > ────────────┴───────────────────────────────────────────────────────────────────
  361. 43.18 s > To update snapshots run `cargo insta review`
  362. 43.18 s > Stopped on the first failure. Run `cargo insta test` to run all snapshots.
  363. 43.18 s > test utils::test_utils::normalization ... FAILED
  364. 43.18 s >
  365. 43.18 s > failures:
  366. 43.18 s >
  367. 43.18 s > failures:
  368. 43.18 s > utils::test_utils::normalization
  369. 43.18 s >
  370. 43.18 s > test result: FAILED. 0 passed; 1 failed; 0 ignored; 0 measured; 445 filtered out; finished in 0.04s
  371. 43.18 s > system-err
  372. 43.18 s > thread 'utils::test_utils::normalization' (2239) panicked at /nix/store/c7lwckzlfrfsdw1ay0aqz4dpc2j7ry8d-vendor-cargo-deps/c19b7c6f923b580ac259164a89f2577984ad5ab09ee9d583b888f934adbbe8d0/insta-1.47.2/src/runtime.rs:719:13:
  373. 43.18 s > snapshot assertion for 'normalization-2' failed in line 44
  374. 43.18 s > stack backtrace:
  375. 43.18 s > 0: __rustc::rust_begin_unwind
  376. 43.18 s > 1: core::panicking::panic_fmt
  377. 43.18 s > 2: insta::runtime::assert_snapshot
  378. 43.18 s > 3: gammalooprs::utils::test_utils::normalization
  379. 43.18 s > 4: <gammalooprs::utils::test_utils::normalization::{closure#0} as core::ops::function::FnOnce<()>>::call_once
  380. 43.18 s > note: Some details are omitted, run with `RUST_BACKTRACE=full` for a verbose backtrace.
  381. 43.18 s > =========================================
  382. 43.18 s For full logs, run:
  383. 43.18 s nix log /nix/store/l52j9zy411yz62lvl4219gkr5z2l9zhq-gammaloop-nextest-core.drv
  384. 43.35 s Run failed.