1. 0.00 s $ /nix/store/61685rbaxmpigwi3z23i33sv3jyfl70q-coreutils-9.11/bin/timeout --kill-after=15s 7200s /nix/store/wknkybkzrc16r11vk5vrykh4wmw7a353-nix-2.34.8/bin/nix --extra-experimental-features nix-command --extra-experimental-features flakes flake clone git+https://github.com/alphal00p/gammaloop --dest /tmp/nix-ci-worker/stable-pwd/repo/
  2. 0.09 s Cloning into '/tmp/nix-ci-worker/stable-pwd/repo'...
  3. 0.80 s remote: Enumerating objects: 103100, done.
  4. 0.90 s remote: Counting objects: 0% (1/9493) remote: Counting objects: 1% (95/9493) remote: Counting objects: 2% (190/9493) remote: Counting objects: 3% (285/9493) remote: Counting objects: 4% (380/9493) remote: Counting objects: 5% (475/9493) remote: Counting objects: 6% (570/9493) remote: Counting objects: 7% (665/9493) remote: Counting objects: 8% (760/9493) remote: Counting objects: 9% (855/9493) remote: Counting objects: 10% (950/9493) remote: Counting objects: 11% (1045/9493) remote: Counting objects: 12% (1140/9493) remote: Counting objects: 13% (1235/9493) remote: Counting objects: 14% (1330/9493) remote: Counting objects: 15% (1424/9493) remote: Counting objects: 16% (1519/9493) remote: Counting objects: 17% (1614/9493) remote: Counting objects: 18% (1709/9493) remote: Counting objects: 19% (1804/9493) remote: Counting objects: 20% (1899/9493) remote: Counting objects: 21% (1994/9493) remote: Counting objects: 22% (2089/9493) remote: Counting objects: 23% (2184/9493) remote: Counting objects: 24% (2279/9493) remote: Counting objects: 25% (2374/9493) remote: Counting objects: 26% (2469/9493) remote: Counting objects: 27% (2564/9493) remote: Counting objects: 28% (2659/9493) remote: Counting objects: 29% (2753/9493) remote: Counting objects: 30% (2848/9493) remote: Counting objects: 31% (2943/9493) remote: Counting objects: 32% (3038/9493) remote: Counting objects: 33% (3133/9493) remote: Counting objects: 34% (3228/9493) remote: Counting objects: 35% (3323/9493) remote: Counting objects: 36% (3418/9493) remote: Counting objects: 37% (3513/9493) remote: Counting objects: 38% (3608/9493) remote: Counting objects: 39% (3703/9493) remote: Counting objects: 40% (3798/9493) remote: Counting objects: 41% (3893/9493) remote: Counting objects: 42% (3988/9493) remote: Counting objects: 43% (4082/9493) remote: Counting objects: 44% (4177/9493) remote: Counting objects: 45% (4272/9493) remote: Counting objects: 46% (4367/9493) remote: Counting objects: 47% (4462/9493) remote: Counting objects: 48% (4557/9493) remote: Counting objects: 49% (4652/9493) remote: Counting objects: 50% (4747/9493) remote: Counting objects: 51% (4842/9493) remote: Counting objects: 52% (4937/9493) remote: Counting objects: 53% (5032/9493) remote: Counting objects: 54% (5127/9493) remote: Counting objects: 55% (5222/9493) remote: Counting objects: 56% (5317/9493) remote: Counting objects: 57% (5412/9493) remote: Counting objects: 58% (5506/9493) remote: Counting objects: 59% (5601/9493) remote: Counting objects: 60% (5696/9493) remote: Counting objects: 61% (5791/9493) remote: Counting objects: 62% (5886/9493) remote: Counting objects: 63% (5981/9493) remote: Counting objects: 64% (6076/9493) remote: Counting objects: 65% (6171/9493) remote: Counting objects: 66% (6266/9493) remote: Counting objects: 67% (6361/9493) remote: Counting objects: 68% (6456/9493) remote: Counting objects: 69% (6551/9493) remote: Counting objects: 70% (6646/9493) remote: Counting objects: 71% (6741/9493) remote: Counting objects: 72% (6835/9493) remote: Counting objects: 73% (6930/9493) remote: Counting objects: 74% (7025/9493) remote: Counting objects: 75% (7120/9493) remote: Counting objects: 76% (7215/9493) remote: Counting objects: 77% (7310/9493) remote: Counting objects: 78% (7405/9493) remote: Counting objects: 79% (7500/9493) remote: Counting objects: 80% (7595/9493) remote: Counting objects: 81% (7690/9493) remote: Counting objects: 82% (7785/9493) remote: Counting objects: 83% (7880/9493) remote: Counting objects: 84% (7975/9493) remote: Counting objects: 85% (8070/9493) remote: Counting objects: 86% (8164/9493) remote: Counting objects: 87% (8259/9493) remote: Counting objects: 88% (8354/9493) remote: Counting objects: 89% (8449/9493) remote: Counting objects: 90% (8544/9493) remote: Counting objects: 91% (8639/9493) remote: Counting objects: 92% (8734/9493) remote: Counting objects: 93% (8829/9493) remote: Counting objects: 94% (8924/9493) remote: Counting objects: 95% (9019/9493) remote: Counting objects: 96% (9114/9493) remote: Counting objects: 97% (9209/9493) remote: Counting objects: 98% (9304/9493) remote: Counting objects: 99% (9399/9493) remote: Counting objects: 100% (9493/9493) remote: Counting objects: 100% (9493/9493), done.
  5. 3.38 s remote: Compressing objects: 0% (1/2066) remote: Compressing objects: 1% (21/2066) remote: Compressing objects: 2% (42/2066) remote: Compressing objects: 3% (62/2066) remote: Compressing objects: 4% (83/2066) remote: Compressing objects: 5% (104/2066) remote: Compressing objects: 6% (124/2066) remote: Compressing objects: 7% (145/2066) remote: Compressing objects: 7% (155/2066) remote: Compressing objects: 8% (166/2066) remote: Compressing objects: 9% (186/2066) remote: Compressing objects: 10% (207/2066) remote: Compressing objects: 11% (228/2066) remote: Compressing objects: 12% (248/2066) remote: Compressing objects: 13% (269/2066) remote: Compressing objects: 14% (290/2066) remote: Compressing objects: 15% (310/2066) remote: Compressing objects: 16% (331/2066) remote: Compressing objects: 16% (338/2066) remote: Compressing objects: 17% (352/2066) remote: Compressing objects: 18% (372/2066) remote: Compressing objects: 19% (393/2066) remote: Compressing objects: 20% (414/2066) remote: Compressing objects: 21% (434/2066) remote: Compressing objects: 22% (455/2066) remote: Compressing objects: 23% (476/2066) remote: Compressing objects: 24% (496/2066) remote: Compressing objects: 25% (517/2066) remote: Compressing objects: 26% (538/2066) remote: Compressing objects: 27% (558/2066) remote: Compressing objects: 28% (579/2066) remote: Compressing objects: 29% (600/2066) remote: Compressing objects: 30% (620/2066) remote: Compressing objects: 31% (641/2066) remote: Compressing objects: 32% (662/2066) remote: Compressing objects: 33% (682/2066) remote: Compressing objects: 34% (703/2066) remote: Compressing objects: 35% (724/2066) remote: Compressing objects: 36% (744/2066) remote: Compressing objects: 37% (765/2066) remote: Compressing objects: 38% (786/2066) remote: Compressing objects: 39% (806/2066) remote: Compressing objects: 40% (827/2066) remote: Compressing objects: 41% (848/2066) remote: Compressing objects: 42% (868/2066) remote: Compressing objects: 43% (889/2066) remote: Compressing objects: 44% (910/2066) remote: Compressing objects: 45% (930/2066) remote: Compressing objects: 46% (951/2066) remote: Compressing objects: 47% (972/2066) remote: Compressing objects: 48% (992/2066) remote: Compressing objects: 49% (1013/2066) remote: Compressing objects: 50% (1033/2066) remote: Compressing objects: 51% (1054/2066) remote: Compressing objects: 52% (1075/2066) remote: Compressing objects: 53% (1095/2066) remote: Compressing objects: 54% (1116/2066) remote: Compressing objects: 55% (1137/2066) remote: Compressing objects: 56% (1157/2066) remote: Compressing objects: 57% (1178/2066) remote: Compressing objects: 58% (1199/2066) remote: Compressing objects: 59% (1219/2066) remote: Compressing objects: 60% (1240/2066) remote: Compressing objects: 61% (1261/2066) remote: Compressing objects: 62% (1281/2066) remote: Compressing objects: 63% (1302/2066) remote: Compressing objects: 64% (1323/2066) remote: Compressing objects: 65% (1343/2066) remote: Compressing objects: 66% (1364/2066) remote: Compressing objects: 67% (1385/2066) remote: Compressing objects: 68% (1405/2066) remote: Compressing objects: 69% (1426/2066) remote: Compressing objects: 70% (1447/2066) remote: Compressing objects: 71% (1467/2066) remote: Compressing objects: 72% (1488/2066) remote: Compressing objects: 73% (1509/2066) remote: Compressing objects: 74% (1529/2066) remote: Compressing objects: 75% (1550/2066) remote: Compressing objects: 76% (1571/2066) remote: Compressing objects: 77% (1591/2066) remote: Compressing objects: 78% (1612/2066) remote: Compressing objects: 79% (1633/2066) remote: Compressing objects: 80% (1653/2066) remote: Compressing objects: 81% (1674/2066) remote: Compressing objects: 82% (1695/2066) remote: Compressing objects: 83% (1715/2066) remote: Compressing objects: 84% (1736/2066) remote: Compressing objects: 85% (1757/2066) remote: Compressing objects: 86% (1777/2066) remote: Compressing objects: 87% (1798/2066) remote: Compressing objects: 88% (1819/2066) remote: Compressing objects: 89% (1839/2066) remote: Compressing objects: 90% (1860/2066) remote: Compressing objects: 91% (1881/2066) remote: Compressing objects: 92% (1901/2066) remote: Compressing objects: 93% (1922/2066) remote: Compressing objects: 94% (1943/2066) remote: Compressing objects: 95% (1963/2066) remote: Compressing objects: 96% (1984/2066) remote: Compressing objects: 97% (2005/2066) remote: Compressing objects: 98% (2025/2066) remote: Compressing objects: 99% (2046/2066) remote: Compressing objects: 100% (2066/2066) remote: Compressing objects: 100% (2066/2066), done.
  6. 15.91 s Receiving objects: 0% (1/103100) Receiving objects: 1% (1031/103100) Receiving objects: 2% (2062/103100) Receiving objects: 3% (3093/103100) Receiving objects: 4% (4124/103100) Receiving objects: 5% (5155/103100) Receiving objects: 6% (6186/103100) Receiving objects: 7% (7217/103100), 15.03 MiB | 30.04 MiB/s Receiving objects: 8% (8248/103100), 15.03 MiB | 30.04 MiB/s Receiving objects: 9% (9279/103100), 15.03 MiB | 30.04 MiB/s Receiving objects: 10% (10310/103100), 15.03 MiB | 30.04 MiB/s Receiving objects: 11% (11341/103100), 15.03 MiB | 30.04 MiB/s Receiving objects: 12% (12372/103100), 15.03 MiB | 30.04 MiB/s Receiving objects: 13% (13403/103100), 15.03 MiB | 30.04 MiB/s Receiving objects: 14% (14434/103100), 15.03 MiB | 30.04 MiB/s Receiving objects: 15% (15465/103100), 15.03 MiB | 30.04 MiB/s Receiving objects: 16% (16496/103100), 15.03 MiB | 30.04 MiB/s Receiving objects: 17% (17527/103100), 15.03 MiB | 30.04 MiB/s Receiving objects: 18% (18558/103100), 15.03 MiB | 30.04 MiB/s Receiving objects: 19% (19589/103100), 15.03 MiB | 30.04 MiB/s Receiving objects: 20% (20620/103100), 15.03 MiB | 30.04 MiB/s Receiving objects: 21% (21651/103100), 15.03 MiB | 30.04 MiB/s Receiving objects: 22% (22682/103100), 15.03 MiB | 30.04 MiB/s Receiving objects: 23% (23713/103100), 15.03 MiB | 30.04 MiB/s Receiving objects: 24% (24744/103100), 15.03 MiB | 30.04 MiB/s Receiving objects: 25% (25775/103100), 15.03 MiB | 30.04 MiB/s Receiving objects: 26% (26806/103100), 15.03 MiB | 30.04 MiB/s Receiving objects: 27% (27837/103100), 15.03 MiB | 30.04 MiB/s Receiving objects: 28% (28868/103100), 15.03 MiB | 30.04 MiB/s Receiving objects: 29% (29899/103100), 15.03 MiB | 30.04 MiB/s Receiving objects: 30% (30930/103100), 15.03 MiB | 30.04 MiB/s Receiving objects: 31% (31961/103100), 15.03 MiB | 30.04 MiB/s Receiving objects: 32% (32992/103100), 15.03 MiB | 30.04 MiB/s Receiving objects: 33% (34023/103100), 15.03 MiB | 30.04 MiB/s Receiving objects: 33% (34351/103100), 32.99 MiB | 32.98 MiB/s Receiving objects: 34% (35054/103100), 32.99 MiB | 32.98 MiB/s Receiving objects: 35% (36085/103100), 32.99 MiB | 32.98 MiB/s Receiving objects: 36% (37116/103100), 32.99 MiB | 32.98 MiB/s Receiving objects: 37% (38147/103100), 32.99 MiB | 32.98 MiB/s Receiving objects: 38% (39178/103100), 32.99 MiB | 32.98 MiB/s Receiving objects: 39% (40209/103100), 32.99 MiB | 32.98 MiB/s Receiving objects: 40% (41240/103100), 48.06 MiB | 32.03 MiB/s Receiving objects: 41% (42271/103100), 48.06 MiB | 32.03 MiB/s Receiving objects: 42% (43302/103100), 48.06 MiB | 32.03 MiB/s Receiving objects: 43% (44333/103100), 48.06 MiB | 32.03 MiB/s Receiving objects: 44% (45364/103100), 48.06 MiB | 32.03 MiB/s Receiving objects: 45% (46395/103100), 48.06 MiB | 32.03 MiB/s Receiving objects: 46% (47426/103100), 48.06 MiB | 32.03 MiB/s Receiving objects: 47% (48457/103100), 48.06 MiB | 32.03 MiB/s Receiving objects: 47% (48736/103100), 63.87 MiB | 31.93 MiB/s Receiving objects: 48% (49488/103100), 63.87 MiB | 31.93 MiB/s Receiving objects: 49% (50519/103100), 63.87 MiB | 31.93 MiB/s Receiving objects: 50% (51550/103100), 63.87 MiB | 31.93 MiB/s Receiving objects: 51% (52581/103100), 63.87 MiB | 31.93 MiB/s Receiving objects: 52% (53612/103100), 75.97 MiB | 30.39 MiB/s Receiving objects: 53% (54643/103100), 75.97 MiB | 30.39 MiB/s Receiving objects: 54% (55674/103100), 75.97 MiB | 30.39 MiB/s Receiving objects: 55% (56705/103100), 75.97 MiB | 30.39 MiB/s Receiving objects: 55% (57055/103100), 88.06 MiB | 29.34 MiB/s Receiving objects: 55% (57102/103100), 116.30 MiB | 29.04 MiB/s Receiving objects: 55% (57227/103100), 149.24 MiB | 29.80 MiB/s Receiving objects: 56% (57736/103100), 149.24 MiB | 29.80 MiB/s Receiving objects: 57% (58767/103100), 164.14 MiB | 29.11 MiB/s Receiving objects: 58% (59798/103100), 164.14 MiB | 29.11 MiB/s Receiving objects: 59% (60829/103100), 164.14 MiB | 29.11 MiB/s Receiving objects: 60% (61860/103100), 164.14 MiB | 29.11 MiB/s Receiving objects: 61% (62891/103100), 164.14 MiB | 29.11 MiB/s Receiving objects: 61% (63491/103100), 178.21 MiB | 28.88 MiB/s Receiving objects: 62% (63922/103100), 178.21 MiB | 28.88 MiB/s Receiving objects: 63% (64953/103100), 178.21 MiB | 28.88 MiB/s Receiving objects: 64% (65984/103100), 178.21 MiB | 28.88 MiB/s Receiving objects: 65% (67015/103100), 178.21 MiB | 28.88 MiB/s Receiving objects: 66% (68046/103100), 178.21 MiB | 28.88 MiB/s Receiving objects: 67% (69077/103100), 192.57 MiB | 28.56 MiB/s Receiving objects: 68% (70108/103100), 192.57 MiB | 28.56 MiB/s Receiving objects: 69% (71139/103100), 192.57 MiB | 28.56 MiB/s Receiving objects: 70% (72170/103100), 192.57 MiB | 28.56 MiB/s Receiving objects: 71% (73201/103100), 192.57 MiB | 28.56 MiB/s Receiving objects: 72% (74232/103100), 192.57 MiB | 28.56 MiB/s Receiving objects: 73% (75263/103100), 192.57 MiB | 28.56 MiB/s Receiving objects: 73% (75698/103100), 192.57 MiB | 28.56 MiB/s Receiving objects: 74% (76294/103100), 205.93 MiB | 28.84 MiB/s Receiving objects: 75% (77325/103100), 219.32 MiB | 29.14 MiB/s Receiving objects: 76% (78356/103100), 219.32 MiB | 29.14 MiB/s Receiving objects: 77% (79387/103100), 219.32 MiB | 29.14 MiB/s Receiving objects: 77% (79586/103100), 236.08 MiB | 30.11 MiB/s Receiving objects: 78% (80418/103100), 236.08 MiB | 30.11 MiB/s Receiving objects: 79% (81449/103100), 236.08 MiB | 30.11 MiB/s Receiving objects: 80% (82480/103100), 236.08 MiB | 30.11 MiB/s Receiving objects: 81% (83511/103100), 236.08 MiB | 30.11 MiB/s Receiving objects: 81% (84187/103100), 268.76 MiB | 30.01 MiB/s Receiving objects: 81% (84526/103100), 284.10 MiB | 29.95 MiB/s Receiving objects: 82% (84542/103100), 302.19 MiB | 30.67 MiB/s Receiving objects: 83% (85573/103100), 319.95 MiB | 31.49 MiB/s Receiving objects: 84% (86604/103100), 319.95 MiB | 31.49 MiB/s Receiving objects: 85% (87635/103100), 319.95 MiB | 31.49 MiB/s Receiving objects: 86% (88666/103100), 319.95 MiB | 31.49 MiB/s Receiving objects: 86% (89252/103100), 319.95 MiB | 31.49 MiB/s Receiving objects: 87% (89697/103100), 337.56 MiB | 32.21 MiB/s Receiving objects: 88% (90728/103100), 337.56 MiB | 32.21 MiB/s Receiving objects: 89% (91759/103100), 354.67 MiB | 33.04 MiB/s Receiving objects: 89% (91771/103100), 372.54 MiB | 34.04 MiB/s Receiving objects: 90% (92790/103100), 372.54 MiB | 34.04 MiB/s Receiving objects: 91% (93821/103100), 372.54 MiB | 34.04 MiB/s Receiving objects: 92% (94852/103100), 372.54 MiB | 34.04 MiB/s Receiving objects: 93% (95883/103100), 372.54 MiB | 34.04 MiB/s Receiving objects: 94% (96914/103100), 372.54 MiB | 34.04 MiB/s Receiving objects: 95% (97945/103100), 372.54 MiB | 34.04 MiB/s Receiving objects: 96% (98976/103100), 372.54 MiB | 34.04 MiB/s Receiving objects: 97% (100007/103100), 372.54 MiB | 34.04 MiB/s Receiving objects: 98% (101038/103100), 372.54 MiB | 34.04 MiB/s Receiving objects: 99% (102069/103100), 372.54 MiB | 34.04 MiB/s remote: Total 103100 (delta 8196), reused 7516 (delta 7415), pack-reused 93607 (from 4)
  7. 15.91 s Receiving objects: 100% (103100/103100), 390.80 MiB | 34.38 MiB/s Receiving objects: 100% (103100/103100), 391.59 MiB | 31.25 MiB/s, done.
  8. 17.16 s Resolving deltas: 0% (0/67551) Resolving deltas: 1% (676/67551) Resolving deltas: 2% (1353/67551) Resolving deltas: 3% (2029/67551) Resolving deltas: 4% (2703/67551) Resolving deltas: 5% (3378/67551) Resolving deltas: 6% (4054/67551) Resolving deltas: 7% (4729/67551) Resolving deltas: 8% (5405/67551) Resolving deltas: 9% (6080/67551) Resolving deltas: 10% (6757/67551) Resolving deltas: 11% (7432/67551) Resolving deltas: 12% (8107/67551) Resolving deltas: 13% (8782/67551) Resolving deltas: 14% (9458/67551) Resolving deltas: 15% (10133/67551) Resolving deltas: 16% (10809/67551) Resolving deltas: 17% (11484/67551) Resolving deltas: 18% (12160/67551) Resolving deltas: 19% (12835/67551) Resolving deltas: 20% (13511/67551) Resolving deltas: 21% (14186/67551) Resolving deltas: 22% (14862/67551) Resolving deltas: 23% (15537/67551) Resolving deltas: 24% (16213/67551) Resolving deltas: 25% (16888/67551) Resolving deltas: 26% (17564/67551) Resolving deltas: 27% (18239/67551) Resolving deltas: 28% (18915/67551) Resolving deltas: 29% (19591/67551) Resolving deltas: 30% (20266/67551) Resolving deltas: 31% (20941/67551) Resolving deltas: 32% (21617/67551) Resolving deltas: 33% (22293/67551) Resolving deltas: 34% (22968/67551) Resolving deltas: 35% (23643/67551) Resolving deltas: 36% (24319/67551) Resolving deltas: 37% (24994/67551) Resolving deltas: 38% (25670/67551) Resolving deltas: 39% (26345/67551) Resolving deltas: 40% (27021/67551) Resolving deltas: 41% (27697/67551) Resolving deltas: 42% (28372/67551) Resolving deltas: 43% (29047/67551) Resolving deltas: 44% (29723/67551) Resolving deltas: 45% (30398/67551) Resolving deltas: 46% (31074/67551) Resolving deltas: 47% (31749/67551) Resolving deltas: 48% (32425/67551) Resolving deltas: 49% (33100/67551) Resolving deltas: 50% (33776/67551) Resolving deltas: 51% (34452/67551) Resolving deltas: 52% (35127/67551) Resolving deltas: 53% (35803/67551) Resolving deltas: 54% (36480/67551) Resolving deltas: 55% (37156/67551) Resolving deltas: 56% (37829/67551) Resolving deltas: 57% (38506/67551) Resolving deltas: 58% (39180/67551) Resolving deltas: 59% (39856/67551) Resolving deltas: 60% (40531/67551) Resolving deltas: 61% (41207/67551) Resolving deltas: 62% (41882/67551) Resolving deltas: 63% (42558/67551) Resolving deltas: 64% (43233/67551) Resolving deltas: 65% (43909/67551) Resolving deltas: 66% (44585/67551) Resolving deltas: 67% (45260/67551) Resolving deltas: 68% (45937/67551) Resolving deltas: 69% (46611/67551) Resolving deltas: 70% (47286/67551) Resolving deltas: 71% (47962/67551) Resolving deltas: 72% (48637/67551) Resolving deltas: 73% (49313/67551) Resolving deltas: 74% (49988/67551) Resolving deltas: 75% (50664/67551) Resolving deltas: 76% (51339/67551) Resolving deltas: 77% (52015/67551) Resolving deltas: 78% (52692/67551) Resolving deltas: 79% (53366/67551) Resolving deltas: 79% (53858/67551) Resolving deltas: 80% (54041/67551) Resolving deltas: 81% (54717/67551) Resolving deltas: 82% (55392/67551) Resolving deltas: 83% (56068/67551) Resolving deltas: 84% (56743/67551) Resolving deltas: 85% (57419/67551) Resolving deltas: 86% (58094/67551) Resolving deltas: 87% (58770/67551) Resolving deltas: 88% (59446/67551) Resolving deltas: 89% (60121/67551) Resolving deltas: 90% (60796/67551) Resolving deltas: 91% (61472/67551) Resolving deltas: 92% (62147/67551) Resolving deltas: 93% (62823/67551) Resolving deltas: 94% (63498/67551) Resolving deltas: 95% (64175/67551) Resolving deltas: 96% (64849/67551) Resolving deltas: 97% (65525/67551) Resolving deltas: 98% (66200/67551) Resolving deltas: 99% (66878/67551) Resolving deltas: 100% (67551/67551) Resolving deltas: 100% (67551/67551), done.
  9. 17.71 s Fetching commit e825dd904bec36e475ba5e4734659c1f4762247e for feynkit ...
  10. 17.71 s $ /nix/store/5vpcfsdx1lcnlb2y4k7xyc74shp5qwbh-git-2.54.0/bin/git fetch origin e825dd904bec36e475ba5e4734659c1f4762247e
  11. 18.17 s From https://github.com/alphal00p/gammaloop
  12. 18.17 s * branch e825dd904bec36e475ba5e4734659c1f4762247e -> FETCH_HEAD
  13. 18.18 s $ /nix/store/61685rbaxmpigwi3z23i33sv3jyfl70q-coreutils-9.11/bin/timeout --kill-after=15s 7200s /nix/store/5vpcfsdx1lcnlb2y4k7xyc74shp5qwbh-git-2.54.0/bin/git -c advice.detachedHead=false checkout e825dd904bec36e475ba5e4734659c1f4762247e
  14. 18.46 s HEAD is now at e825dd904 expose generation progress and live Python filters
  15. 18.47 s $ /nix/store/61685rbaxmpigwi3z23i33sv3jyfl70q-coreutils-9.11/bin/timeout --kill-after=15s 7200s /nix/store/wknkybkzrc16r11vk5vrykh4wmw7a353-nix-2.34.8/bin/nix --extra-experimental-features nix-command --extra-experimental-features flakes --log-format internal-json run .#packages.x86_64-linux.nix-ci-check-gammaloop-nextest-feynkit --print-build-logs
  16. 18.63 s warning: ignoring untrusted flake configuration setting 'extra-substituters'.
  17. 18.63 s Pass '--accept-flake-config' to trust it
  18. 18.63 s warning: ignoring untrusted flake configuration setting 'extra-trusted-public-keys'.
  19. 18.63 s Pass '--accept-flake-config' to trust it
  20. 23.93 s
  21. 24.19 s do you want to allow configuration setting 'extra-substituters' to be set to 'https://cache.nix-ci.com' (y/N)? do you want to permanently mark this value as untrusted (y/N)? warning: ignoring untrusted flake configuration setting 'extra-substituters'.
  22. 24.19 s Pass '--accept-flake-config' to trust it
  23. 24.19 s evaluating derivation 'gdo you want to allow configuration setting 'extra-trusted-public-keys' to be set to 'nix-ci:g3xV5BDTLtIBZr/A00IU1x0EtKKlb7YLgBN2SgYgM6A=' (y/N)? do you want to permanently mark this value as untrusted (y/N)? warning: ignoring untrusted flake configuration setting 'extra-trusted-public-keys'.
  24. 24.19 s Pass '--accept-flake-config' to trust it
  25. 31.23 s copying '/nix/store/wli3 evaluating derivation 'g copying '/nix/store/wli3 evaluating derivation 'g copying '/nix/store/wli3 evaluating derivation 'g copying '/nix/store/wli3 evaluating derivation 'g copying '/nix/store/wli3 evaluating derivation 'g copying '/nix/store/wli3 evaluating derivation 'g copying '/nix/store/wli3 evaluating derivation 'g [0/1 built] [1/0/1 built] building ggammaloop-nextest-feynkit> Extracting 1 binary and 2 linked paths to /build/source
  26. 31.33 s gammaloop-nextest-feynkit> Extracted 15 files to /build/source in 0.10s
  27. 31.35 s gammaloop-nextest-feynkit> ------------
  28. 31.35 s gammaloop-nextest-feynkit> Nextest run ID 59bfa476-f5b1-44a1-94f2-e4092bd87fbd with nextest profile: ci_gammaloop
  29. 31.35 s gammaloop-nextest-feynkit> Starting 1 test across 1 binary
  30. 31.36 s gammaloop-nextest-feynkit> ------------
  31. 31.36 s gammaloop-nextest-feynkit> Summary [ 0.015s] 1 test run: 1 passed, 0 skipped
  32. 31.40 s gammaloop-nextest-feynkit>
  33. 31.40 s gammaloop-nextest-feynkit> ========== nextest test summary ==========
  34. 31.40 s gammaloop-nextest-feynkit> report: target/nextest/ci_gammaloop/junit.xml
  35. 31.40 s gammaloop-nextest-feynkit> tests: 1, failures: 0, errors: 0
  36. 31.40 s gammaloop-nextest-feynkit> No failing testcases found.
  37. 31.40 s gammaloop-nextest-feynkit> =========================================
  38. 31.43 s gammaloop-nextest-feynkit> Extracting 1 binary and 2 linked paths to /build/source
  39. 31.56 s gammaloop-nextest-feynkit> Extracted 15 files to /build/source in 0.14s
  40. 31.60 s gammaloop-nextest-feynkit> ------------
  41. 31.60 s gammaloop-nextest-feynkit> Nextest run ID 0ef695e9-3f42-4f3a-8f8e-0145d4fc1b8f with nextest profile: ci_gammaloop
  42. 31.60 s gammaloop-nextest-feynkit> Starting 33 tests across 1 binary
  43. 31.66 s gammaloop-nextest-feynkit> ------------
  44. 31.66 s gammaloop-nextest-feynkit> Summary [ 0.063s] 33 tests run: 33 passed, 0 skipped
  45. 31.71 s gammaloop-nextest-feynkit>
  46. 31.71 s gammaloop-nextest-feynkit> ========== nextest test summary ==========
  47. 31.71 s gammaloop-nextest-feynkit> report: target/nextest/ci_gammaloop/junit.xml
  48. 31.71 s gammaloop-nextest-feynkit> tests: 33, failures: 0, errors: 0
  49. 31.71 s gammaloop-nextest-feynkit> No failing testcases found.
  50. 31.71 s gammaloop-nextest-feynkit> =========================================
  51. 31.73 s gammaloop-nextest-feynkit> Extracting 2 binaries and 2 linked paths to /build/source
  52. 31.88 s gammaloop-nextest-feynkit> Extracted 16 files to /build/source in 0.15s
  53. 31.91 s gammaloop-nextest-feynkit> ------------
  54. 31.91 s gammaloop-nextest-feynkit> Nextest run ID 2dd35ee8-20cc-4210-a59f-d6ced34f2c01 with nextest profile: ci_gammaloop
  55. 31.91 s gammaloop-nextest-feynkit> Starting 59 tests across 2 binaries
  56. 32.04 s gammaloop-nextest-feynkit> ------------
  57. 32.04 s gammaloop-nextest-feynkit> Summary [ 0.127s] 59 tests run: 59 passed, 0 skipped
  58. 32.09 s gammaloop-nextest-feynkit>
  59. 32.09 s gammaloop-nextest-feynkit> ========== nextest test summary ==========
  60. 32.09 s gammaloop-nextest-feynkit> report: target/nextest/ci_gammaloop/junit.xml
  61. 32.09 s gammaloop-nextest-feynkit> tests: 59, failures: 0, errors: 0
  62. 32.09 s gammaloop-nextest-feynkit> No failing testcases found.
  63. 32.09 s gammaloop-nextest-feynkit> =========================================
  64. 32.11 s gammaloop-nextest-feynkit> Extracting 1 binary and 2 linked paths to /build/source
  65. 32.21 s gammaloop-nextest-feynkit> Extracted 15 files to /build/source in 0.10s
  66. 32.23 s gammaloop-nextest-feynkit> ------------
  67. 32.23 s gammaloop-nextest-feynkit> Nextest run ID 7a96f549-1be8-4288-ad14-7c11294831a2 with nextest profile: ci_gammaloop
  68. 32.23 s gammaloop-nextest-feynkit> Starting 27 tests across 1 binary
  69. 32.30 s gammaloop-nextest-feynkit> ------------
  70. 32.30 s gammaloop-nextest-feynkit> Summary [ 0.070s] 27 tests run: 27 passed, 0 skipped
  71. 32.35 s gammaloop-nextest-feynkit>
  72. 32.35 s gammaloop-nextest-feynkit> ========== nextest test summary ==========
  73. 32.35 s gammaloop-nextest-feynkit> report: target/nextest/ci_gammaloop/junit.xml
  74. 32.35 s gammaloop-nextest-feynkit> tests: 27, failures: 0, errors: 0
  75. 32.35 s gammaloop-nextest-feynkit> No failing testcases found.
  76. 32.35 s gammaloop-nextest-feynkit> =========================================
  77. 32.37 s gammaloop-nextest-feynkit> Extracting 1 binary and 1 linked path to /build/source
  78. 32.48 s gammaloop-nextest-feynkit> Extracted 7 files to /build/source in 0.11s
  79. 32.51 s gammaloop-nextest-feynkit> ------------
  80. 32.51 s gammaloop-nextest-feynkit> Nextest run ID 2e2a6753-5509-4d39-85d2-2e5ee2b73380 with nextest profile: ci_gammaloop
  81. 32.51 s gammaloop-nextest-feynkit> Starting 21 tests across 1 binary
  82. 32.55 s gammaloop-nextest-feynkit> ------------
  83. 32.55 s gammaloop-nextest-feynkit> Summary [ 0.045s] 21 tests run: 21 passed, 0 skipped
  84. 32.60 s gammaloop-nextest-feynkit>
  85. 32.60 s gammaloop-nextest-feynkit> ========== nextest test summary ==========
  86. 32.60 s gammaloop-nextest-feynkit> report: target/nextest/ci_gammaloop/junit.xml
  87. 32.60 s gammaloop-nextest-feynkit> tests: 21, failures: 0, errors: 0
  88. 32.60 s gammaloop-nextest-feynkit> No failing testcases found.
  89. 32.60 s gammaloop-nextest-feynkit> =========================================
  90. 32.64 s gammaloop-nextest-feynkit> Extracting 2 binaries and 2 linked paths to /build/source
  91. 32.79 s gammaloop-nextest-feynkit> Extracted 16 files to /build/source in 0.16s
  92. 32.82 s gammaloop-nextest-feynkit> ------------
  93. 32.82 s gammaloop-nextest-feynkit> Nextest run ID 3b0e7db5-afee-4dca-aff3-ff4a6be52fea with nextest profile: ci_gammaloop
  94. 32.82 s gammaloop-nextest-feynkit> Starting 14 tests across 2 binaries
  95. 32.86 s gammaloop-nextest-feynkit> ------------
  96. 32.86 s gammaloop-nextest-feynkit> Summary [ 0.037s] 14 tests run: 14 passed, 0 skipped
  97. 32.90 s gammaloop-nextest-feynkit>
  98. 32.90 s gammaloop-nextest-feynkit> ========== nextest test summary ==========
  99. 32.90 s gammaloop-nextest-feynkit> report: target/nextest/ci_gammaloop/junit.xml
  100. 32.90 s gammaloop-nextest-feynkit> tests: 14, failures: 0, errors: 0
  101. 32.90 s gammaloop-nextest-feynkit> No failing testcases found.
  102. 32.90 s gammaloop-nextest-feynkit> =========================================
  103. 32.92 s gammaloop-nextest-feynkit> Extracting 5 binaries (including 3 non-test binaries) and 2 linked paths to /build/source
  104. 33.63 s gammaloop-nextest-feynkit> Extracted 22 files to /build/source in 0.72s
  105. 33.68 s gammaloop-nextest-feynkit> ------------
  106. 33.68 s gammaloop-nextest-feynkit> Nextest run ID 6563a44f-1929-482c-9eaf-5219870e2368 with nextest profile: ci_gammaloop
  107. 33.68 s gammaloop-nextest-feynkit> Starting 14 tests across 2 binaries
  108. 33.78 s gammaloop-nextest-feynkit> FAIL [ 0.097s] ( 9/14) feynkit-py tests::standalone_python_pipeline_covers_generation_graphs_cff_and_kinematics
  109. 33.78 s gammaloop-nextest-feynkit> stdout ---
  110. 33.78 s gammaloop-nextest-feynkit>
  111. 33.78 s gammaloop-nextest-feynkit> running 1 test
  112. 33.78 s gammaloop-nextest-feynkit> test tests::standalone_python_pipeline_covers_generation_graphs_cff_and_kinematics ... FAILED
  113. 33.78 s gammaloop-nextest-feynkit>
  114. 33.78 s gammaloop-nextest-feynkit> failures:
  115. 33.78 s gammaloop-nextest-feynkit>
  116. 33.78 s gammaloop-nextest-feynkit> failures:
  117. 33.78 s gammaloop-nextest-feynkit> tests::standalone_python_pipeline_covers_generation_graphs_cff_and_kinematics
  118. 33.78 s gammaloop-nextest-feynkit>
  119. 33.78 s gammaloop-nextest-feynkit> test result: FAILED. 0 passed; 1 failed; 0 ignored; 0 measured; 12 filtered out; finished in 0.09s
  120. 33.78 s gammaloop-nextest-feynkit>
  121. 33.78 s gammaloop-nextest-feynkit> stderr ---
  122. 33.78 s gammaloop-nextest-feynkit>
  123. 33.78 s gammaloop-nextest-feynkit> thread 'tests::standalone_python_pipeline_covers_generation_graphs_cff_and_kinematics' (894) panicked at crates/feynkit-py/src/lib.rs:439:57:
  124. 33.78 s gammaloop-nextest-feynkit> called `Result::unwrap()` on an `Err` value: PyErr { type: <class 'AssertionError'>, value: AssertionError(), traceback: Some("Traceback (most recent call last):\n File \"<string>\", line 39, in <module>\n") }
  125. 33.78 s gammaloop-nextest-feynkit> stack backtrace:
  126. 33.78 s gammaloop-nextest-feynkit> 0: __rustc::rust_begin_unwind
  127. 33.78 s gammaloop-nextest-feynkit> 1: core::panicking::panic_fmt
  128. 33.78 s gammaloop-nextest-feynkit> 2: core::result::unwrap_failed
  129. 33.78 s gammaloop-nextest-feynkit> 3: feynkit_py::tests::standalone_python_pipeline_covers_generation_graphs_cff_and_kinematics
  130. 33.78 s gammaloop-nextest-feynkit> 4: <feynkit_py::tests::standalone_python_pipeline_covers_generation_graphs_cff_and_kinematics::{closure#0} as core::ops::function::FnOnce<()>>::call_once
  131. 33.78 s gammaloop-nextest-feynkit> note: Some details are omitted, run with `RUST_BACKTRACE=full` for a verbose backtrace.
  132. 33.78 s gammaloop-nextest-feynkit>
  133. 34.94 s gammaloop-nextest-feynkit> ------------
  134. 34.94 s gammaloop-nextest-feynkit> Summary [ 1.255s] 14 tests run: 13 passed, 1 failed, 0 skipped
  135. 34.94 s gammaloop-nextest-feynkit> FAIL [ 0.097s] ( 9/14) feynkit-py tests::standalone_python_pipeline_covers_generation_graphs_cff_and_kinematics
  136. 34.94 s gammaloop-nextest-feynkit> stdout ---
  137. 34.94 s gammaloop-nextest-feynkit>
  138. 34.94 s gammaloop-nextest-feynkit> running 1 test
  139. 34.94 s gammaloop-nextest-feynkit> test tests::standalone_python_pipeline_covers_generation_graphs_cff_and_kinematics ... FAILED
  140. 34.94 s gammaloop-nextest-feynkit>
  141. 34.94 s gammaloop-nextest-feynkit> failures:
  142. 34.94 s gammaloop-nextest-feynkit>
  143. 34.94 s gammaloop-nextest-feynkit> failures:
  144. 34.94 s gammaloop-nextest-feynkit> tests::standalone_python_pipeline_covers_generation_graphs_cff_and_kinematics
  145. 34.94 s gammaloop-nextest-feynkit>
  146. 34.94 s gammaloop-nextest-feynkit> test result: FAILED. 0 passed; 1 failed; 0 ignored; 0 measured; 12 filtered out; finished in 0.09s
  147. 34.94 s gammaloop-nextest-feynkit>
  148. 34.94 s gammaloop-nextest-feynkit> stderr ---
  149. 34.94 s gammaloop-nextest-feynkit>
  150. 34.94 s gammaloop-nextest-feynkit> thread 'tests::standalone_python_pipeline_covers_generation_graphs_cff_and_kinematics' (894) panicked at crates/feynkit-py/src/lib.rs:439:57:
  151. 34.94 s gammaloop-nextest-feynkit> called `Result::unwrap()` on an `Err` value: PyErr { type: <class 'AssertionError'>, value: AssertionError(), traceback: Some("Traceback (most recent call last):\n File \"<string>\", line 39, in <module>\n") }
  152. 34.94 s gammaloop-nextest-feynkit> stack backtrace:
  153. 34.94 s gammaloop-nextest-feynkit> 0: __rustc::rust_begin_unwind
  154. 34.94 s gammaloop-nextest-feynkit> 1: core::panicking::panic_fmt
  155. 34.94 s gammaloop-nextest-feynkit> 2: core::result::unwrap_failed
  156. 34.94 s gammaloop-nextest-feynkit> 3: feynkit_py::tests::standalone_python_pipeline_covers_generation_graphs_cff_and_kinematics
  157. 34.94 s gammaloop-nextest-feynkit> 4: <feynkit_py::tests::standalone_python_pipeline_covers_generation_graphs_cff_and_kinematics::{closure#0} as core::ops::function::FnOnce<()>>::call_once
  158. 34.94 s gammaloop-nextest-feynkit> note: Some details are omitted, run with `RUST_BACKTRACE=full` for a verbose backtrace.
  159. 34.94 s gammaloop-nextest-feynkit>
  160. 34.95 s gammaloop-nextest-feynkit> error: test run failed
  161. 34.98 s gammaloop-nextest-feynkit>
  162. 34.98 s gammaloop-nextest-feynkit> ========== nextest test summary ==========
  163. 34.98 s gammaloop-nextest-feynkit> report: target/nextest/ci_gammaloop/junit.xml
  164. 34.98 s gammaloop-nextest-feynkit> tests: 14, failures: 1, errors: 0
  165. 34.98 s gammaloop-nextest-feynkit>
  166. 34.98 s gammaloop-nextest-feynkit> 1. feynkit-py::tests::standalone_python_pipeline_covers_generation_graphs_cff_and_kinematics
  167. 34.98 s gammaloop-nextest-feynkit> failure: test failure with exit code 101
  168. 34.98 s gammaloop-nextest-feynkit> thread 'tests::standalone_python_pipeline_covers_generation_graphs_cff_and_kinematics' (894) panicked at crates/feynkit-py/src/lib.rs:439:57:
  169. 34.98 s gammaloop-nextest-feynkit> called `Result::unwrap()` on an `Err` value: PyErr { type: <class 'AssertionError'>, value: AssertionError(), traceback: Some("Traceback (most recent call last):\n File \"<string>\", line 39, in <module>\n") }
  170. 34.98 s gammaloop-nextest-feynkit> stack backtrace:
  171. 34.98 s gammaloop-nextest-feynkit> 0: __rustc::rust_begin_unwind
  172. 34.98 s gammaloop-nextest-feynkit> 1: core::panicking::panic_fmt
  173. 34.98 s gammaloop-nextest-feynkit> 2: core::result::unwrap_failed
  174. 34.98 s gammaloop-nextest-feynkit> 3: feynkit_py::tests::standalone_python_pipeline_covers_generation_graphs_cff_and_kinematics
  175. 34.98 s gammaloop-nextest-feynkit> 4: <feynkit_py::tests::standalone_python_pipeline_covers_generation_graphs_cff_and_kinematics::{closure#0} as core::ops::function::FnOnce<()>>::call_once
  176. 34.98 s gammaloop-nextest-feynkit> note: Some details are omitted, run with `RUST_BACKTRACE=full` for a verbose backtrace.
  177. 34.98 s gammaloop-nextest-feynkit> system-out
  178. 34.98 s gammaloop-nextest-feynkit> running 1 test
  179. 34.98 s gammaloop-nextest-feynkit> test tests::standalone_python_pipeline_covers_generation_graphs_cff_and_kinematics ... FAILED
  180. 34.98 s gammaloop-nextest-feynkit>
  181. 34.98 s gammaloop-nextest-feynkit> failures:
  182. 34.98 s gammaloop-nextest-feynkit>
  183. 34.98 s gammaloop-nextest-feynkit> failures:
  184. 34.98 s gammaloop-nextest-feynkit> tests::standalone_python_pipeline_covers_generation_graphs_cff_and_kinematics
  185. 34.98 s gammaloop-nextest-feynkit>
  186. 34.98 s gammaloop-nextest-feynkit> test result: FAILED. 0 passed; 1 failed; 0 ignored; 0 measured; 12 filtered out; finished in 0.09s
  187. 34.98 s gammaloop-nextest-feynkit> system-err
  188. 34.98 s gammaloop-nextest-feynkit> thread 'tests::standalone_python_pipeline_covers_generation_graphs_cff_and_kinematics' (894) panicked at crates/feynkit-py/src/lib.rs:439:57:
  189. 34.98 s gammaloop-nextest-feynkit> called `Result::unwrap()` on an `Err` value: PyErr { type: <class 'AssertionError'>, value: AssertionError(), traceback: Some("Traceback (most recent call last):\n File \"<string>\", line 39, in <module>\n") }
  190. 34.98 s gammaloop-nextest-feynkit> stack backtrace:
  191. 34.98 s gammaloop-nextest-feynkit> 0: __rustc::rust_begin_unwind
  192. 34.98 s gammaloop-nextest-feynkit> 1: core::panicking::panic_fmt
  193. 34.98 s gammaloop-nextest-feynkit> 2: core::result::unwrap_failed
  194. 34.98 s gammaloop-nextest-feynkit> 3: feynkit_py::tests::standalone_python_pipeline_covers_generation_graphs_cff_and_kinematics
  195. 34.98 s gammaloop-nextest-feynkit> 4: <feynkit_py::tests::standalone_python_pipeline_covers_generation_graphs_cff_and_kinematics::{closure#0} as core::ops::function::FnOnce<()>>::call_once
  196. 34.98 s gammaloop-nextest-feynkit> note: Some details are omitted, run with `RUST_BACKTRACE=full` for a verbose backtrace.
  197. 34.98 s gammaloop-nextest-feynkit> =========================================
  198. 35.01 s gammaloop-nextest-feynkit> Extracting 1 binary and 2 linked paths to /build/source
  199. 35.11 s gammaloop-nextest-feynkit> Extracted 15 files to /build/source in 0.11s
  200. 35.14 s gammaloop-nextest-feynkit> ------------
  201. 35.14 s gammaloop-nextest-feynkit> Nextest run ID 689a691c-00fc-4123-839b-89caf999c2f9 with nextest profile: ci_gammaloop
  202. 35.14 s gammaloop-nextest-feynkit> Starting 45 tests across 1 binary (1 test skipped)
  203. 35.31 s gammaloop-nextest-feynkit> ------------
  204. 35.31 s gammaloop-nextest-feynkit> Summary [ 0.163s] 45 tests run: 45 passed, 1 skipped
  205. 35.34 s gammaloop-nextest-feynkit>
  206. 35.34 s gammaloop-nextest-feynkit> ========== nextest test summary ==========
  207. 35.34 s gammaloop-nextest-feynkit> report: target/nextest/ci_gammaloop/junit.xml
  208. 35.34 s gammaloop-nextest-feynkit> tests: 45, failures: 0, errors: 0
  209. 35.34 s gammaloop-nextest-feynkit> No failing testcases found.
  210. 35.34 s gammaloop-nextest-feynkit> =========================================
  211. 35.36 s gammaloop-nextest-feynkit> Extracting 1 binary and 2 linked paths to /build/source
  212. 35.44 s gammaloop-nextest-feynkit> Extracted 15 files to /build/source in 0.08s
  213. 35.46 s gammaloop-nextest-feynkit> ------------
  214. 35.46 s gammaloop-nextest-feynkit> Nextest run ID d3557447-3365-4de6-9b82-76b9fa9eaa1b with nextest profile: ci_gammaloop
  215. 35.46 s gammaloop-nextest-feynkit> Starting 2 tests across 1 binary
  216. 35.48 s gammaloop-nextest-feynkit> ------------
  217. 35.48 s gammaloop-nextest-feynkit> Summary [ 0.028s] 2 tests run: 2 passed, 0 skipped
  218. 35.54 s gammaloop-nextest-feynkit>
  219. 35.54 s gammaloop-nextest-feynkit> ========== nextest test summary ==========
  220. 35.54 s gammaloop-nextest-feynkit> report: target/nextest/ci_gammaloop/junit.xml
  221. 35.54 s gammaloop-nextest-feynkit> tests: 2, failures: 0, errors: 0
  222. 35.54 s gammaloop-nextest-feynkit> No failing testcases found.
  223. 35.54 s gammaloop-nextest-feynkit> =========================================
  224. 35.72 s error: Cannot build '/nix/store/kb0lr4h0gq0x5sqkq38ia6ralwg0mmq8-gammaloop-nextest-feynkit.drv'.
  225. 35.72 s Reason: builder failed with exit code 100.
  226. 35.72 s Output paths:
  227. 35.72 s /nix/store/ahpf8mz4pdljmdp9r23wz3kjl8xw3ph3-gammaloop-nextest-feynkit
  228. 35.72 s Last 199 log lines:
  229. 35.72 s > Extracting 1 binary and 2 linked paths to /build/source
  230. 35.72 s > Extracted 15 files to /build/source in 0.10s
  231. 35.72 s > ------------
  232. 35.72 s > Nextest run ID 59bfa476-f5b1-44a1-94f2-e4092bd87fbd with nextest profile: ci_gammaloop
  233. 35.72 s > Starting 1 test across 1 binary
  234. 35.72 s > ------------
  235. 35.72 s > Summary [ 0.015s] 1 test run: 1 passed, 0 skipped
  236. 35.72 s >
  237. 35.72 s > ========== nextest test summary ==========
  238. 35.72 s > report: target/nextest/ci_gammaloop/junit.xml
  239. 35.72 s > tests: 1, failures: 0, errors: 0
  240. 35.72 s > No failing testcases found.
  241. 35.72 s > =========================================
  242. 35.72 s > Extracting 1 binary and 2 linked paths to /build/source
  243. 35.72 s > Extracted 15 files to /build/source in 0.14s
  244. 35.72 s > ------------
  245. 35.72 s > Nextest run ID 0ef695e9-3f42-4f3a-8f8e-0145d4fc1b8f with nextest profile: ci_gammaloop
  246. 35.72 s > Starting 33 tests across 1 binary
  247. 35.72 s > ------------
  248. 35.72 s > Summary [ 0.063s] 33 tests run: 33 passed, 0 skipped
  249. 35.72 s >
  250. 35.72 s > ========== nextest test summary ==========
  251. 35.72 s > report: target/nextest/ci_gammaloop/junit.xml
  252. 35.72 s > tests: 33, failures: 0, errors: 0
  253. 35.72 s > No failing testcases found.
  254. 35.72 s > =========================================
  255. 35.72 s > Extracting 2 binaries and 2 linked paths to /build/source
  256. 35.72 s > Extracted 16 files to /build/source in 0.15s
  257. 35.72 s > ------------
  258. 35.72 s > Nextest run ID 2dd35ee8-20cc-4210-a59f-d6ced34f2c01 with nextest profile: ci_gammaloop
  259. 35.72 s > Starting 59 tests across 2 binaries
  260. 35.72 s > ------------
  261. 35.72 s > Summary [ 0.127s] 59 tests run: 59 passed, 0 skipped
  262. 35.72 s >
  263. 35.72 s > ========== nextest test summary ==========
  264. 35.72 s > report: target/nextest/ci_gammaloop/junit.xml
  265. 35.72 s > tests: 59, failures: 0, errors: 0
  266. 35.72 s > No failing testcases found.
  267. 35.72 s > =========================================
  268. 35.72 s > Extracting 1 binary and 2 linked paths to /build/source
  269. 35.72 s > Extracted 15 files to /build/source in 0.10s
  270. 35.72 s > ------------
  271. 35.72 s > Nextest run ID 7a96f549-1be8-4288-ad14-7c11294831a2 with nextest profile: ci_gammaloop
  272. 35.72 s > Starting 27 tests across 1 binary
  273. 35.72 s > ------------
  274. 35.72 s > Summary [ 0.070s] 27 tests run: 27 passed, 0 skipped
  275. 35.72 s >
  276. 35.72 s > ========== nextest test summary ==========
  277. 35.72 s > report: target/nextest/ci_gammaloop/junit.xml
  278. 35.72 s > tests: 27, failures: 0, errors: 0
  279. 35.72 s > No failing testcases found.
  280. 35.72 s > =========================================
  281. 35.72 s > Extracting 1 binary and 1 linked path to /build/source
  282. 35.72 s > Extracted 7 files to /build/source in 0.11s
  283. 35.72 s > ------------
  284. 35.72 s > Nextest run ID 2e2a6753-5509-4d39-85d2-2e5ee2b73380 with nextest profile: ci_gammaloop
  285. 35.72 s > Starting 21 tests across 1 binary
  286. 35.72 s > ------------
  287. 35.72 s > Summary [ 0.045s] 21 tests run: 21 passed, 0 skipped
  288. 35.72 s >
  289. 35.72 s > ========== nextest test summary ==========
  290. 35.72 s > report: target/nextest/ci_gammaloop/junit.xml
  291. 35.72 s > tests: 21, failures: 0, errors: 0
  292. 35.72 s > No failing testcases found.
  293. 35.72 s > =========================================
  294. 35.72 s > Extracting 2 binaries and 2 linked paths to /build/source
  295. 35.72 s > Extracted 16 files to /build/source in 0.16s
  296. 35.72 s > ------------
  297. 35.72 s > Nextest run ID 3b0e7db5-afee-4dca-aff3-ff4a6be52fea with nextest profile: ci_gammaloop
  298. 35.72 s > Starting 14 tests across 2 binaries
  299. 35.72 s > ------------
  300. 35.72 s > Summary [ 0.037s] 14 tests run: 14 passed, 0 skipped
  301. 35.72 s >
  302. 35.72 s > ========== nextest test summary ==========
  303. 35.72 s > report: target/nextest/ci_gammaloop/junit.xml
  304. 35.72 s > tests: 14, failures: 0, errors: 0
  305. 35.72 s > No failing testcases found.
  306. 35.72 s > =========================================
  307. 35.72 s > Extracting 5 binaries (including 3 non-test binaries) and 2 linked paths to /build/source
  308. 35.72 s > Extracted 22 files to /build/source in 0.72s
  309. 35.72 s > ------------
  310. 35.72 s > Nextest run ID 6563a44f-1929-482c-9eaf-5219870e2368 with nextest profile: ci_gammaloop
  311. 35.72 s > Starting 14 tests across 2 binaries
  312. 35.72 s > FAIL [ 0.097s] ( 9/14) feynkit-py tests::standalone_python_pipeline_covers_generation_graphs_cff_and_kinematics
  313. 35.72 s > stdout ---
  314. 35.72 s >
  315. 35.72 s > running 1 test
  316. 35.72 s > test tests::standalone_python_pipeline_covers_generation_graphs_cff_and_kinematics ... FAILED
  317. 35.72 s >
  318. 35.72 s > failures:
  319. 35.72 s >
  320. 35.72 s > failures:
  321. 35.72 s > tests::standalone_python_pipeline_covers_generation_graphs_cff_and_kinematics
  322. 35.72 s >
  323. 35.72 s > test result: FAILED. 0 passed; 1 failed; 0 ignored; 0 measured; 12 filtered out; finished in 0.09s
  324. 35.72 s >
  325. 35.72 s > stderr ---
  326. 35.72 s >
  327. 35.72 s > thread 'tests::standalone_python_pipeline_covers_generation_graphs_cff_and_kinematics' (894) panicked at crates/feynkit-py/src/lib.rs:439:57:
  328. 35.72 s > called `Result::unwrap()` on an `Err` value: PyErr { type: <class 'AssertionError'>, value: AssertionError(), traceback: Some("Traceback (most recent call last):\n File \"<string>\", line 39, in <module>\n") }
  329. 35.72 s > stack backtrace:
  330. 35.72 s > 0: __rustc::rust_begin_unwind
  331. 35.72 s > 1: core::panicking::panic_fmt
  332. 35.72 s > 2: core::result::unwrap_failed
  333. 35.72 s > 3: feynkit_py::tests::standalone_python_pipeline_covers_generation_graphs_cff_and_kinematics
  334. 35.72 s > 4: <feynkit_py::tests::standalone_python_pipeline_covers_generation_graphs_cff_and_kinematics::{closure#0} as core::ops::function::FnOnce<()>>::call_once
  335. 35.72 s > note: Some details are omitted, run with `RUST_BACKTRACE=full` for a verbose backtrace.
  336. 35.72 s >
  337. 35.72 s > ------------
  338. 35.72 s > Summary [ 1.255s] 14 tests run: 13 passed, 1 failed, 0 skipped
  339. 35.72 s > FAIL [ 0.097s] ( 9/14) feynkit-py tests::standalone_python_pipeline_covers_generation_graphs_cff_and_kinematics
  340. 35.72 s > stdout ---
  341. 35.72 s >
  342. 35.72 s > running 1 test
  343. 35.72 s > test tests::standalone_python_pipeline_covers_generation_graphs_cff_and_kinematics ... FAILED
  344. 35.72 s >
  345. 35.72 s > failures:
  346. 35.72 s >
  347. 35.72 s > failures:
  348. 35.72 s > tests::standalone_python_pipeline_covers_generation_graphs_cff_and_kinematics
  349. 35.72 s >
  350. 35.72 s > test result: FAILED. 0 passed; 1 failed; 0 ignored; 0 measured; 12 filtered out; finished in 0.09s
  351. 35.72 s >
  352. 35.72 s > stderr ---
  353. 35.72 s >
  354. 35.72 s > thread 'tests::standalone_python_pipeline_covers_generation_graphs_cff_and_kinematics' (894) panicked at crates/feynkit-py/src/lib.rs:439:57:
  355. 35.72 s > called `Result::unwrap()` on an `Err` value: PyErr { type: <class 'AssertionError'>, value: AssertionError(), traceback: Some("Traceback (most recent call last):\n File \"<string>\", line 39, in <module>\n") }
  356. 35.72 s > stack backtrace:
  357. 35.72 s > 0: __rustc::rust_begin_unwind
  358. 35.72 s > 1: core::panicking::panic_fmt
  359. 35.72 s > 2: core::result::unwrap_failed
  360. 35.72 s > 3: feynkit_py::tests::standalone_python_pipeline_covers_generation_graphs_cff_and_kinematics
  361. 35.72 s > 4: <feynkit_py::tests::standalone_python_pipeline_covers_generation_graphs_cff_and_kinematics::{closure#0} as core::ops::function::FnOnce<()>>::call_once
  362. 35.72 s > note: Some details are omitted, run with `RUST_BACKTRACE=full` for a verbose backtrace.
  363. 35.72 s >
  364. 35.72 s > error: test run failed
  365. 35.72 s >
  366. 35.72 s > ========== nextest test summary ==========
  367. 35.72 s > report: target/nextest/ci_gammaloop/junit.xml
  368. 35.72 s > tests: 14, failures: 1, errors: 0
  369. 35.72 s >
  370. 35.72 s > 1. feynkit-py::tests::standalone_python_pipeline_covers_generation_graphs_cff_and_kinematics
  371. 35.72 s > failure: test failure with exit code 101
  372. 35.72 s > thread 'tests::standalone_python_pipeline_covers_generation_graphs_cff_and_kinematics' (894) panicked at crates/feynkit-py/src/lib.rs:439:57:
  373. 35.72 s > called `Result::unwrap()` on an `Err` value: PyErr { type: <class 'AssertionError'>, value: AssertionError(), traceback: Some("Traceback (most recent call last):\n File \"<string>\", line 39, in <module>\n") }
  374. 35.72 s > stack backtrace:
  375. 35.72 s > 0: __rustc::rust_begin_unwind
  376. 35.72 s > 1: core::panicking::panic_fmt
  377. 35.72 s > 2: core::result::unwrap_failed
  378. 35.72 s > 3: feynkit_py::tests::standalone_python_pipeline_covers_generation_graphs_cff_and_kinematics
  379. 35.72 s > 4: <feynkit_py::tests::standalone_python_pipeline_covers_generation_graphs_cff_and_kinematics::{closure#0} as core::ops::function::FnOnce<()>>::call_once
  380. 35.72 s > note: Some details are omitted, run with `RUST_BACKTRACE=full` for a verbose backtrace.
  381. 35.72 s > system-out
  382. 35.72 s > running 1 test
  383. 35.72 s > test tests::standalone_python_pipeline_covers_generation_graphs_cff_and_kinematics ... FAILED
  384. 35.72 s >
  385. 35.72 s > failures:
  386. 35.72 s >
  387. 35.72 s > failures:
  388. 35.72 s > tests::standalone_python_pipeline_covers_generation_graphs_cff_and_kinematics
  389. 35.72 s >
  390. 35.72 s > test result: FAILED. 0 passed; 1 failed; 0 ignored; 0 measured; 12 filtered out; finished in 0.09s
  391. 35.72 s > system-err
  392. 35.72 s > thread 'tests::standalone_python_pipeline_covers_generation_graphs_cff_and_kinematics' (894) panicked at crates/feynkit-py/src/lib.rs:439:57:
  393. 35.72 s > called `Result::unwrap()` on an `Err` value: PyErr { type: <class 'AssertionError'>, value: AssertionError(), traceback: Some("Traceback (most recent call last):\n File \"<string>\", line 39, in <module>\n") }
  394. 35.72 s > stack backtrace:
  395. 35.72 s > 0: __rustc::rust_begin_unwind
  396. 35.72 s > 1: core::panicking::panic_fmt
  397. 35.72 s > 2: core::result::unwrap_failed
  398. 35.72 s > 3: feynkit_py::tests::standalone_python_pipeline_covers_generation_graphs_cff_and_kinematics
  399. 35.72 s > 4: <feynkit_py::tests::standalone_python_pipeline_covers_generation_graphs_cff_and_kinematics::{closure#0} as core::ops::function::FnOnce<()>>::call_once
  400. 35.72 s > note: Some details are omitted, run with `RUST_BACKTRACE=full` for a verbose backtrace.
  401. 35.72 s > =========================================
  402. 35.72 s > Extracting 1 binary and 2 linked paths to /build/source
  403. 35.72 s > Extracted 15 files to /build/source in 0.11s
  404. 35.72 s > ------------
  405. 35.72 s > Nextest run ID 689a691c-00fc-4123-839b-89caf999c2f9 with nextest profile: ci_gammaloop
  406. 35.72 s > Starting 45 tests across 1 binary (1 test skipped)
  407. 35.72 s > ------------
  408. 35.72 s > Summary [ 0.163s] 45 tests run: 45 passed, 1 skipped
  409. 35.72 s >
  410. 35.72 s > ========== nextest test summary ==========
  411. 35.72 s > report: target/nextest/ci_gammaloop/junit.xml
  412. 35.72 s > tests: 45, failures: 0, errors: 0
  413. 35.72 s > No failing testcases found.
  414. 35.72 s > =========================================
  415. 35.72 s > Extracting 1 binary and 2 linked paths to /build/source
  416. 35.72 s > Extracted 15 files to /build/source in 0.08s
  417. 35.72 s > ------------
  418. 35.72 s > Nextest run ID d3557447-3365-4de6-9b82-76b9fa9eaa1b with nextest profile: ci_gammaloop
  419. 35.72 s > Starting 2 tests across 1 binary
  420. 35.72 s > ------------
  421. 35.72 s > Summary [ 0.028s] 2 tests run: 2 passed, 0 skipped
  422. 35.72 s >
  423. 35.72 s > ========== nextest test summary ==========
  424. 35.72 s > report: target/nextest/ci_gammaloop/junit.xml
  425. 35.72 s > tests: 2, failures: 0, errors: 0
  426. 35.72 s > No failing testcases found.
  427. 35.72 s > =========================================
  428. 35.72 s For full logs, run:
  429. 35.72 s nix log /nix/store/kb0lr4h0gq0x5sqkq38ia6ralwg0mmq8-gammaloop-nextest-feynkit.drv
  430. 35.87 s [0 built (1 failed)]Run failed.