1. 0.00 s $ /nix/store/61685rbaxmpigwi3z23i33sv3jyfl70q-coreutils-9.11/bin/timeout --kill-after=15s 7200s /nix/store/wknkybkzrc16r11vk5vrykh4wmw7a353-nix-2.34.8/bin/nix --extra-experimental-features nix-command --extra-experimental-features flakes flake clone git+https://github.com/alphal00p/gammaloop --dest /tmp/nix-ci-worker/stable-pwd/repo/
  2. 0.08 s Cloning into '/tmp/nix-ci-worker/stable-pwd/repo'...
  3. 2.31 s remote: Enumerating objects: 93607 remote: Enumerating objects: 103115, done.
  4. 2.42 s remote: Counting objects: 0% (1/9508) remote: Counting objects: 1% (96/9508) remote: Counting objects: 2% (191/9508) remote: Counting objects: 3% (286/9508) remote: Counting objects: 4% (381/9508) remote: Counting objects: 5% (476/9508) remote: Counting objects: 6% (571/9508) remote: Counting objects: 7% (666/9508) remote: Counting objects: 8% (761/9508) remote: Counting objects: 9% (856/9508) remote: Counting objects: 10% (951/9508) remote: Counting objects: 11% (1046/9508) remote: Counting objects: 12% (1141/9508) remote: Counting objects: 13% (1237/9508) remote: Counting objects: 14% (1332/9508) remote: Counting objects: 15% (1427/9508) remote: Counting objects: 16% (1522/9508) remote: Counting objects: 17% (1617/9508) remote: Counting objects: 18% (1712/9508) remote: Counting objects: 19% (1807/9508) remote: Counting objects: 20% (1902/9508) remote: Counting objects: 21% (1997/9508) remote: Counting objects: 22% (2092/9508) remote: Counting objects: 23% (2187/9508) remote: Counting objects: 24% (2282/9508) remote: Counting objects: 25% (2377/9508) remote: Counting objects: 26% (2473/9508) remote: Counting objects: 27% (2568/9508) remote: Counting objects: 28% (2663/9508) remote: Counting objects: 29% (2758/9508) remote: Counting objects: 30% (2853/9508) remote: Counting objects: 31% (2948/9508) remote: Counting objects: 32% (3043/9508) remote: Counting objects: 33% (3138/9508) remote: Counting objects: 34% (3233/9508) remote: Counting objects: 35% (3328/9508) remote: Counting objects: 36% (3423/9508) remote: Counting objects: 37% (3518/9508) remote: Counting objects: 38% (3614/9508) remote: Counting objects: 39% (3709/9508) remote: Counting objects: 40% (3804/9508) remote: Counting objects: 41% (3899/9508) remote: Counting objects: 42% (3994/9508) remote: Counting objects: 43% (4089/9508) remote: Counting objects: 44% (4184/9508) remote: Counting objects: 45% (4279/9508) remote: Counting objects: 46% (4374/9508) remote: Counting objects: 47% (4469/9508) remote: Counting objects: 48% (4564/9508) remote: Counting objects: 49% (4659/9508) remote: Counting objects: 50% (4754/9508) remote: Counting objects: 51% (4850/9508) remote: Counting objects: 52% (4945/9508) remote: Counting objects: 53% (5040/9508) remote: Counting objects: 54% (5135/9508) remote: Counting objects: 55% (5230/9508) remote: Counting objects: 56% (5325/9508) remote: Counting objects: 57% (5420/9508) remote: Counting objects: 58% (5515/9508) remote: Counting objects: 59% (5610/9508) remote: Counting objects: 60% (5705/9508) remote: Counting objects: 61% (5800/9508) remote: Counting objects: 62% (5895/9508) remote: Counting objects: 63% (5991/9508) remote: Counting objects: 64% (6086/9508) remote: Counting objects: 65% (6181/9508) remote: Counting objects: 66% (6276/9508) remote: Counting objects: 67% (6371/9508) remote: Counting objects: 68% (6466/9508) remote: Counting objects: 69% (6561/9508) remote: Counting objects: 70% (6656/9508) remote: Counting objects: 71% (6751/9508) remote: Counting objects: 72% (6846/9508) remote: Counting objects: 73% (6941/9508) remote: Counting objects: 74% (7036/9508) remote: Counting objects: 75% (7131/9508) remote: Counting objects: 76% (7227/9508) remote: Counting objects: 77% (7322/9508) remote: Counting objects: 78% (7417/9508) remote: Counting objects: 79% (7512/9508) remote: Counting objects: 80% (7607/9508) remote: Counting objects: 81% (7702/9508) remote: Counting objects: 82% (7797/9508) remote: Counting objects: 83% (7892/9508) remote: Counting objects: 84% (7987/9508) remote: Counting objects: 85% (8082/9508) remote: Counting objects: 86% (8177/9508) remote: Counting objects: 87% (8272/9508) remote: Counting objects: 88% (8368/9508) remote: Counting objects: 89% (8463/9508) remote: Counting objects: 90% (8558/9508) remote: Counting objects: 91% (8653/9508) remote: Counting objects: 92% (8748/9508) remote: Counting objects: 93% (8843/9508) remote: Counting objects: 94% (8938/9508) remote: Counting objects: 95% (9033/9508) remote: Counting objects: 96% (9128/9508) remote: Counting objects: 97% (9223/9508) remote: Counting objects: 98% (9318/9508) remote: Counting objects: 99% (9413/9508) remote: Counting objects: 100% (9508/9508) remote: Counting objects: 100% (9508/9508), done.
  5. 5.15 s remote: Compressing objects: 0% (1/2076) remote: Compressing objects: 1% (21/2076) remote: Compressing objects: 2% (42/2076) remote: Compressing objects: 3% (63/2076) remote: Compressing objects: 4% (84/2076) remote: Compressing objects: 5% (104/2076) remote: Compressing objects: 6% (125/2076) remote: Compressing objects: 7% (146/2076) remote: Compressing objects: 7% (152/2076) remote: Compressing objects: 8% (167/2076) remote: Compressing objects: 9% (187/2076) remote: Compressing objects: 10% (208/2076) remote: Compressing objects: 11% (229/2076) remote: Compressing objects: 12% (250/2076) remote: Compressing objects: 13% (270/2076) remote: Compressing objects: 14% (291/2076) remote: Compressing objects: 14% (302/2076) remote: Compressing objects: 15% (312/2076) remote: Compressing objects: 16% (333/2076) remote: Compressing objects: 17% (353/2076) remote: Compressing objects: 18% (374/2076) remote: Compressing objects: 19% (395/2076) remote: Compressing objects: 20% (416/2076) remote: Compressing objects: 21% (436/2076) remote: Compressing objects: 22% (457/2076) remote: Compressing objects: 23% (478/2076) remote: Compressing objects: 24% (499/2076) remote: Compressing objects: 25% (519/2076) remote: Compressing objects: 26% (540/2076) remote: Compressing objects: 27% (561/2076) remote: Compressing objects: 28% (582/2076) remote: Compressing objects: 29% (603/2076) remote: Compressing objects: 30% (623/2076) remote: Compressing objects: 31% (644/2076) remote: Compressing objects: 32% (665/2076) remote: Compressing objects: 33% (686/2076) remote: Compressing objects: 34% (706/2076) remote: Compressing objects: 35% (727/2076) remote: Compressing objects: 36% (748/2076) remote: Compressing objects: 37% (769/2076) remote: Compressing objects: 38% (789/2076) remote: Compressing objects: 39% (810/2076) remote: Compressing objects: 40% (831/2076) remote: Compressing objects: 41% (852/2076) remote: Compressing objects: 42% (872/2076) remote: Compressing objects: 43% (893/2076) remote: Compressing objects: 44% (914/2076) remote: Compressing objects: 45% (935/2076) remote: Compressing objects: 46% (955/2076) remote: Compressing objects: 47% (976/2076) remote: Compressing objects: 48% (997/2076) remote: Compressing objects: 49% (1018/2076) remote: Compressing objects: 50% (1038/2076) remote: Compressing objects: 51% (1059/2076) remote: Compressing objects: 52% (1080/2076) remote: Compressing objects: 53% (1101/2076) remote: Compressing objects: 54% (1122/2076) remote: Compressing objects: 55% (1142/2076) remote: Compressing objects: 56% (1163/2076) remote: Compressing objects: 57% (1184/2076) remote: Compressing objects: 58% (1205/2076) remote: Compressing objects: 59% (1225/2076) remote: Compressing objects: 60% (1246/2076) remote: Compressing objects: 61% (1267/2076) remote: Compressing objects: 62% (1288/2076) remote: Compressing objects: 63% (1308/2076) remote: Compressing objects: 64% (1329/2076) remote: Compressing objects: 65% (1350/2076) remote: Compressing objects: 66% (1371/2076) remote: Compressing objects: 67% (1391/2076) remote: Compressing objects: 68% (1412/2076) remote: Compressing objects: 69% (1433/2076) remote: Compressing objects: 70% (1454/2076) remote: Compressing objects: 71% (1474/2076) remote: Compressing objects: 72% (1495/2076) remote: Compressing objects: 73% (1516/2076) remote: Compressing objects: 74% (1537/2076) remote: Compressing objects: 75% (1557/2076) remote: Compressing objects: 76% (1578/2076) remote: Compressing objects: 77% (1599/2076) remote: Compressing objects: 78% (1620/2076) remote: Compressing objects: 79% (1641/2076) remote: Compressing objects: 80% (1661/2076) remote: Compressing objects: 81% (1682/2076) remote: Compressing objects: 82% (1703/2076) remote: Compressing objects: 83% (1724/2076) remote: Compressing objects: 84% (1744/2076) remote: Compressing objects: 85% (1765/2076) remote: Compressing objects: 86% (1786/2076) remote: Compressing objects: 87% (1807/2076) remote: Compressing objects: 88% (1827/2076) remote: Compressing objects: 89% (1848/2076) remote: Compressing objects: 90% (1869/2076) remote: Compressing objects: 91% (1890/2076) remote: Compressing objects: 92% (1910/2076) remote: Compressing objects: 93% (1931/2076) remote: Compressing objects: 94% (1952/2076) remote: Compressing objects: 95% (1973/2076) remote: Compressing objects: 96% (1993/2076) remote: Compressing objects: 97% (2014/2076) remote: Compressing objects: 98% (2035/2076) remote: Compressing objects: 99% (2056/2076) remote: Compressing objects: 100% (2076/2076) remote: Compressing objects: 100% (2076/2076), done.
  6. 19.58 s Receiving objects: 0% (1/103115) Receiving objects: 1% (1032/103115) Receiving objects: 2% (2063/103115) Receiving objects: 3% (3094/103115) Receiving objects: 4% (4125/103115) Receiving objects: 5% (5156/103115), 9.46 MiB | 18.91 MiB/s Receiving objects: 6% (6187/103115), 9.46 MiB | 18.91 MiB/s Receiving objects: 7% (7219/103115), 9.46 MiB | 18.91 MiB/s Receiving objects: 8% (8250/103115), 9.46 MiB | 18.91 MiB/s Receiving objects: 9% (9281/103115), 9.46 MiB | 18.91 MiB/s Receiving objects: 10% (10312/103115), 9.46 MiB | 18.91 MiB/s Receiving objects: 11% (11343/103115), 9.46 MiB | 18.91 MiB/s Receiving objects: 12% (12374/103115), 9.46 MiB | 18.91 MiB/s Receiving objects: 13% (13405/103115), 9.46 MiB | 18.91 MiB/s Receiving objects: 14% (14437/103115), 9.46 MiB | 18.91 MiB/s Receiving objects: 15% (15468/103115), 9.46 MiB | 18.91 MiB/s Receiving objects: 16% (16499/103115), 9.46 MiB | 18.91 MiB/s Receiving objects: 17% (17530/103115), 9.46 MiB | 18.91 MiB/s Receiving objects: 18% (18561/103115), 9.46 MiB | 18.91 MiB/s Receiving objects: 19% (19592/103115), 9.46 MiB | 18.91 MiB/s Receiving objects: 20% (20623/103115), 9.46 MiB | 18.91 MiB/s Receiving objects: 21% (21655/103115), 9.46 MiB | 18.91 MiB/s Receiving objects: 21% (22587/103115), 23.95 MiB | 23.94 MiB/s Receiving objects: 22% (22686/103115), 23.95 MiB | 23.94 MiB/s Receiving objects: 23% (23717/103115), 23.95 MiB | 23.94 MiB/s Receiving objects: 24% (24748/103115), 23.95 MiB | 23.94 MiB/s Receiving objects: 25% (25779/103115), 23.95 MiB | 23.94 MiB/s Receiving objects: 26% (26810/103115), 23.95 MiB | 23.94 MiB/s Receiving objects: 27% (27842/103115), 23.95 MiB | 23.94 MiB/s Receiving objects: 28% (28873/103115), 23.95 MiB | 23.94 MiB/s Receiving objects: 29% (29904/103115), 23.95 MiB | 23.94 MiB/s Receiving objects: 30% (30935/103115), 23.95 MiB | 23.94 MiB/s Receiving objects: 31% (31966/103115), 23.95 MiB | 23.94 MiB/s Receiving objects: 32% (32997/103115), 23.95 MiB | 23.94 MiB/s Receiving objects: 33% (34028/103115), 23.95 MiB | 23.94 MiB/s Receiving objects: 34% (35060/103115), 32.78 MiB | 21.86 MiB/s Receiving objects: 35% (36091/103115), 32.78 MiB | 21.86 MiB/s Receiving objects: 36% (37122/103115), 32.78 MiB | 21.86 MiB/s Receiving objects: 37% (38153/103115), 32.78 MiB | 21.86 MiB/s Receiving objects: 37% (38810/103115), 32.78 MiB | 21.86 MiB/s Receiving objects: 38% (39184/103115), 44.25 MiB | 22.13 MiB/s Receiving objects: 39% (40215/103115), 44.25 MiB | 22.13 MiB/s Receiving objects: 40% (41246/103115), 44.25 MiB | 22.13 MiB/s Receiving objects: 41% (42278/103115), 44.25 MiB | 22.13 MiB/s Receiving objects: 42% (43309/103115), 44.25 MiB | 22.13 MiB/s Receiving objects: 43% (44340/103115), 44.25 MiB | 22.13 MiB/s Receiving objects: 44% (45371/103115), 44.25 MiB | 22.13 MiB/s Receiving objects: 45% (46402/103115), 44.25 MiB | 22.13 MiB/s Receiving objects: 46% (47433/103115), 57.26 MiB | 22.90 MiB/s Receiving objects: 47% (48465/103115), 57.26 MiB | 22.90 MiB/s Receiving objects: 48% (49496/103115), 57.26 MiB | 22.90 MiB/s Receiving objects: 48% (50282/103115), 70.66 MiB | 23.55 MiB/s Receiving objects: 49% (50527/103115), 70.66 MiB | 23.55 MiB/s Receiving objects: 50% (51558/103115), 70.66 MiB | 23.55 MiB/s Receiving objects: 51% (52589/103115), 70.66 MiB | 23.55 MiB/s Receiving objects: 52% (53620/103115), 70.66 MiB | 23.55 MiB/s Receiving objects: 53% (54651/103115), 70.66 MiB | 23.55 MiB/s Receiving objects: 54% (55683/103115), 70.66 MiB | 23.55 MiB/s Receiving objects: 55% (56714/103115), 70.66 MiB | 23.55 MiB/s Receiving objects: 55% (57067/103115), 97.27 MiB | 24.30 MiB/s Receiving objects: 55% (57133/103115), 125.53 MiB | 25.78 MiB/s Receiving objects: 55% (57227/103115), 157.54 MiB | 27.70 MiB/s Receiving objects: 56% (57745/103115), 157.54 MiB | 27.70 MiB/s Receiving objects: 57% (58776/103115), 157.54 MiB | 27.70 MiB/s Receiving objects: 58% (59807/103115), 157.54 MiB | 27.70 MiB/s Receiving objects: 59% (60838/103115), 157.54 MiB | 27.70 MiB/s Receiving objects: 60% (61869/103115), 157.54 MiB | 27.70 MiB/s Receiving objects: 61% (62901/103115), 172.27 MiB | 28.42 MiB/s Receiving objects: 62% (63932/103115), 172.27 MiB | 28.42 MiB/s Receiving objects: 62% (64425/103115), 181.93 MiB | 27.69 MiB/s Receiving objects: 63% (64963/103115), 181.93 MiB | 27.69 MiB/s Receiving objects: 64% (65994/103115), 181.93 MiB | 27.69 MiB/s Receiving objects: 65% (67025/103115), 181.93 MiB | 27.69 MiB/s Receiving objects: 66% (68056/103115), 181.93 MiB | 27.69 MiB/s Receiving objects: 67% (69088/103115), 181.93 MiB | 27.69 MiB/s Receiving objects: 68% (70119/103115), 181.93 MiB | 27.69 MiB/s Receiving objects: 69% (71150/103115), 181.93 MiB | 27.69 MiB/s Receiving objects: 70% (72181/103115), 181.93 MiB | 27.69 MiB/s Receiving objects: 71% (73212/103115), 181.93 MiB | 27.69 MiB/s Receiving objects: 72% (74243/103115), 199.48 MiB | 28.61 MiB/s Receiving objects: 73% (75274/103115), 199.48 MiB | 28.61 MiB/s Receiving objects: 74% (76306/103115), 199.48 MiB | 28.61 MiB/s Receiving objects: 74% (76591/103115), 213.83 MiB | 28.57 MiB/s Receiving objects: 75% (77337/103115), 228.61 MiB | 29.18 MiB/s Receiving objects: 76% (78368/103115), 228.61 MiB | 29.18 MiB/s Receiving objects: 77% (79399/103115), 228.61 MiB | 29.18 MiB/s Receiving objects: 78% (80430/103115), 228.61 MiB | 29.18 MiB/s Receiving objects: 78% (81227/103115), 228.61 MiB | 29.18 MiB/s Receiving objects: 79% (81461/103115), 242.68 MiB | 29.11 MiB/s Receiving objects: 80% (82492/103115), 242.68 MiB | 29.11 MiB/s Receiving objects: 81% (83524/103115), 242.68 MiB | 29.11 MiB/s Receiving objects: 81% (84197/103115), 258.23 MiB | 29.48 MiB/s Receiving objects: 81% (84529/103115), 306.39 MiB | 29.79 MiB/s Receiving objects: 82% (84555/103115), 306.39 MiB | 29.79 MiB/s Receiving objects: 83% (85586/103115), 319.87 MiB | 30.63 MiB/s Receiving objects: 84% (86617/103115), 319.87 MiB | 30.63 MiB/s Receiving objects: 85% (87648/103115), 319.87 MiB | 30.63 MiB/s Receiving objects: 85% (87908/103115), 319.87 MiB | 30.63 MiB/s Receiving objects: 86% (88679/103115), 331.48 MiB | 29.32 MiB/s Receiving objects: 87% (89711/103115), 331.48 MiB | 29.32 MiB/s Receiving objects: 88% (90742/103115), 331.48 MiB | 29.32 MiB/s Receiving objects: 88% (91587/103115), 353.40 MiB | 27.72 MiB/s Receiving objects: 89% (91773/103115), 367.75 MiB | 27.77 MiB/s Receiving objects: 89% (91850/103115), 367.75 MiB | 27.77 MiB/s Receiving objects: 90% (92804/103115), 381.02 MiB | 27.27 MiB/s Receiving objects: 91% (93835/103115), 381.02 MiB | 27.27 MiB/s Receiving objects: 92% (94866/103115), 381.02 MiB | 27.27 MiB/s Receiving objects: 93% (95897/103115), 381.02 MiB | 27.27 MiB/s Receiving objects: 94% (96929/103115), 381.02 MiB | 27.27 MiB/s Receiving objects: 95% (97960/103115), 381.02 MiB | 27.27 MiB/s Receiving objects: 96% (98991/103115), 381.02 MiB | 27.27 MiB/s Receiving objects: 97% (100022/103115), 381.02 MiB | 27.27 MiB/s Receiving objects: 98% (101053/103115), 381.02 MiB | 27.27 MiB/s Receiving objects: 99% (102084/103115), 381.02 MiB | 27.27 MiB/s remote: Total 103115 (delta 8205), reused 7525 (delta 7420), pack-reused 93607 (from 4)
  7. 19.58 s Receiving objects: 100% (103115/103115), 381.02 MiB | 27.27 MiB/s Receiving objects: 100% (103115/103115), 391.59 MiB | 27.15 MiB/s, done.
  8. 21.62 s Resolving deltas: 0% (0/67560) Resolving deltas: 1% (676/67560) Resolving deltas: 2% (1352/67560) Resolving deltas: 3% (2027/67560) Resolving deltas: 4% (2703/67560) Resolving deltas: 5% (3378/67560) Resolving deltas: 6% (4058/67560) Resolving deltas: 7% (4730/67560) Resolving deltas: 8% (5405/67560) Resolving deltas: 9% (6081/67560) Resolving deltas: 10% (6756/67560) Resolving deltas: 11% (7433/67560) Resolving deltas: 12% (8108/67560) Resolving deltas: 13% (8783/67560) Resolving deltas: 14% (9459/67560) Resolving deltas: 15% (10134/67560) Resolving deltas: 16% (10810/67560) Resolving deltas: 17% (11486/67560) Resolving deltas: 18% (12161/67560) Resolving deltas: 19% (12839/67560) Resolving deltas: 20% (13513/67560) Resolving deltas: 21% (14188/67560) Resolving deltas: 22% (14864/67560) Resolving deltas: 23% (15539/67560) Resolving deltas: 24% (16215/67560) Resolving deltas: 25% (16890/67560) Resolving deltas: 26% (17566/67560) Resolving deltas: 27% (18244/67560) Resolving deltas: 28% (18917/67560) Resolving deltas: 29% (19594/67560) Resolving deltas: 30% (20268/67560) Resolving deltas: 31% (20944/67560) Resolving deltas: 32% (21620/67560) Resolving deltas: 33% (22295/67560) Resolving deltas: 34% (22972/67560) Resolving deltas: 35% (23646/67560) Resolving deltas: 36% (24322/67560) Resolving deltas: 37% (24998/67560) Resolving deltas: 38% (25673/67560) Resolving deltas: 39% (26349/67560) Resolving deltas: 40% (27024/67560) Resolving deltas: 41% (27700/67560) Resolving deltas: 42% (28376/67560) Resolving deltas: 43% (29052/67560) Resolving deltas: 44% (29727/67560) Resolving deltas: 45% (30402/67560) Resolving deltas: 46% (31078/67560) Resolving deltas: 47% (31754/67560) Resolving deltas: 48% (32430/67560) Resolving deltas: 49% (33105/67560) Resolving deltas: 50% (33780/67560) Resolving deltas: 51% (34458/67560) Resolving deltas: 52% (35132/67560) Resolving deltas: 53% (35808/67560) Resolving deltas: 54% (36483/67560) Resolving deltas: 55% (37158/67560) Resolving deltas: 56% (37834/67560) Resolving deltas: 57% (38510/67560) Resolving deltas: 58% (39185/67560) Resolving deltas: 59% (39861/67560) Resolving deltas: 60% (40536/67560) Resolving deltas: 61% (41212/67560) Resolving deltas: 62% (41888/67560) Resolving deltas: 63% (42563/67560) Resolving deltas: 64% (43239/67560) Resolving deltas: 65% (43914/67560) Resolving deltas: 66% (44590/67560) Resolving deltas: 67% (45266/67560) Resolving deltas: 68% (45941/67560) Resolving deltas: 69% (46617/67560) Resolving deltas: 70% (47293/67560) Resolving deltas: 71% (47968/67560) Resolving deltas: 72% (48644/67560) Resolving deltas: 73% (49319/67560) Resolving deltas: 74% (49995/67560) Resolving deltas: 75% (50670/67560) Resolving deltas: 76% (51346/67560) Resolving deltas: 77% (52023/67560) Resolving deltas: 78% (52697/67560) Resolving deltas: 79% (53373/67560) Resolving deltas: 80% (54048/67560) Resolving deltas: 81% (54724/67560) Resolving deltas: 82% (55400/67560) Resolving deltas: 83% (56075/67560) Resolving deltas: 84% (56751/67560) Resolving deltas: 85% (57427/67560) Resolving deltas: 86% (58103/67560) Resolving deltas: 87% (58778/67560) Resolving deltas: 88% (59453/67560) Resolving deltas: 89% (60129/67560) Resolving deltas: 90% (60804/67560) Resolving deltas: 91% (61480/67560) Resolving deltas: 92% (62156/67560) Resolving deltas: 93% (62831/67560) Resolving deltas: 94% (63507/67560) Resolving deltas: 95% (64182/67560) Resolving deltas: 96% (64858/67560) Resolving deltas: 97% (65534/67560) Resolving deltas: 98% (66209/67560) Resolving deltas: 98% (66569/67560) Resolving deltas: 99% (66885/67560) Resolving deltas: 100% (67560/67560) Resolving deltas: 100% (67560/67560), done.
  9. 22.99 s Fetching commit e825dd904bec36e475ba5e4734659c1f4762247e for feynkit ...
  10. 22.99 s $ /nix/store/5vpcfsdx1lcnlb2y4k7xyc74shp5qwbh-git-2.54.0/bin/git fetch origin e825dd904bec36e475ba5e4734659c1f4762247e
  11. 23.49 s From https://github.com/alphal00p/gammaloop
  12. 23.49 s * branch e825dd904bec36e475ba5e4734659c1f4762247e -> FETCH_HEAD
  13. 23.51 s $ /nix/store/61685rbaxmpigwi3z23i33sv3jyfl70q-coreutils-9.11/bin/timeout --kill-after=15s 7200s /nix/store/5vpcfsdx1lcnlb2y4k7xyc74shp5qwbh-git-2.54.0/bin/git -c advice.detachedHead=false checkout e825dd904bec36e475ba5e4734659c1f4762247e
  14. 23.98 s HEAD is now at e825dd904 expose generation progress and live Python filters
  15. 23.99 s $ /nix/store/61685rbaxmpigwi3z23i33sv3jyfl70q-coreutils-9.11/bin/timeout --kill-after=15s 7200s /nix/store/wknkybkzrc16r11vk5vrykh4wmw7a353-nix-2.34.8/bin/nix --extra-experimental-features nix-command --extra-experimental-features flakes --log-format internal-json run .#packages.x86_64-linux.nix-ci-check-gammaloop-nextest-core --print-build-logs
  16. 24.24 s warning: ignoring untrusted flake configuration setting 'extra-substituters'.
  17. 24.24 s Pass '--accept-flake-config' to trust it
  18. 24.24 s warning: ignoring untrusted flake configuration setting 'extra-trusted-public-keys'.
  19. 24.24 s Pass '--accept-flake-config' to trust it
  20. 30.70 s
  21. 31.11 s evaluating derivation 'gdo you want to allow configuration setting 'extra-substituters' to be set to 'https://cache.nix-ci.com' (y/N)? do you want to permanently mark this value as untrusted (y/N)? warning: ignoring untrusted flake configuration setting 'extra-substituters'.
  22. 31.11 s Pass '--accept-flake-config' to trust it
  23. 31.11 s do you want to allow configuration setting 'extra-trusted-public-keys' to be set to 'nix-ci:g3xV5BDTLtIBZr/A00IU1x0EtKKlb7YLgBN2SgYgM6A=' (y/N)? do you want to permanently mark this value as untrusted (y/N)? warning: ignoring untrusted flake configuration setting 'extra-trusted-public-keys'.
  24. 31.11 s Pass '--accept-flake-config' to trust it
  25. 41.91 s copying '/nix/store/wli3 evaluating derivation 'g copying '/nix/store/wli3 evaluating derivation 'g copying '/nix/store/wli3 evaluating derivation 'g copying '/nix/store/wli3 evaluating derivation 'g copying '/nix/store/wli3 evaluating derivation 'g copying '/nix/store/wli3 evaluating derivation 'g copying '/nix/store/wli3 evaluating derivation 'g copying '/nix/store/wli3 evaluating derivation 'g copying '/nix/store/wli3 evaluating derivation 'g copying '/nix/store/wli3 evaluating derivation 'g copying '/nix/store/wli3 evaluating derivation 'g copying '/nix/store/wli3 evaluating derivation 'g copying '/nix/store/wli3 evaluating derivation 'g querying gammaloop-nexte [0.0 KiB DL] querying in [0/7 built, 5/0/5 copied [0/6 built, 4/1/5 copied [0/5 built, 3/2/5 copied [0/4 built, 2/3/5 copied [0/3 built, 1/4/5 copied [0/2 built, 5 copied (18 [1/0/2 built, 5 copied (gammaloop-nextest-binaries-core (post)> Uploading to the NixCI cache: /nix/store/d3wv1z02fkn5am9jbrw5pbq395jjv94h-gammaloop-nextest-binaries-core
  26. 42.22 s gammaloop-nextest-binaries-core (post)> warning: 'warn-short-path-literals' is deprecated, use 'lint-short-path-literals = ignore' instead
  27. 42.34 s gammaloop-nextest-binaries-core (post)> copying 0 paths...
  28. 42.78 s gammaloop-nextest-binaries-core (post)> warning: 'warn-short-path-literals' is deprecated, use 'lint-short-path-literals = ignore' instead
  29. 42.97 s gammaloop-nextest-binaries-core (post)> copying 0 paths...
  30. 43.40 s [1/3 built, 5 copied (18 [1/1/2 built, 5 copied (gammaloop-nextest-core> Extracting 4 binaries (including 2 non-test binaries), 1 build script output directory, and 2 linked paths to /build/source
  31. 43.95 s gammaloop-nextest-core> Extracted 20 files to /build/source in 0.56s
  32. 43.96 s gammaloop-nextest-core> ------------
  33. 43.96 s gammaloop-nextest-core> Nextest run ID 87da67d8-0c92-4873-9848-d4e8a3abc7c1 with nextest profile: ci_gammaloop
  34. 43.96 s gammaloop-nextest-core> Starting 341 tests across 2 binaries (1 test skipped)
  35. 44.52 s gammaloop-nextest-core> ------------
  36. 44.52 s gammaloop-nextest-core> Summary [ 0.551s] 341 tests run: 341 passed, 1 skipped
  37. 44.56 s gammaloop-nextest-core>
  38. 44.56 s gammaloop-nextest-core> ========== nextest test summary ==========
  39. 44.56 s gammaloop-nextest-core> report: target/nextest/ci_gammaloop/junit.xml
  40. 44.56 s gammaloop-nextest-core> tests: 341, failures: 0, errors: 0
  41. 44.56 s gammaloop-nextest-core> No failing testcases found.
  42. 44.56 s gammaloop-nextest-core> =========================================
  43. 44.57 s gammaloop-nextest-core> Extracting 1 binary and 1 linked path to /build/source
  44. 44.66 s gammaloop-nextest-core> Extracted 7 files to /build/source in 0.09s
  45. 44.67 s gammaloop-nextest-core> ------------
  46. 44.67 s gammaloop-nextest-core> Nextest run ID 5a34b0bb-1d82-4a1a-a0fb-db5113bcc5b2 with nextest profile: ci_gammaloop
  47. 44.67 s gammaloop-nextest-core> Starting 19 tests across 1 binary
  48. 44.69 s gammaloop-nextest-core> ------------
  49. 44.69 s gammaloop-nextest-core> Summary [ 0.013s] 19 tests run: 19 passed, 0 skipped
  50. 44.72 s gammaloop-nextest-core>
  51. 44.72 s gammaloop-nextest-core> ========== nextest test summary ==========
  52. 44.72 s gammaloop-nextest-core> report: target/nextest/ci_gammaloop/junit.xml
  53. 44.72 s gammaloop-nextest-core> tests: 19, failures: 0, errors: 0
  54. 44.72 s gammaloop-nextest-core> No failing testcases found.
  55. 44.72 s gammaloop-nextest-core> =========================================
  56. 44.74 s gammaloop-nextest-core> Extracting 1 binary to /build/source
  57. 44.78 s gammaloop-nextest-core> Extracted 4 files to /build/source in 0.04s
  58. 44.79 s gammaloop-nextest-core> ------------
  59. 44.79 s gammaloop-nextest-core> Nextest run ID e67da5b8-9f23-4b93-ab6f-5318381a76c6 with nextest profile: ci_gammaloop
  60. 44.79 s gammaloop-nextest-core> Starting 0 tests across 1 binary
  61. 44.79 s gammaloop-nextest-core> ------------
  62. 44.79 s gammaloop-nextest-core> Summary [ 0.000s] 0 tests run: 0 passed, 0 skipped
  63. 44.82 s gammaloop-nextest-core>
  64. 44.82 s gammaloop-nextest-core> ========== nextest test summary ==========
  65. 44.82 s gammaloop-nextest-core> report: target/nextest/ci_gammaloop/junit.xml
  66. 44.82 s gammaloop-nextest-core> tests: 0, failures: 0, errors: 0
  67. 44.82 s gammaloop-nextest-core> No failing testcases found.
  68. 44.82 s gammaloop-nextest-core> =========================================
  69. 44.84 s gammaloop-nextest-core> Extracting 4 binaries (including 1 non-test binary), 1 build script output directory, and 2 linked paths to /build/source
  70. 45.41 s gammaloop-nextest-core> Extracted 19 files to /build/source in 0.57s
  71. 45.42 s gammaloop-nextest-core> ------------
  72. 45.42 s gammaloop-nextest-core> Nextest run ID 082ac841-72bd-4af5-90d7-2c6c7e09c036 with nextest profile: ci_gammaloop
  73. 45.42 s gammaloop-nextest-core> Starting 421 tests across 3 binaries (31 tests skipped, including 30 tests via profile.ci_gammaloop.default-filter)
  74. 46.27 s gammaloop-nextest-core> FAIL [ 0.087s] (366/421) gammalooprs utils::test_utils::normalization
  75. 46.27 s gammaloop-nextest-core> stdout ---
  76. 46.27 s gammaloop-nextest-core>
  77. 46.27 s gammaloop-nextest-core> running 1 test
  78. 46.27 s gammaloop-nextest-core> ━━━━━━━━━━━━━━━━━━━━━━━━━━━━━━━ Snapshot Summary ━━━━━━━━━━━━━━━━━━━━━━━━━━━━━━━
  79. 46.27 s gammaloop-nextest-core> Snapshot: normalization-2
  80. 46.27 s gammaloop-nextest-core> Source: crates/gammalooprs/src/utils/test_utils.rs:44
  81. 46.27 s gammaloop-nextest-core> ────────────────────────────────────────────────────────────────────────────────
  82. 46.27 s gammaloop-nextest-core> Expression: b.to_canonical_string()
  83. 46.27 s gammaloop-nextest-core> ────────────────────────────────────────────────────────────────────────────────
  84. 46.27 s gammaloop-nextest-core> -old snapshot
  85. 46.27 s gammaloop-nextest-core> +new results
  86. 46.27 s gammaloop-nextest-core> ────────────┬───────────────────────────────────────────────────────────────────
  87. 46.27 s gammaloop-nextest-core> 1 │-gammalooprs::{spenso::rank1,spenso::tensor}::Q(1,spenso::{}::cind(1))
  88. 46.27 s gammaloop-nextest-core> 1 │+gammalooprs::{spenso::rank1,spenso::tensor,spenso::tensor-label:q}::Q(1,spenso::{}::cind(1))
  89. 46.27 s gammaloop-nextest-core> ────────────┴───────────────────────────────────────────────────────────────────
  90. 46.27 s gammaloop-nextest-core> To update snapshots run `cargo insta review`
  91. 46.27 s gammaloop-nextest-core> Stopped on the first failure. Run `cargo insta test` to run all snapshots.
  92. 46.27 s gammaloop-nextest-core> test utils::test_utils::normalization ... FAILED
  93. 46.27 s gammaloop-nextest-core>
  94. 46.27 s gammaloop-nextest-core> failures:
  95. 46.27 s gammaloop-nextest-core>
  96. 46.27 s gammaloop-nextest-core> failures:
  97. 46.27 s gammaloop-nextest-core> utils::test_utils::normalization
  98. 46.27 s gammaloop-nextest-core>
  99. 46.27 s gammaloop-nextest-core> test result: FAILED. 0 passed; 1 failed; 0 ignored; 0 measured; 445 filtered out; finished in 0.08s
  100. 46.27 s gammaloop-nextest-core>
  101. 46.27 s gammaloop-nextest-core> stderr ---
  102. 46.27 s gammaloop-nextest-core>
  103. 46.27 s gammaloop-nextest-core> thread 'utils::test_utils::normalization' (2235) panicked at /nix/store/c7lwckzlfrfsdw1ay0aqz4dpc2j7ry8d-vendor-cargo-deps/c19b7c6f923b580ac259164a89f2577984ad5ab09ee9d583b888f934adbbe8d0/insta-1.47.2/src/runtime.rs:719:13:
  104. 46.27 s gammaloop-nextest-core> snapshot assertion for 'normalization-2' failed in line 44
  105. 46.27 s gammaloop-nextest-core> stack backtrace:
  106. 46.27 s gammaloop-nextest-core> 0: __rustc::rust_begin_unwind
  107. 46.27 s gammaloop-nextest-core> 1: core::panicking::panic_fmt
  108. 46.27 s gammaloop-nextest-core> 2: insta::runtime::assert_snapshot
  109. 46.27 s gammaloop-nextest-core> 3: gammalooprs::utils::test_utils::normalization
  110. 46.27 s gammaloop-nextest-core> 4: <gammalooprs::utils::test_utils::normalization::{closure#0} as core::ops::function::FnOnce<()>>::call_once
  111. 46.27 s gammaloop-nextest-core> note: Some details are omitted, run with `RUST_BACKTRACE=full` for a verbose backtrace.
  112. 46.27 s gammaloop-nextest-core>
  113. 52.89 s gammaloop-nextest-core> ------------
  114. 52.89 s gammaloop-nextest-core> Summary [ 7.468s] 421 tests run: 420 passed, 1 failed, 31 skipped
  115. 52.89 s gammaloop-nextest-core> FAIL [ 0.087s] (366/421) gammalooprs utils::test_utils::normalization
  116. 52.89 s gammaloop-nextest-core> stdout ---
  117. 52.89 s gammaloop-nextest-core>
  118. 52.89 s gammaloop-nextest-core> running 1 test
  119. 52.89 s gammaloop-nextest-core> ━━━━━━━━━━━━━━━━━━━━━━━━━━━━━━━ Snapshot Summary ━━━━━━━━━━━━━━━━━━━━━━━━━━━━━━━
  120. 52.89 s gammaloop-nextest-core> Snapshot: normalization-2
  121. 52.89 s gammaloop-nextest-core> Source: crates/gammalooprs/src/utils/test_utils.rs:44
  122. 52.89 s gammaloop-nextest-core> ────────────────────────────────────────────────────────────────────────────────
  123. 52.89 s gammaloop-nextest-core> Expression: b.to_canonical_string()
  124. 52.89 s gammaloop-nextest-core> ────────────────────────────────────────────────────────────────────────────────
  125. 52.89 s gammaloop-nextest-core> -old snapshot
  126. 52.89 s gammaloop-nextest-core> +new results
  127. 52.89 s gammaloop-nextest-core> ────────────┬───────────────────────────────────────────────────────────────────
  128. 52.89 s gammaloop-nextest-core> 1 │-gammalooprs::{spenso::rank1,spenso::tensor}::Q(1,spenso::{}::cind(1))
  129. 52.89 s gammaloop-nextest-core> 1 │+gammalooprs::{spenso::rank1,spenso::tensor,spenso::tensor-label:q}::Q(1,spenso::{}::cind(1))
  130. 52.89 s gammaloop-nextest-core> ────────────┴───────────────────────────────────────────────────────────────────
  131. 52.89 s gammaloop-nextest-core> To update snapshots run `cargo insta review`
  132. 52.89 s gammaloop-nextest-core> Stopped on the first failure. Run `cargo insta test` to run all snapshots.
  133. 52.89 s gammaloop-nextest-core> test utils::test_utils::normalization ... FAILED
  134. 52.89 s gammaloop-nextest-core>
  135. 52.89 s gammaloop-nextest-core> failures:
  136. 52.89 s gammaloop-nextest-core>
  137. 52.89 s gammaloop-nextest-core> failures:
  138. 52.89 s gammaloop-nextest-core> utils::test_utils::normalization
  139. 52.89 s gammaloop-nextest-core>
  140. 52.89 s gammaloop-nextest-core> test result: FAILED. 0 passed; 1 failed; 0 ignored; 0 measured; 445 filtered out; finished in 0.08s
  141. 52.89 s gammaloop-nextest-core>
  142. 52.89 s gammaloop-nextest-core> stderr ---
  143. 52.89 s gammaloop-nextest-core>
  144. 52.89 s gammaloop-nextest-core> thread 'utils::test_utils::normalization' (2235) panicked at /nix/store/c7lwckzlfrfsdw1ay0aqz4dpc2j7ry8d-vendor-cargo-deps/c19b7c6f923b580ac259164a89f2577984ad5ab09ee9d583b888f934adbbe8d0/insta-1.47.2/src/runtime.rs:719:13:
  145. 52.89 s gammaloop-nextest-core> snapshot assertion for 'normalization-2' failed in line 44
  146. 52.89 s gammaloop-nextest-core> stack backtrace:
  147. 52.89 s gammaloop-nextest-core> 0: __rustc::rust_begin_unwind
  148. 52.89 s gammaloop-nextest-core> 1: core::panicking::panic_fmt
  149. 52.89 s gammaloop-nextest-core> 2: insta::runtime::assert_snapshot
  150. 52.89 s gammaloop-nextest-core> 3: gammalooprs::utils::test_utils::normalization
  151. 52.89 s gammaloop-nextest-core> 4: <gammalooprs::utils::test_utils::normalization::{closure#0} as core::ops::function::FnOnce<()>>::call_once
  152. 52.89 s gammaloop-nextest-core> note: Some details are omitted, run with `RUST_BACKTRACE=full` for a verbose backtrace.
  153. 52.89 s gammaloop-nextest-core>
  154. 52.90 s gammaloop-nextest-core> error: test run failed
  155. 52.92 s gammaloop-nextest-core>
  156. 52.92 s gammaloop-nextest-core> ========== nextest test summary ==========
  157. 52.92 s gammaloop-nextest-core> report: target/nextest/ci_gammaloop/junit.xml
  158. 52.92 s gammaloop-nextest-core> tests: 421, failures: 1, errors: 0
  159. 52.92 s gammaloop-nextest-core>
  160. 52.92 s gammaloop-nextest-core> 1. gammalooprs::utils::test_utils::normalization
  161. 52.92 s gammaloop-nextest-core> failure: test failure with exit code 101
  162. 52.92 s gammaloop-nextest-core> thread 'utils::test_utils::normalization' (2235) panicked at /nix/store/c7lwckzlfrfsdw1ay0aqz4dpc2j7ry8d-vendor-cargo-deps/c19b7c6f923b580ac259164a89f2577984ad5ab09ee9d583b888f934adbbe8d0/insta-1.47.2/src/runtime.rs:719:13:
  163. 52.92 s gammaloop-nextest-core> snapshot assertion for 'normalization-2' failed in line 44
  164. 52.92 s gammaloop-nextest-core> stack backtrace:
  165. 52.92 s gammaloop-nextest-core> 0: __rustc::rust_begin_unwind
  166. 52.92 s gammaloop-nextest-core> 1: core::panicking::panic_fmt
  167. 52.92 s gammaloop-nextest-core> 2: insta::runtime::assert_snapshot
  168. 52.92 s gammaloop-nextest-core> 3: gammalooprs::utils::test_utils::normalization
  169. 52.92 s gammaloop-nextest-core> 4: <gammalooprs::utils::test_utils::normalization::{closure#0} as core::ops::function::FnOnce<()>>::call_once
  170. 52.92 s gammaloop-nextest-core> note: Some details are omitted, run with `RUST_BACKTRACE=full` for a verbose backtrace.
  171. 52.92 s gammaloop-nextest-core> system-out
  172. 52.92 s gammaloop-nextest-core> running 1 test
  173. 52.92 s gammaloop-nextest-core> ━━━━━━━━━━━━━━━━━━━━━━━━━━━━━━━ Snapshot Summary ━━━━━━━━━━━━━━━━━━━━━━━━━━━━━━━
  174. 52.92 s gammaloop-nextest-core> Snapshot: normalization-2
  175. 52.92 s gammaloop-nextest-core> Source: crates/gammalooprs/src/utils/test_utils.rs:44
  176. 52.92 s gammaloop-nextest-core> ────────────────────────────────────────────────────────────────────────────────
  177. 52.92 s gammaloop-nextest-core> Expression: b.to_canonical_string()
  178. 52.92 s gammaloop-nextest-core> ────────────────────────────────────────────────────────────────────────────────
  179. 52.92 s gammaloop-nextest-core> -old snapshot
  180. 52.92 s gammaloop-nextest-core> +new results
  181. 52.92 s gammaloop-nextest-core> ────────────┬───────────────────────────────────────────────────────────────────
  182. 52.92 s gammaloop-nextest-core> 1 │-gammalooprs::{spenso::rank1,spenso::tensor}::Q(1,spenso::{}::cind(1))
  183. 52.92 s gammaloop-nextest-core> 1 │+gammalooprs::{spenso::rank1,spenso::tensor,spenso::tensor-label:q}::Q(1,spenso::{}::cind(1))
  184. 52.92 s gammaloop-nextest-core> ────────────┴───────────────────────────────────────────────────────────────────
  185. 52.92 s gammaloop-nextest-core> To update snapshots run `cargo insta review`
  186. 52.92 s gammaloop-nextest-core> Stopped on the first failure. Run `cargo insta test` to run all snapshots.
  187. 52.92 s gammaloop-nextest-core> test utils::test_utils::normalization ... FAILED
  188. 52.92 s gammaloop-nextest-core>
  189. 52.92 s gammaloop-nextest-core> failures:
  190. 52.92 s gammaloop-nextest-core>
  191. 52.92 s gammaloop-nextest-core> failures:
  192. 52.92 s gammaloop-nextest-core> utils::test_utils::normalization
  193. 52.92 s gammaloop-nextest-core>
  194. 52.92 s gammaloop-nextest-core> test result: FAILED. 0 passed; 1 failed; 0 ignored; 0 measured; 445 filtered out; finished in 0.08s
  195. 52.92 s gammaloop-nextest-core> system-err
  196. 52.92 s gammaloop-nextest-core> thread 'utils::test_utils::normalization' (2235) panicked at /nix/store/c7lwckzlfrfsdw1ay0aqz4dpc2j7ry8d-vendor-cargo-deps/c19b7c6f923b580ac259164a89f2577984ad5ab09ee9d583b888f934adbbe8d0/insta-1.47.2/src/runtime.rs:719:13:
  197. 52.92 s gammaloop-nextest-core> snapshot assertion for 'normalization-2' failed in line 44
  198. 52.92 s gammaloop-nextest-core> stack backtrace:
  199. 52.92 s gammaloop-nextest-core> 0: __rustc::rust_begin_unwind
  200. 52.92 s gammaloop-nextest-core> 1: core::panicking::panic_fmt
  201. 52.92 s gammaloop-nextest-core> 2: insta::runtime::assert_snapshot
  202. 52.92 s gammaloop-nextest-core> 3: gammalooprs::utils::test_utils::normalization
  203. 52.92 s gammaloop-nextest-core> 4: <gammalooprs::utils::test_utils::normalization::{closure#0} as core::ops::function::FnOnce<()>>::call_once
  204. 52.92 s gammaloop-nextest-core> note: Some details are omitted, run with `RUST_BACKTRACE=full` for a verbose backtrace.
  205. 52.92 s gammaloop-nextest-core> =========================================
  206. 53.10 s error: Cannot build '/nix/store/l52j9zy411yz62lvl4219gkr5z2l9zhq-gammaloop-nextest-core.drv'.
  207. 53.10 s Reason: builder failed with exit code 100.
  208. 53.10 s Output paths:
  209. 53.10 s /nix/store/bafxvy9fy868lgw50y1gdd9zrfk0pb6a-gammaloop-nextest-core
  210. 53.10 s Last 176 log lines:
  211. 53.10 s > Extracting 4 binaries (including 2 non-test binaries), 1 build script output directory, and 2 linked paths to /build/source
  212. 53.10 s > Extracted 20 files to /build/source in 0.56s
  213. 53.10 s > ------------
  214. 53.10 s > Nextest run ID 87da67d8-0c92-4873-9848-d4e8a3abc7c1 with nextest profile: ci_gammaloop
  215. 53.10 s > Starting 341 tests across 2 binaries (1 test skipped)
  216. 53.10 s > ------------
  217. 53.10 s > Summary [ 0.551s] 341 tests run: 341 passed, 1 skipped
  218. 53.10 s >
  219. 53.10 s > ========== nextest test summary ==========
  220. 53.10 s > report: target/nextest/ci_gammaloop/junit.xml
  221. 53.10 s > tests: 341, failures: 0, errors: 0
  222. 53.10 s > No failing testcases found.
  223. 53.10 s > =========================================
  224. 53.10 s > Extracting 1 binary and 1 linked path to /build/source
  225. 53.10 s > Extracted 7 files to /build/source in 0.09s
  226. 53.10 s > ------------
  227. 53.10 s > Nextest run ID 5a34b0bb-1d82-4a1a-a0fb-db5113bcc5b2 with nextest profile: ci_gammaloop
  228. 53.10 s > Starting 19 tests across 1 binary
  229. 53.10 s > ------------
  230. 53.10 s > Summary [ 0.013s] 19 tests run: 19 passed, 0 skipped
  231. 53.10 s >
  232. 53.10 s > ========== nextest test summary ==========
  233. 53.10 s > report: target/nextest/ci_gammaloop/junit.xml
  234. 53.10 s > tests: 19, failures: 0, errors: 0
  235. 53.10 s > No failing testcases found.
  236. 53.10 s > =========================================
  237. 53.10 s > Extracting 1 binary to /build/source
  238. 53.10 s > Extracted 4 files to /build/source in 0.04s
  239. 53.10 s > ------------
  240. 53.10 s > Nextest run ID e67da5b8-9f23-4b93-ab6f-5318381a76c6 with nextest profile: ci_gammaloop
  241. 53.10 s > Starting 0 tests across 1 binary
  242. 53.10 s > ------------
  243. 53.10 s > Summary [ 0.000s] 0 tests run: 0 passed, 0 skipped
  244. 53.10 s >
  245. 53.10 s > ========== nextest test summary ==========
  246. 53.10 s > report: target/nextest/ci_gammaloop/junit.xml
  247. 53.10 s > tests: 0, failures: 0, errors: 0
  248. 53.10 s > No failing testcases found.
  249. 53.10 s > =========================================
  250. 53.10 s > Extracting 4 binaries (including 1 non-test binary), 1 build script output directory, and 2 linked paths to /build/source
  251. 53.10 s > Extracted 19 files to /build/source in 0.57s
  252. 53.10 s > ------------
  253. 53.10 s > Nextest run ID 082ac841-72bd-4af5-90d7-2c6c7e09c036 with nextest profile: ci_gammaloop
  254. 53.10 s > Starting 421 tests across 3 binaries (31 tests skipped, including 30 tests via profile.ci_gammaloop.default-filter)
  255. 53.10 s > FAIL [ 0.087s] (366/421) gammalooprs utils::test_utils::normalization
  256. 53.10 s > stdout ---
  257. 53.10 s >
  258. 53.10 s > running 1 test
  259. 53.10 s > ━━━━━━━━━━━━━━━━━━━━━━━━━━━━━━━ Snapshot Summary ━━━━━━━━━━━━━━━━━━━━━━━━━━━━━━━
  260. 53.10 s > Snapshot: normalization-2
  261. 53.10 s > Source: crates/gammalooprs/src/utils/test_utils.rs:44
  262. 53.10 s > ────────────────────────────────────────────────────────────────────────────────
  263. 53.10 s > Expression: b.to_canonical_string()
  264. 53.10 s > ────────────────────────────────────────────────────────────────────────────────
  265. 53.10 s > -old snapshot
  266. 53.10 s > +new results
  267. 53.10 s > ────────────┬───────────────────────────────────────────────────────────────────
  268. 53.10 s > 1 │-gammalooprs::{spenso::rank1,spenso::tensor}::Q(1,spenso::{}::cind(1))
  269. 53.10 s > 1 │+gammalooprs::{spenso::rank1,spenso::tensor,spenso::tensor-label:q}::Q(1,spenso::{}::cind(1))
  270. 53.10 s > ────────────┴───────────────────────────────────────────────────────────────────
  271. 53.10 s > To update snapshots run `cargo insta review`
  272. 53.10 s > Stopped on the first failure. Run `cargo insta test` to run all snapshots.
  273. 53.10 s > test utils::test_utils::normalization ... FAILED
  274. 53.10 s >
  275. 53.10 s > failures:
  276. 53.10 s >
  277. 53.10 s > failures:
  278. 53.10 s > utils::test_utils::normalization
  279. 53.10 s >
  280. 53.10 s > test result: FAILED. 0 passed; 1 failed; 0 ignored; 0 measured; 445 filtered out; finished in 0.08s
  281. 53.10 s >
  282. 53.10 s > stderr ---
  283. 53.10 s >
  284. 53.10 s > thread 'utils::test_utils::normalization' (2235) panicked at /nix/store/c7lwckzlfrfsdw1ay0aqz4dpc2j7ry8d-vendor-cargo-deps/c19b7c6f923b580ac259164a89f2577984ad5ab09ee9d583b888f934adbbe8d0/insta-1.47.2/src/runtime.rs:719:13:
  285. 53.10 s > snapshot assertion for 'normalization-2' failed in line 44
  286. 53.10 s > stack backtrace:
  287. 53.10 s > 0: __rustc::rust_begin_unwind
  288. 53.10 s > 1: core::panicking::panic_fmt
  289. 53.10 s > 2: insta::runtime::assert_snapshot
  290. 53.10 s > 3: gammalooprs::utils::test_utils::normalization
  291. 53.10 s > 4: <gammalooprs::utils::test_utils::normalization::{closure#0} as core::ops::function::FnOnce<()>>::call_once
  292. 53.10 s > note: Some details are omitted, run with `RUST_BACKTRACE=full` for a verbose backtrace.
  293. 53.10 s >
  294. 53.10 s > ------------
  295. 53.10 s > Summary [ 7.468s] 421 tests run: 420 passed, 1 failed, 31 skipped
  296. 53.10 s > FAIL [ 0.087s] (366/421) gammalooprs utils::test_utils::normalization
  297. 53.10 s > stdout ---
  298. 53.10 s >
  299. 53.10 s > running 1 test
  300. 53.10 s > ━━━━━━━━━━━━━━━━━━━━━━━━━━━━━━━ Snapshot Summary ━━━━━━━━━━━━━━━━━━━━━━━━━━━━━━━
  301. 53.10 s > Snapshot: normalization-2
  302. 53.10 s > Source: crates/gammalooprs/src/utils/test_utils.rs:44
  303. 53.10 s > ────────────────────────────────────────────────────────────────────────────────
  304. 53.10 s > Expression: b.to_canonical_string()
  305. 53.10 s > ────────────────────────────────────────────────────────────────────────────────
  306. 53.10 s > -old snapshot
  307. 53.10 s > +new results
  308. 53.10 s > ────────────┬───────────────────────────────────────────────────────────────────
  309. 53.10 s > 1 │-gammalooprs::{spenso::rank1,spenso::tensor}::Q(1,spenso::{}::cind(1))
  310. 53.10 s > 1 │+gammalooprs::{spenso::rank1,spenso::tensor,spenso::tensor-label:q}::Q(1,spenso::{}::cind(1))
  311. 53.10 s > ────────────┴───────────────────────────────────────────────────────────────────
  312. 53.10 s > To update snapshots run `cargo insta review`
  313. 53.10 s > Stopped on the first failure. Run `cargo insta test` to run all snapshots.
  314. 53.10 s > test utils::test_utils::normalization ... FAILED
  315. 53.10 s >
  316. 53.10 s > failures:
  317. 53.10 s >
  318. 53.10 s > failures:
  319. 53.10 s > utils::test_utils::normalization
  320. 53.10 s >
  321. 53.10 s > test result: FAILED. 0 passed; 1 failed; 0 ignored; 0 measured; 445 filtered out; finished in 0.08s
  322. 53.10 s >
  323. 53.10 s > stderr ---
  324. 53.10 s >
  325. 53.10 s > thread 'utils::test_utils::normalization' (2235) panicked at /nix/store/c7lwckzlfrfsdw1ay0aqz4dpc2j7ry8d-vendor-cargo-deps/c19b7c6f923b580ac259164a89f2577984ad5ab09ee9d583b888f934adbbe8d0/insta-1.47.2/src/runtime.rs:719:13:
  326. 53.10 s > snapshot assertion for 'normalization-2' failed in line 44
  327. 53.10 s > stack backtrace:
  328. 53.10 s > 0: __rustc::rust_begin_unwind
  329. 53.10 s > 1: core::panicking::panic_fmt
  330. 53.10 s > 2: insta::runtime::assert_snapshot
  331. 53.10 s > 3: gammalooprs::utils::test_utils::normalization
  332. 53.10 s > 4: <gammalooprs::utils::test_utils::normalization::{closure#0} as core::ops::function::FnOnce<()>>::call_once
  333. 53.10 s > note: Some details are omitted, run with `RUST_BACKTRACE=full` for a verbose backtrace.
  334. 53.10 s >
  335. 53.10 s > error: test run failed
  336. 53.10 s >
  337. 53.10 s > ========== nextest test summary ==========
  338. 53.10 s > report: target/nextest/ci_gammaloop/junit.xml
  339. 53.10 s > tests: 421, failures: 1, errors: 0
  340. 53.10 s >
  341. 53.10 s > 1. gammalooprs::utils::test_utils::normalization
  342. 53.10 s > failure: test failure with exit code 101
  343. 53.10 s > thread 'utils::test_utils::normalization' (2235) panicked at /nix/store/c7lwckzlfrfsdw1ay0aqz4dpc2j7ry8d-vendor-cargo-deps/c19b7c6f923b580ac259164a89f2577984ad5ab09ee9d583b888f934adbbe8d0/insta-1.47.2/src/runtime.rs:719:13:
  344. 53.10 s > snapshot assertion for 'normalization-2' failed in line 44
  345. 53.10 s > stack backtrace:
  346. 53.10 s > 0: __rustc::rust_begin_unwind
  347. 53.10 s > 1: core::panicking::panic_fmt
  348. 53.10 s > 2: insta::runtime::assert_snapshot
  349. 53.10 s > 3: gammalooprs::utils::test_utils::normalization
  350. 53.10 s > 4: <gammalooprs::utils::test_utils::normalization::{closure#0} as core::ops::function::FnOnce<()>>::call_once
  351. 53.10 s > note: Some details are omitted, run with `RUST_BACKTRACE=full` for a verbose backtrace.
  352. 53.10 s > system-out
  353. 53.10 s > running 1 test
  354. 53.10 s > ━━━━━━━━━━━━━━━━━━━━━━━━━━━━━━━ Snapshot Summary ━━━━━━━━━━━━━━━━━━━━━━━━━━━━━━━
  355. 53.10 s > Snapshot: normalization-2
  356. 53.10 s > Source: crates/gammalooprs/src/utils/test_utils.rs:44
  357. 53.10 s > ────────────────────────────────────────────────────────────────────────────────
  358. 53.10 s > Expression: b.to_canonical_string()
  359. 53.10 s > ────────────────────────────────────────────────────────────────────────────────
  360. 53.10 s > -old snapshot
  361. 53.10 s > +new results
  362. 53.10 s > ────────────┬───────────────────────────────────────────────────────────────────
  363. 53.10 s > 1 │-gammalooprs::{spenso::rank1,spenso::tensor}::Q(1,spenso::{}::cind(1))
  364. 53.10 s > 1 │+gammalooprs::{spenso::rank1,spenso::tensor,spenso::tensor-label:q}::Q(1,spenso::{}::cind(1))
  365. 53.10 s > ────────────┴───────────────────────────────────────────────────────────────────
  366. 53.10 s > To update snapshots run `cargo insta review`
  367. 53.10 s > Stopped on the first failure. Run `cargo insta test` to run all snapshots.
  368. 53.10 s > test utils::test_utils::normalization ... FAILED
  369. 53.10 s >
  370. 53.10 s > failures:
  371. 53.10 s >
  372. 53.10 s > failures:
  373. 53.10 s > utils::test_utils::normalization
  374. 53.10 s >
  375. 53.10 s > test result: FAILED. 0 passed; 1 failed; 0 ignored; 0 measured; 445 filtered out; finished in 0.08s
  376. 53.10 s > system-err
  377. 53.10 s > thread 'utils::test_utils::normalization' (2235) panicked at /nix/store/c7lwckzlfrfsdw1ay0aqz4dpc2j7ry8d-vendor-cargo-deps/c19b7c6f923b580ac259164a89f2577984ad5ab09ee9d583b888f934adbbe8d0/insta-1.47.2/src/runtime.rs:719:13:
  378. 53.10 s > snapshot assertion for 'normalization-2' failed in line 44
  379. 53.10 s > stack backtrace:
  380. 53.10 s > 0: __rustc::rust_begin_unwind
  381. 53.10 s > 1: core::panicking::panic_fmt
  382. 53.10 s > 2: insta::runtime::assert_snapshot
  383. 53.10 s > 3: gammalooprs::utils::test_utils::normalization
  384. 53.10 s > 4: <gammalooprs::utils::test_utils::normalization::{closure#0} as core::ops::function::FnOnce<()>>::call_once
  385. 53.10 s > note: Some details are omitted, run with `RUST_BACKTRACE=full` for a verbose backtrace.
  386. 53.10 s > =========================================
  387. 53.10 s For full logs, run:
  388. 53.10 s nix log /nix/store/l52j9zy411yz62lvl4219gkr5z2l9zhq-gammaloop-nextest-core.drv
  389. 53.26 s [1 built (1 failed), 5 cRun failed.