1. 0.26 s $ /nix/store/9ypz3flqsrl5xl495mm8h645gadjsxi1-coreutils-9.11/bin/timeout --kill-after=15s 7200s /nix/store/23zk8sgzamrbmj1fday15szf7f2279s8-nix-2.34.7/bin/nix --extra-experimental-features nix-command --extra-experimental-features flakes --log-format internal-json build --no-link --print-out-paths git+https://github.com/alphal00p/gammaloop?ref=feynkit&rev=e9981d2c63b660b3266d76a303cd6402a434139b&shallow=1#packages.x86_64-linux.crate-deps-gammalooprs --print-build-logs
  2. 13.44 s
  3. 15.65 s Building /nix/store/3k1kdkiffq3l1y98zyrkzv3i9v7jpl2m-gammaloop-crate-feynkit-generator-dependency-deps-0.1.0.drv
  4. 15.72 s Building /nix/store/s5abv6is16yq9hq4ma0fyhfqfa339dmd-gammaloop-crate-spenso-hep-lib-dependency-deps-0.1.0.drv
  5. 15.74 s [gammaloop-crate-feynkit-generator-dependency-deps] Phase: unpackPhase
  6. 15.74 s [gammaloop-crate-feynkit-generator-dependency-deps] unpacking source archive /nix/store/5hhfznhaz559mdciig2kxdd3dr6jh3d5-source
  7. 15.79 s [gammaloop-crate-feynkit-generator-dependency-deps] source root is source
  8. 15.80 s [gammaloop-crate-feynkit-generator-dependency-deps] Phase: patchPhase
  9. 15.81 s [gammaloop-crate-spenso-hep-lib-dependency-deps] Phase: unpackPhase
  10. 15.81 s [gammaloop-crate-spenso-hep-lib-dependency-deps] unpacking source archive /nix/store/q7lrx207xd1dlv7ha2zhy3qckh8iq0q2-source
  11. 15.88 s [gammaloop-crate-spenso-hep-lib-dependency-deps] source root is source
  12. 15.89 s [gammaloop-crate-spenso-hep-lib-dependency-deps] Phase: patchPhase
  13. 15.90 s [gammaloop-crate-feynkit-generator-dependency-deps] Executing configureCargoCommonVars
  14. 15.90 s [gammaloop-crate-feynkit-generator-dependency-deps] copying cargo artifacts from /nix/store/ahk8mdy09k3ywnajkkr992kksmaf1j24-gammaloop-crate-feynkit-generator-dependency-inputs/target to target
  15. 15.90 s [gammaloop-crate-feynkit-generator-dependency-deps] will deep copy artifacts (instead of symlinking) as requested
  16. 16.01 s [gammaloop-crate-spenso-hep-lib-dependency-deps] Executing configureCargoCommonVars
  17. 16.01 s [gammaloop-crate-spenso-hep-lib-dependency-deps] copying cargo artifacts from /nix/store/ckfpwi67awl7nnkpi2h53q8hcaclg91i-gammaloop-crate-spenso-hep-lib-dependency-inputs/target to target
  18. 16.01 s [gammaloop-crate-spenso-hep-lib-dependency-deps] will deep copy artifacts (instead of symlinking) as requested
  19. 17.85 s [gammaloop-crate-spenso-hep-lib-dependency-deps] Phase: updateAutotoolsGnuConfigScriptsPhase
  20. 17.88 s [gammaloop-crate-spenso-hep-lib-dependency-deps] Phase: configurePhase
  21. 17.89 s [gammaloop-crate-spenso-hep-lib-dependency-deps] will append /build/source/.cargo-home/config.toml with contents of /nix/store/1sigmg52bb61pfngmk9k8wq5fz9r7bf1-vendor-cargo-deps/config.toml
  22. 17.89 s [gammaloop-crate-spenso-hep-lib-dependency-deps] default configurePhase, nothing to do
  23. 17.89 s [gammaloop-crate-spenso-hep-lib-dependency-deps] Phase: buildPhase
  24. 17.92 s [gammaloop-crate-spenso-hep-lib-dependency-deps] +++ command cargo --version
  25. 17.92 s [gammaloop-crate-spenso-hep-lib-dependency-deps] cargo 1.97.0 (c980f4866 2026-06-30)
  26. 17.93 s [gammaloop-crate-spenso-hep-lib-dependency-deps] +++ command cargo build --profile ci-optim --offline -p gammaloop-ci-consumer-spenso-hep-lib -p gammaloop-workspace-hack --features symbolica/tracing_max_level_info
  27. 18.11 s [gammaloop-crate-feynkit-generator-dependency-deps] Phase: updateAutotoolsGnuConfigScriptsPhase
  28. 18.14 s [gammaloop-crate-feynkit-generator-dependency-deps] Phase: configurePhase
  29. 18.15 s [gammaloop-crate-feynkit-generator-dependency-deps] will append /build/source/.cargo-home/config.toml with contents of /nix/store/1sigmg52bb61pfngmk9k8wq5fz9r7bf1-vendor-cargo-deps/config.toml
  30. 18.15 s [gammaloop-crate-feynkit-generator-dependency-deps] default configurePhase, nothing to do
  31. 18.15 s [gammaloop-crate-feynkit-generator-dependency-deps] Phase: buildPhase
  32. 18.18 s [gammaloop-crate-feynkit-generator-dependency-deps] +++ command cargo --version
  33. 18.19 s [gammaloop-crate-feynkit-generator-dependency-deps] cargo 1.97.0 (c980f4866 2026-06-30)
  34. 18.19 s [gammaloop-crate-feynkit-generator-dependency-deps] +++ command cargo build --profile ci-optim --offline -p gammaloop-ci-consumer-feynkit-generator -p gammaloop-workspace-hack --features symbolica/tracing_max_level_info
  35. 18.22 s [gammaloop-crate-spenso-hep-lib-dependency-deps] Compiling spenso-hep-lib v0.1.7 (/build/source/crates/spenso-hep-lib)
  36. 18.46 s [gammaloop-crate-spenso-hep-lib-dependency-deps] Compiling gammaloop-ci-consumer-spenso-hep-lib v0.1.0 (/build/source/crates/gammaloop-ci-consumer-spenso-hep-lib)
  37. 18.48 s [gammaloop-crate-feynkit-generator-dependency-deps] Compiling spenso-macros v0.3.2 (/build/source/crates/spenso-macros)
  38. 18.48 s [gammaloop-crate-feynkit-generator-dependency-deps] Compiling spenso v0.6.0 (/build/source/crates/spenso)
  39. 18.49 s [gammaloop-crate-feynkit-generator-dependency-deps] Compiling idenso v0.3.0 (/build/source/crates/idenso)
  40. 18.82 s [gammaloop-crate-spenso-hep-lib-dependency-deps] Finished `ci-optim` profile [optimized] target(s) in 0.88s
  41. 18.85 s [gammaloop-crate-feynkit-generator-dependency-deps] Compiling feynkit-generator v0.1.0 (/build/source/crates/feynkit-generator)
  42. 18.92 s [gammaloop-crate-feynkit-generator-dependency-deps] error[E0433]: cannot find `network` in `spenso`
  43. 18.92 s [gammaloop-crate-feynkit-generator-dependency-deps] --> crates/feynkit-generator/src/generation.rs:27:5
  44. 18.92 s [gammaloop-crate-feynkit-generator-dependency-deps] |
  45. 18.92 s [gammaloop-crate-feynkit-generator-dependency-deps] 27 | network::library::symbolic::ETS,
  46. 18.92 s [gammaloop-crate-feynkit-generator-dependency-deps] | ^^^^^^^ could not find `network` in `spenso`
  47. 18.92 s [gammaloop-crate-feynkit-generator-dependency-deps]
  48. 18.92 s [gammaloop-crate-feynkit-generator-dependency-deps] error[E0433]: cannot find `structure` in `spenso`
  49. 18.92 s [gammaloop-crate-feynkit-generator-dependency-deps] --> crates/feynkit-generator/src/generation.rs:28:5
  50. 18.92 s [gammaloop-crate-feynkit-generator-dependency-deps] |
  51. 18.92 s [gammaloop-crate-feynkit-generator-dependency-deps] 28 | structure::representation::{Minkowski, RepName},
  52. 18.92 s [gammaloop-crate-feynkit-generator-dependency-deps] | ^^^^^^^^^ could not find `structure` in `spenso`
  53. 18.92 s [gammaloop-crate-feynkit-generator-dependency-deps]
  54. 18.92 s [gammaloop-crate-feynkit-generator-dependency-deps] error[E0432]: unresolved imports `idenso::color`, `idenso::dirac`, `idenso::epsilon`, `idenso::representations`
  55. 18.92 s [gammaloop-crate-feynkit-generator-dependency-deps] --> crates/feynkit-generator/src/generation.rs:16:5
  56. 18.92 s [gammaloop-crate-feynkit-generator-dependency-deps] |
  57. 18.92 s [gammaloop-crate-feynkit-generator-dependency-deps] 16 | color::CS,
  58. 18.92 s [gammaloop-crate-feynkit-generator-dependency-deps] | ^^^^^ could not find `color` in `idenso`
  59. 18.92 s [gammaloop-crate-feynkit-generator-dependency-deps] 17 | dirac::AGS,
  60. 18.92 s [gammaloop-crate-feynkit-generator-dependency-deps] | ^^^^^ could not find `dirac` in `idenso`
  61. 18.92 s [gammaloop-crate-feynkit-generator-dependency-deps] 18 | epsilon::EPSILON_SYMBOL,
  62. 18.92 s [gammaloop-crate-feynkit-generator-dependency-deps] | ^^^^^^^ could not find `epsilon` in `idenso`
  63. 18.92 s [gammaloop-crate-feynkit-generator-dependency-deps] 19 | representations::{Bispinor, ColorAdjoint, ColorFundamental, ColorSextet},
  64. 18.92 s [gammaloop-crate-feynkit-generator-dependency-deps] | ^^^^^^^^^^^^^^^ could not find `representations` in `idenso`
  65. 18.92 s [gammaloop-crate-feynkit-generator-dependency-deps]
  66. 18.96 s [gammaloop-crate-spenso-hep-lib-dependency-deps] warning: the following packages contain code that will be rejected by a future version of Rust: proc-macro-error2 v2.0.1
  67. 18.96 s [gammaloop-crate-spenso-hep-lib-dependency-deps] note: to see what the problems were, use the option `--future-incompat-report`, or run `cargo report future-incompatibilities --id 1`
  68. 19.39 s [gammaloop-crate-spenso-hep-lib-dependency-deps] Phase: installPhase
  69. 19.40 s [gammaloop-crate-spenso-hep-lib-dependency-deps] linking previous artifacts /nix/store/ckfpwi67awl7nnkpi2h53q8hcaclg91i-gammaloop-crate-spenso-hep-lib-dependency-inputs to /nix/store/9qxy7ix2ny5h3faqlxllc1r8hzg52ha4-gammaloop-crate-spenso-hep-lib-dependency-deps-0.1.0/target.tar.zst
  70. 19.43 s [gammaloop-crate-spenso-hep-lib-dependency-deps] /*stdin*\ : 16.43% ( 980 KiB => 161 KiB, /nix/store/9qxy7ix2ny5h3faqlxllc1r8hzg52ha4-gammaloop-crate-spenso-hep-lib-dependency-deps-0.1.0/target.tar.zst)
  71. 19.43 s [gammaloop-crate-spenso-hep-lib-dependency-deps] Phase: fixupPhase
  72. 19.53 s [gammaloop-crate-feynkit-generator-dependency-deps] Some errors have detailed explanations: E0432, E0433.
  73. 19.53 s [gammaloop-crate-feynkit-generator-dependency-deps] For more information about an error, try `rustc --explain E0432`.
  74. 19.54 s [gammaloop-crate-feynkit-generator-dependency-deps] error: could not compile `feynkit-generator` (lib) due to 3 previous errors
  75. 19.82 s Progress: 0 of 7 built (1 building, 1 failed)
  76. 19.82 s Failed to build gammaloop-crate-feynkit-generator-dependency-deps after 4.1s
  77. 19.83 s error: Cannot build '/nix/store/3k1kdkiffq3l1y98zyrkzv3i9v7jpl2m-gammaloop-crate-feynkit-generator-dependency-deps-0.1.0.drv'.
  78. 19.83 s Reason: builder failed with exit code 101.
  79. 19.83 s Output paths:
  80. 19.83 s /nix/store/zp87zg41zcb8kxd2x2148yhcs3758p53-gammaloop-crate-feynkit-generator-dependency-deps-0.1.0
  81. 19.83 s Last 46 log lines:
  82. 19.83 s > Running phase: unpackPhase
  83. 19.83 s > unpacking source archive /nix/store/5hhfznhaz559mdciig2kxdd3dr6jh3d5-source
  84. 19.83 s > source root is source
  85. 19.83 s > Running phase: patchPhase
  86. 19.83 s > Executing configureCargoCommonVars
  87. 19.83 s > copying cargo artifacts from /nix/store/ahk8mdy09k3ywnajkkr992kksmaf1j24-gammaloop-crate-feynkit-generator-dependency-inputs/target to target
  88. 19.83 s > will deep copy artifacts (instead of symlinking) as requested
  89. 19.83 s > Running phase: updateAutotoolsGnuConfigScriptsPhase
  90. 19.83 s > Running phase: configurePhase
  91. 19.83 s > will append /build/source/.cargo-home/config.toml with contents of /nix/store/1sigmg52bb61pfngmk9k8wq5fz9r7bf1-vendor-cargo-deps/config.toml
  92. 19.83 s > default configurePhase, nothing to do
  93. 19.83 s > Running phase: buildPhase
  94. 19.83 s > +++ command cargo --version
  95. 19.83 s > cargo 1.97.0 (c980f4866 2026-06-30)
  96. 19.83 s > +++ command cargo build --profile ci-optim --offline -p gammaloop-ci-consumer-feynkit-generator -p gammaloop-workspace-hack --features symbolica/tracing_max_level_info
  97. 19.83 s > Compiling spenso-macros v0.3.2 (/build/source/crates/spenso-macros)
  98. 19.83 s > Compiling spenso v0.6.0 (/build/source/crates/spenso)
  99. 19.83 s > Compiling idenso v0.3.0 (/build/source/crates/idenso)
  100. 19.83 s > Compiling feynkit-generator v0.1.0 (/build/source/crates/feynkit-generator)
  101. 19.83 s > error[E0433]: cannot find `network` in `spenso`
  102. 19.83 s > --> crates/feynkit-generator/src/generation.rs:27:5
  103. 19.83 s > |
  104. 19.83 s > 27 | network::library::symbolic::ETS,
  105. 19.83 s > | ^^^^^^^ could not find `network` in `spenso`
  106. 19.83 s >
  107. 19.83 s > error[E0433]: cannot find `structure` in `spenso`
  108. 19.83 s > --> crates/feynkit-generator/src/generation.rs:28:5
  109. 19.83 s > |
  110. 19.83 s > 28 | structure::representation::{Minkowski, RepName},
  111. 19.83 s > | ^^^^^^^^^ could not find `structure` in `spenso`
  112. 19.83 s >
  113. 19.83 s > error[E0432]: unresolved imports `idenso::color`, `idenso::dirac`, `idenso::epsilon`, `idenso::representations`
  114. 19.83 s > --> crates/feynkit-generator/src/generation.rs:16:5
  115. 19.83 s > |
  116. 19.83 s > 16 | color::CS,
  117. 19.83 s > | ^^^^^ could not find `color` in `idenso`
  118. 19.83 s > 17 | dirac::AGS,
  119. 19.83 s > | ^^^^^ could not find `dirac` in `idenso`
  120. 19.83 s > 18 | epsilon::EPSILON_SYMBOL,
  121. 19.83 s > | ^^^^^^^ could not find `epsilon` in `idenso`
  122. 19.83 s > 19 | representations::{Bispinor, ColorAdjoint, ColorFundamental, ColorSextet},
  123. 19.83 s > | ^^^^^^^^^^^^^^^ could not find `representations` in `idenso`
  124. 19.83 s >
  125. 19.83 s > Some errors have detailed explanations: E0432, E0433.
  126. 19.83 s > For more information about an error, try `rustc --explain E0432`.
  127. 19.83 s > error: could not compile `feynkit-generator` (lib) due to 3 previous errors
  128. 19.83 s For full logs, run:
  129. 19.83 s nix log /nix/store/3k1kdkiffq3l1y98zyrkzv3i9v7jpl2m-gammaloop-crate-feynkit-generator-dependency-deps-0.1.0.drv
  130. 19.83 s error: Cannot build '/nix/store/ranqax6mx0bypw82ji00sdmf6wg9vk6p-gammaloop-crate-gammalooprs-dependency-deps-inputs.drv'.
  131. 19.83 s Reason: 1 dependency failed.
  132. 19.83 s Output paths:
  133. 19.83 s /nix/store/wia8dkping23a7lhcilvgsfc5h9dam01-gammaloop-crate-gammalooprs-dependency-deps-inputs
  134. 19.83 s error: Cannot build '/nix/store/qyg8c8jwal5bq90x4i497jmb2p8f00zj-gammaloop-crate-gammalooprs-dependency-inputs.drv'.
  135. 19.83 s Reason: 1 dependency failed.
  136. 19.83 s Output paths:
  137. 19.83 s /nix/store/b9pfp40x7dbgp7a7l7x80vcjkn08d0mf-gammaloop-crate-gammalooprs-dependency-inputs
  138. 19.83 s warning: killing stray builder process 311615 ()...
  139. 19.83 s warning: killing stray builder process 312375 ()...
  140. 19.83 s warning: killing stray builder process 312376 ()...
  141. 19.83 s warning: killing stray builder process 312387 ()...
  142. 20.19 s Built gammaloop-crate-spenso-hep-lib-dependency-deps in 4.4s
  143. 20.19 s error: Build failed due to failed dependency
  144. 20.19 s error: Cannot build '/nix/store/aajmbkk7d2bwb2g75xy505wfrnz22aik-gammaloop-crate-gammalooprs-dependency-deps-0.1.0.drv'.
  145. 20.19 s Reason: 1 dependency failed.
  146. 20.19 s Output paths:
  147. 20.19 s /nix/store/xwl1y9ryjyvi5ckns45zpa4dhcpibym2-gammaloop-crate-gammalooprs-dependency-deps-0.1.0
  148. 20.19 s error: Build failed due to failed dependency
  149. 20.19 s error: Cannot build '/nix/store/5pv21p428ymhizqbss2yiqk17md55a2i-nix-ci-artifact-barrier-crate-deps-gammalooprs.drv'.
  150. 20.19 s Reason: 1 dependency failed.
  151. 20.19 s Output paths:
  152. 20.19 s /nix/store/g9dawy8s2vz2s9hagijzp0h7lgin0v1q-nix-ci-artifact-barrier-crate-deps-gammalooprs
  153. 20.19 s Build failed due to failed dependency
  154. 20.26 s Build failed.