1. 0.43 s $ /nix/store/9ypz3flqsrl5xl495mm8h645gadjsxi1-coreutils-9.11/bin/timeout --kill-after=15s 7200s /nix/store/23zk8sgzamrbmj1fday15szf7f2279s8-nix-2.34.7/bin/nix --extra-experimental-features nix-command --extra-experimental-features flakes --log-format internal-json build --no-link --print-out-paths git+https://github.com/alphal00p/gammaloop?ref=feynkit&rev=e9981d2c63b660b3266d76a303cd6402a434139b&shallow=1#packages.x86_64-linux.crate-test-dependencies-feynkit-generator --print-build-logs
  2. 2.25 s error (ignored): SQLite database '/var/cache/nix-ci-worker/eval-cache-v6/e19994902db26c000449ad5a1652acb592a94287570fdc1b256e2dc6139a3953.sqlite' is busy
  3. 5.44 s
  4. 6.36 s Building /nix/store/sx5yxc2ksbdwbpqsxkpwld82hr5k4097-gammaloop-crate-test-dependencies-4f00f4b0073ce06e-inputs.drv
  5. 20.86 s [gammaloop-crate-test-dependencies-4f00f4b0073ce06e-inputs:post-build] Uploading to the NixCI cache: /nix/store/9lzcc2sbpwvfgjg5j0wjiinvhakhaa3j-gammaloop-crate-test-dependencies-4f00f4b0073ce06e-inputs
  6. 21.38 s [gammaloop-crate-test-dependencies-4f00f4b0073ce06e-inputs:post-build] warning: 'warn-short-path-literals' is deprecated, use 'lint-short-path-literals = ignore' instead
  7. 21.48 s [gammaloop-crate-test-dependencies-4f00f4b0073ce06e-inputs:post-build] copying 1 paths...
  8. 21.48 s [gammaloop-crate-test-dependencies-4f00f4b0073ce06e-inputs:post-build] copying path '/nix/store/9lzcc2sbpwvfgjg5j0wjiinvhakhaa3j-gammaloop-crate-test-dependencies-4f00f4b0073ce06e-inputs' to 'https://cache.nix-ci.com'...
  9. 233.82 s [gammaloop-crate-test-dependencies-4f00f4b0073ce06e-inputs:post-build] warning: 'warn-short-path-literals' is deprecated, use 'lint-short-path-literals = ignore' instead
  10. 234.30 s [gammaloop-crate-test-dependencies-4f00f4b0073ce06e-inputs:post-build] copying 1 paths...
  11. 234.30 s [gammaloop-crate-test-dependencies-4f00f4b0073ce06e-inputs:post-build] copying path '/nix/store/sx5yxc2ksbdwbpqsxkpwld82hr5k4097-gammaloop-crate-test-dependencies-4f00f4b0073ce06e-inputs.drv' to 'https://cache.nix-ci.com'...
  12. 234.75 s Uploaded gammaloop-crate-test-dependencies-4f00f4b0073ce06e-inputs in 3m33s
  13. 234.76 s Progress: 1 of 4 built
  14. 234.76 s Built gammaloop-crate-test-dependencies-4f00f4b0073ce06e-inputs in 3m48s
  15. 234.87 s Building /nix/store/hi9dlkfda2h9qsb9sgy84a17r66rvrxn-gammaloop-crate-test-dependencies-4f00f4b0073ce06e-deps-0.1.0.drv
  16. 235.05 s [gammaloop-crate-test-dependencies-4f00f4b0073ce06e-deps] Phase: unpackPhase
  17. 235.06 s [gammaloop-crate-test-dependencies-4f00f4b0073ce06e-deps] unpacking source archive /nix/store/vksqb783ssfkbr0smqy8im6c2r1fpqhf-source
  18. 235.50 s [gammaloop-crate-test-dependencies-4f00f4b0073ce06e-deps] source root is source
  19. 235.55 s [gammaloop-crate-test-dependencies-4f00f4b0073ce06e-deps] Phase: patchPhase
  20. 235.93 s [gammaloop-crate-test-dependencies-4f00f4b0073ce06e-deps] Executing configureCargoCommonVars
  21. 235.94 s [gammaloop-crate-test-dependencies-4f00f4b0073ce06e-deps] copying cargo artifacts from /nix/store/9lzcc2sbpwvfgjg5j0wjiinvhakhaa3j-gammaloop-crate-test-dependencies-4f00f4b0073ce06e-inputs/target to target
  22. 235.94 s [gammaloop-crate-test-dependencies-4f00f4b0073ce06e-deps] will deep copy artifacts (instead of symlinking) as requested
  23. 237.22 s [gammaloop-crate-test-dependencies-4f00f4b0073ce06e-deps] Phase: updateAutotoolsGnuConfigScriptsPhase
  24. 237.26 s [gammaloop-crate-test-dependencies-4f00f4b0073ce06e-deps] Phase: configurePhase
  25. 237.26 s [gammaloop-crate-test-dependencies-4f00f4b0073ce06e-deps] will append /build/source/.cargo-home/config.toml with contents of /nix/store/1sigmg52bb61pfngmk9k8wq5fz9r7bf1-vendor-cargo-deps/config.toml
  26. 237.27 s [gammaloop-crate-test-dependencies-4f00f4b0073ce06e-deps] default configurePhase, nothing to do
  27. 237.27 s [gammaloop-crate-test-dependencies-4f00f4b0073ce06e-deps] Phase: buildPhase
  28. 237.28 s [gammaloop-crate-test-dependencies-4f00f4b0073ce06e-deps] +++ command cargo --version
  29. 237.29 s [gammaloop-crate-test-dependencies-4f00f4b0073ce06e-deps] cargo 1.97.0 (c980f4866 2026-06-30)
  30. 237.29 s [gammaloop-crate-test-dependencies-4f00f4b0073ce06e-deps] +++ command cargo build --profile ci-optim --offline -p gammaloop-ci-test-dependencies-4f00f4b0073ce06e -p gammaloop-workspace-hack --features linnet/bincode,linnet/drawing,linnet/serde,linnet/symbolica,symbolica/tracing_max_level_info --lib
  31. 237.91 s [gammaloop-crate-test-dependencies-4f00f4b0073ce06e-deps] Compiling spenso-macros v0.3.2 (/build/source/crates/spenso-macros)
  32. 238.20 s [gammaloop-crate-test-dependencies-4f00f4b0073ce06e-deps] Compiling spenso v0.6.0 (/build/source/crates/spenso)
  33. 238.23 s [gammaloop-crate-test-dependencies-4f00f4b0073ce06e-deps] Compiling idenso v0.3.0 (/build/source/crates/idenso)
  34. 238.26 s [gammaloop-crate-test-dependencies-4f00f4b0073ce06e-deps] Compiling feynkit-generator v0.1.0 (/build/source/crates/feynkit-generator)
  35. 238.36 s [gammaloop-crate-test-dependencies-4f00f4b0073ce06e-deps] error[E0433]: cannot find `network` in `spenso`
  36. 238.36 s [gammaloop-crate-test-dependencies-4f00f4b0073ce06e-deps] --> crates/feynkit-generator/src/generation.rs:27:5
  37. 238.36 s [gammaloop-crate-test-dependencies-4f00f4b0073ce06e-deps] |
  38. 238.36 s [gammaloop-crate-test-dependencies-4f00f4b0073ce06e-deps] 27 | network::library::symbolic::ETS,
  39. 238.36 s [gammaloop-crate-test-dependencies-4f00f4b0073ce06e-deps] | ^^^^^^^ could not find `network` in `spenso`
  40. 238.36 s [gammaloop-crate-test-dependencies-4f00f4b0073ce06e-deps]
  41. 238.36 s [gammaloop-crate-test-dependencies-4f00f4b0073ce06e-deps] error[E0433]: cannot find `structure` in `spenso`
  42. 238.36 s [gammaloop-crate-test-dependencies-4f00f4b0073ce06e-deps] --> crates/feynkit-generator/src/generation.rs:28:5
  43. 238.36 s [gammaloop-crate-test-dependencies-4f00f4b0073ce06e-deps] |
  44. 238.36 s [gammaloop-crate-test-dependencies-4f00f4b0073ce06e-deps] 28 | structure::representation::{Minkowski, RepName},
  45. 238.36 s [gammaloop-crate-test-dependencies-4f00f4b0073ce06e-deps] | ^^^^^^^^^ could not find `structure` in `spenso`
  46. 238.36 s [gammaloop-crate-test-dependencies-4f00f4b0073ce06e-deps]
  47. 238.36 s [gammaloop-crate-test-dependencies-4f00f4b0073ce06e-deps] error[E0432]: unresolved imports `idenso::color`, `idenso::dirac`, `idenso::epsilon`, `idenso::representations`
  48. 238.36 s [gammaloop-crate-test-dependencies-4f00f4b0073ce06e-deps] --> crates/feynkit-generator/src/generation.rs:16:5
  49. 238.36 s [gammaloop-crate-test-dependencies-4f00f4b0073ce06e-deps] |
  50. 238.36 s [gammaloop-crate-test-dependencies-4f00f4b0073ce06e-deps] 16 | color::CS,
  51. 238.36 s [gammaloop-crate-test-dependencies-4f00f4b0073ce06e-deps] | ^^^^^ could not find `color` in `idenso`
  52. 238.36 s [gammaloop-crate-test-dependencies-4f00f4b0073ce06e-deps] 17 | dirac::AGS,
  53. 238.36 s [gammaloop-crate-test-dependencies-4f00f4b0073ce06e-deps] | ^^^^^ could not find `dirac` in `idenso`
  54. 238.36 s [gammaloop-crate-test-dependencies-4f00f4b0073ce06e-deps] 18 | epsilon::EPSILON_SYMBOL,
  55. 238.36 s [gammaloop-crate-test-dependencies-4f00f4b0073ce06e-deps] | ^^^^^^^ could not find `epsilon` in `idenso`
  56. 238.36 s [gammaloop-crate-test-dependencies-4f00f4b0073ce06e-deps] 19 | representations::{Bispinor, ColorAdjoint, ColorFundamental, ColorSextet},
  57. 238.36 s [gammaloop-crate-test-dependencies-4f00f4b0073ce06e-deps] | ^^^^^^^^^^^^^^^ could not find `representations` in `idenso`
  58. 238.36 s [gammaloop-crate-test-dependencies-4f00f4b0073ce06e-deps]
  59. 239.08 s [gammaloop-crate-test-dependencies-4f00f4b0073ce06e-deps] Some errors have detailed explanations: E0432, E0433.
  60. 239.09 s [gammaloop-crate-test-dependencies-4f00f4b0073ce06e-deps] For more information about an error, try `rustc --explain E0432`.
  61. 239.09 s [gammaloop-crate-test-dependencies-4f00f4b0073ce06e-deps] error: could not compile `feynkit-generator` (lib) due to 3 previous errors
  62. 239.45 s Progress: 1 of 3 built (1 failed)
  63. 239.45 s Failed to build gammaloop-crate-test-dependencies-4f00f4b0073ce06e-deps after 4.5s
  64. 239.45 s error: Cannot build '/nix/store/hi9dlkfda2h9qsb9sgy84a17r66rvrxn-gammaloop-crate-test-dependencies-4f00f4b0073ce06e-deps-0.1.0.drv'.
  65. 239.45 s Reason: builder failed with exit code 101.
  66. 239.45 s Output paths:
  67. 239.45 s /nix/store/v9ic4wza465r8y439mjkallk6cnkinx1-gammaloop-crate-test-dependencies-4f00f4b0073ce06e-deps-0.1.0
  68. 239.45 s Last 46 log lines:
  69. 239.45 s > Running phase: unpackPhase
  70. 239.45 s > unpacking source archive /nix/store/vksqb783ssfkbr0smqy8im6c2r1fpqhf-source
  71. 239.45 s > source root is source
  72. 239.45 s > Running phase: patchPhase
  73. 239.45 s > Executing configureCargoCommonVars
  74. 239.45 s > copying cargo artifacts from /nix/store/9lzcc2sbpwvfgjg5j0wjiinvhakhaa3j-gammaloop-crate-test-dependencies-4f00f4b0073ce06e-inputs/target to target
  75. 239.45 s > will deep copy artifacts (instead of symlinking) as requested
  76. 239.45 s > Running phase: updateAutotoolsGnuConfigScriptsPhase
  77. 239.45 s > Running phase: configurePhase
  78. 239.45 s > will append /build/source/.cargo-home/config.toml with contents of /nix/store/1sigmg52bb61pfngmk9k8wq5fz9r7bf1-vendor-cargo-deps/config.toml
  79. 239.45 s > default configurePhase, nothing to do
  80. 239.45 s > Running phase: buildPhase
  81. 239.45 s > +++ command cargo --version
  82. 239.45 s > cargo 1.97.0 (c980f4866 2026-06-30)
  83. 239.45 s > +++ command cargo build --profile ci-optim --offline -p gammaloop-ci-test-dependencies-4f00f4b0073ce06e -p gammaloop-workspace-hack --features linnet/bincode,linnet/drawing,linnet/serde,linnet/symbolica,symbolica/tracing_max_level_info --lib
  84. 239.45 s > Compiling spenso-macros v0.3.2 (/build/source/crates/spenso-macros)
  85. 239.45 s > Compiling spenso v0.6.0 (/build/source/crates/spenso)
  86. 239.45 s > Compiling idenso v0.3.0 (/build/source/crates/idenso)
  87. 239.45 s > Compiling feynkit-generator v0.1.0 (/build/source/crates/feynkit-generator)
  88. 239.45 s > error[E0433]: cannot find `network` in `spenso`
  89. 239.45 s > --> crates/feynkit-generator/src/generation.rs:27:5
  90. 239.45 s > |
  91. 239.45 s > 27 | network::library::symbolic::ETS,
  92. 239.45 s > | ^^^^^^^ could not find `network` in `spenso`
  93. 239.45 s >
  94. 239.45 s > error[E0433]: cannot find `structure` in `spenso`
  95. 239.45 s > --> crates/feynkit-generator/src/generation.rs:28:5
  96. 239.45 s > |
  97. 239.45 s > 28 | structure::representation::{Minkowski, RepName},
  98. 239.45 s > | ^^^^^^^^^ could not find `structure` in `spenso`
  99. 239.45 s >
  100. 239.45 s > error[E0432]: unresolved imports `idenso::color`, `idenso::dirac`, `idenso::epsilon`, `idenso::representations`
  101. 239.45 s > --> crates/feynkit-generator/src/generation.rs:16:5
  102. 239.45 s > |
  103. 239.45 s > 16 | color::CS,
  104. 239.45 s > | ^^^^^ could not find `color` in `idenso`
  105. 239.45 s > 17 | dirac::AGS,
  106. 239.45 s > | ^^^^^ could not find `dirac` in `idenso`
  107. 239.45 s > 18 | epsilon::EPSILON_SYMBOL,
  108. 239.45 s > | ^^^^^^^ could not find `epsilon` in `idenso`
  109. 239.45 s > 19 | representations::{Bispinor, ColorAdjoint, ColorFundamental, ColorSextet},
  110. 239.45 s > | ^^^^^^^^^^^^^^^ could not find `representations` in `idenso`
  111. 239.45 s >
  112. 239.45 s > Some errors have detailed explanations: E0432, E0433.
  113. 239.45 s > For more information about an error, try `rustc --explain E0432`.
  114. 239.45 s > error: could not compile `feynkit-generator` (lib) due to 3 previous errors
  115. 239.45 s For full logs, run:
  116. 239.45 s nix log /nix/store/hi9dlkfda2h9qsb9sgy84a17r66rvrxn-gammaloop-crate-test-dependencies-4f00f4b0073ce06e-deps-0.1.0.drv
  117. 239.45 s error: Cannot build '/nix/store/ynbqqinqg92w77alhigqiwm8l784m0f1-nix-ci-artifact-barrier-crate-test-dependencies-feynkit-generator.drv'.
  118. 239.45 s Reason: 1 dependency failed.
  119. 239.45 s Output paths:
  120. 239.45 s /nix/store/rfi9d3qy9vyssmxkrjsrag35vi2kcpkd-nix-ci-artifact-barrier-crate-test-dependencies-feynkit-generator
  121. 239.46 s Build failed due to failed dependency
  122. 239.52 s Build failed.